Pastebin launched a little side project called HostCabi.net, check it out ;-)Don't like ads? PRO users don't see any ads ;-)
Guest

Untitled

By: a guest on Nov 23rd, 2010  |  syntax: None  |  size: 15.19 KB  |  hits: 190  |  expires: Never
download  |  raw  |  embed  |  report abuse  |  print
Text below is selected. Please press Ctrl+C to copy to your clipboard. (⌘+C on Mac)
  1. ==> Building and installing package
  2. ==> Making package: mod_python 3.3.1-8 (Tue Nov 23 14:09:44 CET 2010)
  3. ==> Checking Runtime Dependencies...
  4. ==> Checking Buildtime Dependencies...
  5. ==> Retrieving Sources...
  6.   -> Found compile.patch
  7.   -> Found python-2.7.patch
  8. ==> Validating source files with md5sums...
  9.     compile.patch ... Passed
  10.     python-2.7.patch ... Passed
  11. ==> Extracting Sources...
  12. ==> Starting build()...
  13. A    mod_python-3.3.1
  14. A    mod_python-3.3.1/test
  15. A    mod_python-3.3.1/test/httpdconf.py
  16. A    mod_python-3.3.1/test/testconf.py.in
  17. A    mod_python-3.3.1/test/Makefile.in
  18. A    mod_python-3.3.1/test/htdocs
  19. A    mod_python-3.3.1/test/htdocs/psp_parser.psp
  20. A    mod_python-3.3.1/test/htdocs/psptest.psp
  21. A    mod_python-3.3.1/test/htdocs/ssi.shtml
  22. A    mod_python-3.3.1/test/htdocs/psptest_main.psp
  23. A    mod_python-3.3.1/test/htdocs/dummymodule.py
  24. A    mod_python-3.3.1/test/htdocs/subdir
  25. A    mod_python-3.3.1/test/htdocs/subdir/dummy.txt
  26. A    mod_python-3.3.1/test/htdocs/cgitest.py
  27. A    mod_python-3.3.1/test/htdocs/tests.py
  28. A    mod_python-3.3.1/test/htdocs/index.py
  29. A    mod_python-3.3.1/test/htdocs/psptest_fail.psp
  30. A    mod_python-3.3.1/test/conf
  31. A    mod_python-3.3.1/test/conf/mime.types
  32. A    mod_python-3.3.1/test/test.py
  33. A    mod_python-3.3.1/test/README
  34. A    mod_python-3.3.1/NOTICE
  35. A    mod_python-3.3.1/configure
  36. A    mod_python-3.3.1/LICENSE
  37. A    mod_python-3.3.1/Makefile.in
  38. A    mod_python-3.3.1/configure.in
  39. A    mod_python-3.3.1/src
  40. A    mod_python-3.3.1/src/Makefile.in
  41. A    mod_python-3.3.1/src/mod_python.vcproj
  42. A    mod_python-3.3.1/src/include
  43. A    mod_python-3.3.1/src/include/serverobject.h
  44. A    mod_python-3.3.1/src/include/_pspmodule.h
  45. A    mod_python-3.3.1/src/include/hlistobject.h
  46. A    mod_python-3.3.1/src/include/filterobject.h
  47. A    mod_python-3.3.1/src/include/util.h
  48. A    mod_python-3.3.1/src/include/psp_parser.h
  49. A    mod_python-3.3.1/src/include/tableobject.h
  50. A    mod_python-3.3.1/src/include/requestobject.h
  51. A    mod_python-3.3.1/src/include/mod_python.h
  52. A    mod_python-3.3.1/src/include/psp_flex.h
  53. A    mod_python-3.3.1/src/include/mpversion.h
  54. A    mod_python-3.3.1/src/include/hlist.h
  55. A    mod_python-3.3.1/src/include/connobject.h
  56. A    mod_python-3.3.1/src/include/mod_python.h.in
  57. A    mod_python-3.3.1/src/include/_apachemodule.h
  58. A    mod_python-3.3.1/src/include/psp_string.h
  59. A    mod_python-3.3.1/src/include/finfoobject.h
  60. A    mod_python-3.3.1/src/Version.rc
  61. A    mod_python-3.3.1/src/_pspmodule.c
  62. A    mod_python-3.3.1/src/hlistobject.c
  63. A    mod_python-3.3.1/src/filterobject.c
  64. A    mod_python-3.3.1/src/util.c
  65. A    mod_python-3.3.1/src/tableobject.c
  66. A    mod_python-3.3.1/src/psp_parser.c
  67. A    mod_python-3.3.1/src/requestobject.c
  68. A    mod_python-3.3.1/src/mod_python.c
  69. A    mod_python-3.3.1/src/hlist.c
  70. A    mod_python-3.3.1/src/connobject.c
  71. A    mod_python-3.3.1/src/_apachemodule.c
  72. A    mod_python-3.3.1/src/psp_parser.l
  73. A    mod_python-3.3.1/src/psp_string.c
  74. A    mod_python-3.3.1/src/finfoobject.c
  75. A    mod_python-3.3.1/src/serverobject.c
  76. A    mod_python-3.3.1/CREDITS
  77. A    mod_python-3.3.1/README
  78. A    mod_python-3.3.1/dist
  79. A    mod_python-3.3.1/dist/build_installer.bat
  80. A    mod_python-3.3.1/dist/Makefile.in
  81. A    mod_python-3.3.1/dist/win32_postinstall.py
  82. A    mod_python-3.3.1/dist/setup.py.in
  83. A    mod_python-3.3.1/dist/README
  84. A    mod_python-3.3.1/Doc
  85. A    mod_python-3.3.1/Doc/modpython.tex
  86. A    mod_python-3.3.1/Doc/release-instructions.txt
  87. A    mod_python-3.3.1/Doc/modpython1.tex
  88. A    mod_python-3.3.1/Doc/Makefile.in
  89. A    mod_python-3.3.1/Doc/modpython2.tex
  90. A    mod_python-3.3.1/Doc/modpython3.tex
  91. A    mod_python-3.3.1/Doc/modpython4.tex
  92. A    mod_python-3.3.1/Doc/modpython5.tex
  93. A    mod_python-3.3.1/Doc/modpython6.tex
  94. A    mod_python-3.3.1/Doc/copyright.tex
  95. A    mod_python-3.3.1/Doc/modpython7.tex
  96. A    mod_python-3.3.1/Doc/appendixa.tex
  97. A    mod_python-3.3.1/Doc/appendixb.tex
  98. A    mod_python-3.3.1/Doc/appendixc.tex
  99. A    mod_python-3.3.1/Doc/README
  100. A    mod_python-3.3.1/lib
  101. A    mod_python-3.3.1/lib/python
  102. A    mod_python-3.3.1/lib/python/mod_python
  103. A    mod_python-3.3.1/lib/python/mod_python/Cookie.py
  104. A    mod_python-3.3.1/lib/python/mod_python/publisher.py
  105. A    mod_python-3.3.1/lib/python/mod_python/testhandler.py
  106. A    mod_python-3.3.1/lib/python/mod_python/util.py
  107. A    mod_python-3.3.1/lib/python/mod_python/__init__.py
  108. A    mod_python-3.3.1/lib/python/mod_python/cgihandler.py
  109. A    mod_python-3.3.1/lib/python/mod_python/apache.py
  110. A    mod_python-3.3.1/lib/python/mod_python/importer.py
  111. A    mod_python-3.3.1/lib/python/mod_python/psp.py
  112. A    mod_python-3.3.1/lib/python/mod_python/Session.py
  113. A    mod_python-3.3.1/lib/python/mod_python/cache.py
  114. A    mod_python-3.3.1/lib/python/mod_python/python22.py
  115. A    mod_python-3.3.1/COPYRIGHT
  116. A    mod_python-3.3.1/NEWS
  117. A    mod_python-3.3.1/examples
  118. A    mod_python-3.3.1/examples/gzipfilter.py
  119. A    mod_python-3.3.1/install-sh
  120. Exported revision 1038095.
  121. /tmp/yaourt-tmp-ali/aur-mod_python/./PKGBUILD: line 23: patch: command not found
  122. /tmp/yaourt-tmp-ali/aur-mod_python/./PKGBUILD: line 24: patch: command not found
  123. checking for gcc... gcc
  124. checking for C compiler default output file name... a.out
  125. checking whether the C compiler works... yes
  126. checking whether we are cross compiling... no
  127. checking for suffix of executables...
  128. checking for suffix of object files... o
  129. checking whether we are using the GNU C compiler... yes
  130. checking whether gcc accepts -g... yes
  131. checking for gcc option to accept ANSI C... none needed
  132. checking for ar... ar
  133. checking for a BSD-compatible install... /bin/install -c
  134. checking whether make sets $(MAKE)... yes
  135. checking for main in -lm... yes
  136. checking for an ANSI C-conforming const... yes
  137. checking your blood pressure... a bit high, but we can proceed
  138. configure: checking whether apxs is available...
  139. checking for --with-apxs... no
  140. checking for apxs in /usr/local/apache/sbin... no
  141. checking for apxs in your PATH... checking for apxs... /usr/sbin/apxs
  142. found /usr/sbin/apxs, we'll use this. Use --with-apxs to specify another.
  143. checking Apache version... 2.2.17
  144. checking for Apache libexec directory... /usr/lib/httpd/modules
  145. checking for Apache include directory... -I/usr/include/httpd
  146. checking for --with-python... /usr/bin/python2
  147. checking Python version... 2.7
  148. checking Python install prefix... /usr
  149. checking checking where python libraries are installed... /usr/lib/python2.7
  150. checking for Py_NewInterpreter in -lpython2.7... yes
  151. checking what libraries Python was linked with... -lpython2.7   -lpthread -ldl  -lutil   -lm                
  152. checking linker flags used to link Python...
  153. checking where Python include files are... -I/usr/include/python2.7
  154. checking for --with-python-src... no
  155. checking for --with-mutex-dir... no
  156. Using MUTEX_DIR /tmp
  157. checking for --with-max-locks... no
  158. Using 8 MAX_LOCKS.
  159. checking for --with-flex... no
  160. checking for flex... no
  161. configure: WARNING: flex  not found
  162.   You can generally ignore this warning unless you need to regenerate
  163.   psp_parser.c from psp_parse.l.  If you do need regenerate psp_parser.c,
  164.   use --with-flex to specify the location of flex.
  165.   See the README for more information.
  166. configure: creating ./config.status
  167. config.status: creating Makefile
  168. config.status: creating src/Makefile
  169. config.status: creating Doc/Makefile
  170. config.status: creating src/include/mod_python.h
  171. config.status: creating test/Makefile
  172. config.status: creating test/testconf.py
  173. config.status: creating dist/setup.py
  174. config.status: creating dist/Makefile
  175. make[1]: Entering directory `/tmp/yaourt-tmp-ali/aur-mod_python/src/mod_python-3.3.1/src'
  176.  
  177. Compiling for DSO.
  178.  
  179. /usr/sbin/apxs -I/tmp/yaourt-tmp-ali/aur-mod_python/src/mod_python-3.3.1/src/include -I/usr/include/httpd -I/usr/include/python2.7 -c mod_python.c _apachemodule.c requestobject.c tableobject.c util.c serverobject.c connobject.c filterobject.c hlist.c hlistobject.c finfoobject.c -Wl,--hash-style=gnu -Wl,--as-needed -L/usr/lib/python2.7/config  -Xlinker -export-dynamic   -lm  -lpython2.7   -lpthread -ldl  -lutil   -lm                
  180. /usr/share/apr-1/build/libtool --silent --mode=compile gcc -prefer-pic -march=x86-64 -mtune=generic -O2 -pipe  -DLINUX=2 -D_REENTRANT -D_GNU_SOURCE -pthread -I/usr/include/httpd  -I/usr/include/apr-1   -I/usr/include/apr-1 -I/usr/include -I/tmp/yaourt-tmp-ali/aur-mod_python/src/mod_python-3.3.1/src/include -I/usr/include/httpd -I/usr/include/python2.7  -c -o mod_python.lo mod_python.c && touch mod_python.slo
  181. In file included from /usr/include/python2.7/Python.h:8:0,
  182.                  from /tmp/yaourt-tmp-ali/aur-mod_python/src/mod_python-3.3.1/src/include/mod_python.h:80,
  183.                  from mod_python.c:28:
  184. /usr/include/python2.7/pyconfig.h:1149:0: warning: "_POSIX_C_SOURCE" redefined
  185. /usr/include/features.h:162:0: note: this is the location of the previous definition
  186. /usr/include/python2.7/pyconfig.h:1171:0: warning: "_XOPEN_SOURCE" redefined
  187. /usr/include/features.h:164:0: note: this is the location of the previous definition
  188. mod_python.c: In function ‘python_init’:
  189. mod_python.c:826:5: warning: initialization from incompatible pointer type
  190. /usr/share/apr-1/build/libtool --silent --mode=compile gcc -prefer-pic -march=x86-64 -mtune=generic -O2 -pipe  -DLINUX=2 -D_REENTRANT -D_GNU_SOURCE -pthread -I/usr/include/httpd  -I/usr/include/apr-1   -I/usr/include/apr-1 -I/usr/include -I/tmp/yaourt-tmp-ali/aur-mod_python/src/mod_python-3.3.1/src/include -I/usr/include/httpd -I/usr/include/python2.7  -c -o _apachemodule.lo _apachemodule.c && touch _apachemodule.slo
  191. In file included from /usr/include/python2.7/Python.h:8:0,
  192.                  from /tmp/yaourt-tmp-ali/aur-mod_python/src/mod_python-3.3.1/src/include/mod_python.h:80,
  193.                  from _apachemodule.c:25:
  194. /usr/include/python2.7/pyconfig.h:1149:0: warning: "_POSIX_C_SOURCE" redefined
  195. /usr/include/features.h:162:0: note: this is the location of the previous definition
  196. /usr/include/python2.7/pyconfig.h:1171:0: warning: "_XOPEN_SOURCE" redefined
  197. /usr/include/features.h:164:0: note: this is the location of the previous definition
  198. /usr/share/apr-1/build/libtool --silent --mode=compile gcc -prefer-pic -march=x86-64 -mtune=generic -O2 -pipe  -DLINUX=2 -D_REENTRANT -D_GNU_SOURCE -pthread -I/usr/include/httpd  -I/usr/include/apr-1   -I/usr/include/apr-1 -I/usr/include -I/tmp/yaourt-tmp-ali/aur-mod_python/src/mod_python-3.3.1/src/include -I/usr/include/httpd -I/usr/include/python2.7  -c -o requestobject.lo requestobject.c && touch requestobject.slo
  199. In file included from /usr/include/python2.7/Python.h:8:0,
  200.                  from /tmp/yaourt-tmp-ali/aur-mod_python/src/mod_python-3.3.1/src/include/mod_python.h:80,
  201.                  from requestobject.c:25:
  202. /usr/include/python2.7/pyconfig.h:1149:0: warning: "_POSIX_C_SOURCE" redefined
  203. /usr/include/features.h:162:0: note: this is the location of the previous definition
  204. /usr/include/python2.7/pyconfig.h:1171:0: warning: "_XOPEN_SOURCE" redefined
  205. /usr/include/features.h:164:0: note: this is the location of the previous definition
  206. /usr/share/apr-1/build/libtool --silent --mode=compile gcc -prefer-pic -march=x86-64 -mtune=generic -O2 -pipe  -DLINUX=2 -D_REENTRANT -D_GNU_SOURCE -pthread -I/usr/include/httpd  -I/usr/include/apr-1   -I/usr/include/apr-1 -I/usr/include -I/tmp/yaourt-tmp-ali/aur-mod_python/src/mod_python-3.3.1/src/include -I/usr/include/httpd -I/usr/include/python2.7  -c -o tableobject.lo tableobject.c && touch tableobject.slo
  207. In file included from /usr/include/python2.7/Python.h:8:0,
  208.                  from /tmp/yaourt-tmp-ali/aur-mod_python/src/mod_python-3.3.1/src/include/mod_python.h:80,
  209.                  from tableobject.c:25:
  210. /usr/include/python2.7/pyconfig.h:1149:0: warning: "_POSIX_C_SOURCE" redefined
  211. /usr/include/features.h:162:0: note: this is the location of the previous definition
  212. /usr/include/python2.7/pyconfig.h:1171:0: warning: "_XOPEN_SOURCE" redefined
  213. /usr/include/features.h:164:0: note: this is the location of the previous definition
  214. tableobject.c:329:5: warning: initialization from incompatible pointer type
  215. tableobject.c:1092:5: warning: initialization from incompatible pointer type
  216. /usr/share/apr-1/build/libtool --silent --mode=compile gcc -prefer-pic -march=x86-64 -mtune=generic -O2 -pipe  -DLINUX=2 -D_REENTRANT -D_GNU_SOURCE -pthread -I/usr/include/httpd  -I/usr/include/apr-1   -I/usr/include/apr-1 -I/usr/include -I/tmp/yaourt-tmp-ali/aur-mod_python/src/mod_python-3.3.1/src/include -I/usr/include/httpd -I/usr/include/python2.7  -c -o util.lo util.c && touch util.slo
  217. In file included from /usr/include/python2.7/Python.h:8:0,
  218.                  from /tmp/yaourt-tmp-ali/aur-mod_python/src/mod_python-3.3.1/src/include/mod_python.h:80,
  219.                  from util.c:28:
  220. /usr/include/python2.7/pyconfig.h:1149:0: warning: "_POSIX_C_SOURCE" redefined
  221. /usr/include/features.h:162:0: note: this is the location of the previous definition
  222. /usr/include/python2.7/pyconfig.h:1171:0: warning: "_XOPEN_SOURCE" redefined
  223. /usr/include/features.h:164:0: note: this is the location of the previous definition
  224. /usr/share/apr-1/build/libtool --silent --mode=compile gcc -prefer-pic -march=x86-64 -mtune=generic -O2 -pipe  -DLINUX=2 -D_REENTRANT -D_GNU_SOURCE -pthread -I/usr/include/httpd  -I/usr/include/apr-1   -I/usr/include/apr-1 -I/usr/include -I/tmp/yaourt-tmp-ali/aur-mod_python/src/mod_python-3.3.1/src/include -I/usr/include/httpd -I/usr/include/python2.7  -c -o serverobject.lo serverobject.c && touch serverobject.slo
  225. In file included from /usr/include/python2.7/Python.h:8:0,
  226.                  from /tmp/yaourt-tmp-ali/aur-mod_python/src/mod_python-3.3.1/src/include/mod_python.h:80,
  227.                  from serverobject.c:25:
  228. /usr/include/python2.7/pyconfig.h:1149:0: warning: "_POSIX_C_SOURCE" redefined
  229. /usr/include/features.h:162:0: note: this is the location of the previous definition
  230. /usr/include/python2.7/pyconfig.h:1171:0: warning: "_XOPEN_SOURCE" redefined
  231. /usr/include/features.h:164:0: note: this is the location of the previous definition
  232. serverobject.c:387:5: warning: initialization from incompatible pointer type
  233. /usr/share/apr-1/build/libtool --silent --mode=compile gcc -prefer-pic -march=x86-64 -mtune=generic -O2 -pipe  -DLINUX=2 -D_REENTRANT -D_GNU_SOURCE -pthread -I/usr/include/httpd  -I/usr/include/apr-1   -I/usr/include/apr-1 -I/usr/include -I/tmp/yaourt-tmp-ali/aur-mod_python/src/mod_python-3.3.1/src/include -I/usr/include/httpd -I/usr/include/python2.7  -c -o connobject.lo connobject.c && touch connobject.slo
  234. In file included from /usr/include/python2.7/Python.h:8:0,
  235.                  from /tmp/yaourt-tmp-ali/aur-mod_python/src/mod_python-3.3.1/src/include/mod_python.h:80,
  236.                  from connobject.c:30:
  237. /usr/include/python2.7/pyconfig.h:1149:0: warning: "_POSIX_C_SOURCE" redefined
  238. /usr/include/features.h:162:0: note: this is the location of the previous definition
  239. /usr/include/python2.7/pyconfig.h:1171:0: warning: "_XOPEN_SOURCE" redefined
  240. /usr/include/features.h:164:0: note: this is the location of the previous definition
  241. connobject.c: In function ‘_conn_read’:
  242. connobject.c:142:19: error: request for member ‘next’ in something not a structure or union
  243. apxs:Error: Command failed with rc=65536
  244. .
  245. make[1]: *** [mod_python.so] Error 1
  246. make[1]: Leaving directory `/tmp/yaourt-tmp-ali/aur-mod_python/src/mod_python-3.3.1/src'
  247. make: *** [do_dso] Error 2
  248.     Aborting...