Pastebin launched a little side project called VERYVIRAL.com, check it out ;-) Want more features on Pastebin? Sign Up, it's FREE!
Guest

Error log for gnurobots

By: a guest on Jun 20th, 2010  |  syntax: None  |  size: 54.10 KB  |  views: 183  |  expires: Never
download  |  raw  |  embed  |  report abuse  |  print
Text below is selected. Please press Ctrl+C to copy to your clipboard. (⌘+C on Mac)
  1. ==> Building and installing package
  2. ==> Making package: gnurobots 1.2.0-2 i686 (Sun Jun 20 20:50:20 EEST 2010)
  3. ==> Checking Runtime Dependencies...
  4. ==> Checking Buildtime Dependencies...
  5. ==> Retrieving Sources...
  6.   -> Found gnurobots-1.2.0.tar.gz in build dir
  7. ==> Validating source files with md5sums...
  8.     gnurobots-1.2.0.tar.gz ... Passed
  9. ==> Extracting Sources...
  10.   -> Extracting gnurobots-1.2.0.tar.gz with bsdtar
  11. ==> Removing existing pkg/ directory...
  12. ==> Entering fakeroot environment...
  13. ==> Starting build()...
  14. checking for a BSD-compatible install... /bin/install -c
  15. checking whether build environment is sane... yes
  16. checking for a thread-safe mkdir -p... /bin/mkdir -p
  17. checking for gawk... gawk
  18. checking whether make sets $(MAKE)... yes
  19. checking for gcc... gcc
  20. checking for C compiler default output file name... a.out
  21. checking whether the C compiler works... yes
  22. checking whether we are cross compiling... no
  23. checking for suffix of executables...
  24. checking for suffix of object files... o
  25. checking whether we are using the GNU C compiler... yes
  26. checking whether gcc accepts -g... yes
  27. checking for gcc option to accept ISO C89... none needed
  28. checking for style of include used by make... GNU
  29. checking dependency style of gcc... gcc3
  30. checking for guile... /usr/bin/guile
  31. checking for guile-config... /usr/bin/guile-config
  32. checking for guile-tools... /usr/bin/guile-tools
  33. checking libguile compile flags...   -pthread
  34. checking libguile link flags...  -pthread  -lguile -lltdl -Wl,--hash-style=gnu -Wl,--as-needed -lgmp -lcrypt -lm -lltdl
  35. checking for pkg-config... /usr/bin/pkg-config
  36. checking pkg-config is at least version 0.9.0... yes
  37. checking for GTHREAD2... yes
  38. checking for GTK2... yes
  39. checking for VTE... yes
  40. checking for tgoto in -lncurses... yes
  41. checking for readline in -lreadline... yes
  42. checking how to run the C preprocessor... gcc -E
  43. checking for grep that handles long lines and -e... /bin/grep
  44. checking for egrep... /bin/grep -E
  45. checking for ANSI C header files... yes
  46. checking for sys/types.h... yes
  47. checking for sys/stat.h... yes
  48. checking for stdlib.h... yes
  49. checking for string.h... yes
  50. checking for memory.h... yes
  51. checking for strings.h... yes
  52. checking for inttypes.h... yes
  53. checking for stdint.h... yes
  54. checking for unistd.h... yes
  55. checking readline/readline.h usability... yes
  56. checking readline/readline.h presence... yes
  57. checking for readline/readline.h... yes
  58. checking for ANSI C header files... (cached) yes
  59. checking for unistd.h... (cached) yes
  60. checking getopt.h usability... yes
  61. checking getopt.h presence... yes
  62. checking for getopt.h... yes
  63. checking pty.h usability... yes
  64. checking pty.h presence... yes
  65. checking for pty.h... yes
  66. checking for openpty in -lutil... yes
  67. checking for scm_to_locale_string in -lguile... yes
  68. checking for an ANSI C-conforming const... yes
  69. configure: creating ./config.status
  70. config.status: creating Makefile
  71. config.status: creating contrib/Makefile
  72. config.status: creating doc/Makefile
  73. config.status: creating include/Makefile
  74. config.status: creating xpm/Makefile
  75. config.status: creating maps/Makefile
  76. config.status: creating scheme/Makefile
  77. config.status: creating src/Makefile
  78. config.status: creating config.h
  79. config.status: config.h is unchanged
  80. config.status: executing depfiles commands
  81. make  all-recursive
  82. make[1]: Entering directory `/tmp/yaourt-tmp-retry/aur-gnurobots/src/gnurobots-1.2.0'
  83. Making all in contrib
  84. make[2]: Entering directory `/tmp/yaourt-tmp-retry/aur-gnurobots/src/gnurobots-1.2.0/contrib'
  85. make[2]: Nothing to be done for `all'.
  86. make[2]: Leaving directory `/tmp/yaourt-tmp-retry/aur-gnurobots/src/gnurobots-1.2.0/contrib'
  87. Making all in doc
  88. make[2]: Entering directory `/tmp/yaourt-tmp-retry/aur-gnurobots/src/gnurobots-1.2.0/doc'
  89. make[2]: Nothing to be done for `all'.
  90. make[2]: Leaving directory `/tmp/yaourt-tmp-retry/aur-gnurobots/src/gnurobots-1.2.0/doc'
  91. Making all in include
  92. make[2]: Entering directory `/tmp/yaourt-tmp-retry/aur-gnurobots/src/gnurobots-1.2.0/include'
  93. make[2]: Nothing to be done for `all'.
  94. make[2]: Leaving directory `/tmp/yaourt-tmp-retry/aur-gnurobots/src/gnurobots-1.2.0/include'
  95. Making all in maps
  96. make[2]: Entering directory `/tmp/yaourt-tmp-retry/aur-gnurobots/src/gnurobots-1.2.0/maps'
  97. make[2]: Nothing to be done for `all'.
  98. make[2]: Leaving directory `/tmp/yaourt-tmp-retry/aur-gnurobots/src/gnurobots-1.2.0/maps'
  99. Making all in scheme
  100. make[2]: Entering directory `/tmp/yaourt-tmp-retry/aur-gnurobots/src/gnurobots-1.2.0/scheme'
  101. make[2]: Nothing to be done for `all'.
  102. make[2]: Leaving directory `/tmp/yaourt-tmp-retry/aur-gnurobots/src/gnurobots-1.2.0/scheme'
  103. Making all in src
  104. make[2]: Entering directory `/tmp/yaourt-tmp-retry/aur-gnurobots/src/gnurobots-1.2.0/src'
  105. gcc  -pedantic-errors -Werror -Wall -g -pthread  -lguile -lltdl -Wl,--hash-style=gnu -Wl,--as-needed -lgmp -lcrypt -lm -lltdl -lreadline -lncurses -pthread -lgthread-2.0 -lrt -lglib-2.0   -pthread -lgtk-x11-2.0 -lgdk-x11-2.0 -latk-1.0 -lgio-2.0 -lpangoft2-1.0 -lgdk_pixbuf-2.0 -lpangocairo-1.0 -lcairo -lpango-1.0 -lfreetype -lfontconfig -lgobject-2.0 -lgmodule-2.0 -lgthread-2.0 -lrt -lglib-2.0   -pthread -lvte -lgtk-x11-2.0 -lgdk-x11-2.0 -latk-1.0 -lpangoft2-1.0 -lgdk_pixbuf-2.0 -lpangocairo-1.0 -lpango-1.0 -lfreetype -lfontconfig -lgio-2.0 -lgobject-2.0 -lgmodule-2.0 -lgthread-2.0 -lrt -lglib-2.0 -lcairo -lX11   -lutil -Wl,--hash-style=gnu -Wl,--as-needed -o gnurobots main.o api.o map.o grobot.o ui-window.o ui-cmdwin.o ui-arena.o  -lguile -lutil
  106. main.o: In function `main':
  107. /tmp/yaourt-tmp-retry/aur-gnurobots/src/gnurobots-1.2.0/src/main.c:87: undefined reference to `g_type_init'
  108. /tmp/yaourt-tmp-retry/aur-gnurobots/src/gnurobots-1.2.0/src/main.c:95: undefined reference to `g_assertion_message_expr'
  109. /tmp/yaourt-tmp-retry/aur-gnurobots/src/gnurobots-1.2.0/src/main.c:98: undefined reference to `g_list_append'
  110. /tmp/yaourt-tmp-retry/aur-gnurobots/src/gnurobots-1.2.0/src/main.c:107: undefined reference to `g_printf'
  111. /tmp/yaourt-tmp-retry/aur-gnurobots/src/gnurobots-1.2.0/src/main.c:108: undefined reference to `g_printf'
  112. /tmp/yaourt-tmp-retry/aur-gnurobots/src/gnurobots-1.2.0/src/main.c:110: undefined reference to `g_printf'
  113. /tmp/yaourt-tmp-retry/aur-gnurobots/src/gnurobots-1.2.0/src/main.c:115: undefined reference to `g_printf'
  114. /tmp/yaourt-tmp-retry/aur-gnurobots/src/gnurobots-1.2.0/src/main.c:120: undefined reference to `g_printf'
  115. /tmp/yaourt-tmp-retry/aur-gnurobots/src/gnurobots-1.2.0/src/main.c:166: undefined reference to `g_malloc'
  116. /tmp/yaourt-tmp-retry/aur-gnurobots/src/gnurobots-1.2.0/src/main.c:167: undefined reference to `g_strlcpy'
  117. /tmp/yaourt-tmp-retry/aur-gnurobots/src/gnurobots-1.2.0/src/main.c:168: undefined reference to `g_fprintf'
  118. /tmp/yaourt-tmp-retry/aur-gnurobots/src/gnurobots-1.2.0/src/main.c:173: undefined reference to `g_strlcpy'
  119. /tmp/yaourt-tmp-retry/aur-gnurobots/src/gnurobots-1.2.0/src/main.c:177: undefined reference to `g_strlcpy'
  120. /tmp/yaourt-tmp-retry/aur-gnurobots/src/gnurobots-1.2.0/src/main.c:178: undefined reference to `g_strlcat'
  121. /tmp/yaourt-tmp-retry/aur-gnurobots/src/gnurobots-1.2.0/src/main.c:179: undefined reference to `g_strlcat'
  122. /tmp/yaourt-tmp-retry/aur-gnurobots/src/gnurobots-1.2.0/src/main.c:187: undefined reference to `g_strlcpy'
  123. /tmp/yaourt-tmp-retry/aur-gnurobots/src/gnurobots-1.2.0/src/main.c:188: undefined reference to `g_strlcat'
  124. /tmp/yaourt-tmp-retry/aur-gnurobots/src/gnurobots-1.2.0/src/main.c:189: undefined reference to `g_strlcat'
  125. /tmp/yaourt-tmp-retry/aur-gnurobots/src/gnurobots-1.2.0/src/main.c:193: undefined reference to `g_fprintf'
  126. /tmp/yaourt-tmp-retry/aur-gnurobots/src/gnurobots-1.2.0/src/main.c:201: undefined reference to `g_fprintf'
  127. /tmp/yaourt-tmp-retry/aur-gnurobots/src/gnurobots-1.2.0/src/main.c:214: undefined reference to `g_strlcpy'
  128. /tmp/yaourt-tmp-retry/aur-gnurobots/src/gnurobots-1.2.0/src/main.c:218: undefined reference to `g_strlcpy'
  129. /tmp/yaourt-tmp-retry/aur-gnurobots/src/gnurobots-1.2.0/src/main.c:219: undefined reference to `g_strlcat'
  130. /tmp/yaourt-tmp-retry/aur-gnurobots/src/gnurobots-1.2.0/src/main.c:220: undefined reference to `g_strlcat'
  131. /tmp/yaourt-tmp-retry/aur-gnurobots/src/gnurobots-1.2.0/src/main.c:228: undefined reference to `g_strlcpy'
  132. /tmp/yaourt-tmp-retry/aur-gnurobots/src/gnurobots-1.2.0/src/main.c:229: undefined reference to `g_strlcat'
  133. /tmp/yaourt-tmp-retry/aur-gnurobots/src/gnurobots-1.2.0/src/main.c:230: undefined reference to `g_strlcat'
  134. /tmp/yaourt-tmp-retry/aur-gnurobots/src/gnurobots-1.2.0/src/main.c:234: undefined reference to `g_fprintf'
  135. /tmp/yaourt-tmp-retry/aur-gnurobots/src/gnurobots-1.2.0/src/main.c:242: undefined reference to `g_fprintf'
  136. /tmp/yaourt-tmp-retry/aur-gnurobots/src/gnurobots-1.2.0/src/main.c:259: undefined reference to `g_printf'
  137. /tmp/yaourt-tmp-retry/aur-gnurobots/src/gnurobots-1.2.0/src/main.c:260: undefined reference to `g_printf'
  138. /tmp/yaourt-tmp-retry/aur-gnurobots/src/gnurobots-1.2.0/src/main.c:261: undefined reference to `g_printf'
  139. /tmp/yaourt-tmp-retry/aur-gnurobots/src/gnurobots-1.2.0/src/main.c:263: undefined reference to `g_printf'
  140. /tmp/yaourt-tmp-retry/aur-gnurobots/src/gnurobots-1.2.0/src/main.c:265: undefined reference to `g_printf'
  141. main.o:/tmp/yaourt-tmp-retry/aur-gnurobots/src/gnurobots-1.2.0/src/main.c:266: more undefined references to `g_printf' follow
  142. main.o: In function `main_prog':
  143. /tmp/yaourt-tmp-retry/aur-gnurobots/src/gnurobots-1.2.0/src/main.c:298: undefined reference to `g_thread_init'
  144. /tmp/yaourt-tmp-retry/aur-gnurobots/src/gnurobots-1.2.0/src/main.c:299: undefined reference to `gdk_threads_init'
  145. /tmp/yaourt-tmp-retry/aur-gnurobots/src/gnurobots-1.2.0/src/main.c:300: undefined reference to `g_thread_create_full'
  146. /tmp/yaourt-tmp-retry/aur-gnurobots/src/gnurobots-1.2.0/src/main.c:306: undefined reference to `g_printf'
  147. /tmp/yaourt-tmp-retry/aur-gnurobots/src/gnurobots-1.2.0/src/main.c:311: undefined reference to `g_type_check_instance_cast'
  148. /tmp/yaourt-tmp-retry/aur-gnurobots/src/gnurobots-1.2.0/src/main.c:311: undefined reference to `g_type_check_instance_cast'
  149. /tmp/yaourt-tmp-retry/aur-gnurobots/src/gnurobots-1.2.0/src/main.c:310: undefined reference to `g_type_check_instance_cast'
  150. /tmp/yaourt-tmp-retry/aur-gnurobots/src/gnurobots-1.2.0/src/main.c:310: undefined reference to `g_object_set'
  151. /tmp/yaourt-tmp-retry/aur-gnurobots/src/gnurobots-1.2.0/src/main.c:313: undefined reference to `g_type_check_instance_cast'
  152. /tmp/yaourt-tmp-retry/aur-gnurobots/src/gnurobots-1.2.0/src/main.c:313: undefined reference to `g_signal_connect_data'
  153. /tmp/yaourt-tmp-retry/aur-gnurobots/src/gnurobots-1.2.0/src/main.c:318: undefined reference to `g_printf'
  154. /tmp/yaourt-tmp-retry/aur-gnurobots/src/gnurobots-1.2.0/src/main.c:326: undefined reference to `g_printf'
  155. /tmp/yaourt-tmp-retry/aur-gnurobots/src/gnurobots-1.2.0/src/main.c:332: undefined reference to `g_type_check_instance_cast'
  156. main.o: In function `callback':
  157. /tmp/yaourt-tmp-retry/aur-gnurobots/src/gnurobots-1.2.0/src/main.c:347: undefined reference to `gtk_init'
  158. /tmp/yaourt-tmp-retry/aur-gnurobots/src/gnurobots-1.2.0/src/main.c:349: undefined reference to `g_type_check_instance_cast'
  159. /tmp/yaourt-tmp-retry/aur-gnurobots/src/gnurobots-1.2.0/src/main.c:352: undefined reference to `g_type_check_instance_cast'
  160. /tmp/yaourt-tmp-retry/aur-gnurobots/src/gnurobots-1.2.0/src/main.c:360: undefined reference to `gdk_threads_enter'
  161. /tmp/yaourt-tmp-retry/aur-gnurobots/src/gnurobots-1.2.0/src/main.c:361: undefined reference to `gtk_main'
  162. /tmp/yaourt-tmp-retry/aur-gnurobots/src/gnurobots-1.2.0/src/main.c:362: undefined reference to `gdk_threads_leave'
  163. main.o: In function `catch_handler':
  164. /tmp/yaourt-tmp-retry/aur-gnurobots/src/gnurobots-1.2.0/src/main.c:392: undefined reference to `g_printf'
  165. main.o: In function `death':
  166. /tmp/yaourt-tmp-retry/aur-gnurobots/src/gnurobots-1.2.0/src/main.c:400: undefined reference to `g_type_check_instance_cast'
  167. /tmp/yaourt-tmp-retry/aur-gnurobots/src/gnurobots-1.2.0/src/main.c:400: undefined reference to `g_object_unref'
  168. main.o: In function `exit_nicely':
  169. /tmp/yaourt-tmp-retry/aur-gnurobots/src/gnurobots-1.2.0/src/main.c:418: undefined reference to `g_type_check_instance_cast'
  170. /tmp/yaourt-tmp-retry/aur-gnurobots/src/gnurobots-1.2.0/src/main.c:418: undefined reference to `g_object_unref'
  171. /tmp/yaourt-tmp-retry/aur-gnurobots/src/gnurobots-1.2.0/src/main.c:424: undefined reference to `g_type_check_instance_cast'
  172. /tmp/yaourt-tmp-retry/aur-gnurobots/src/gnurobots-1.2.0/src/main.c:424: undefined reference to `g_object_unref'
  173. /tmp/yaourt-tmp-retry/aur-gnurobots/src/gnurobots-1.2.0/src/main.c:428: undefined reference to `g_type_check_instance_cast'
  174. /tmp/yaourt-tmp-retry/aur-gnurobots/src/gnurobots-1.2.0/src/main.c:428: undefined reference to `g_object_get'
  175. /tmp/yaourt-tmp-retry/aur-gnurobots/src/gnurobots-1.2.0/src/main.c:433: undefined reference to `g_object_unref'
  176. /tmp/yaourt-tmp-retry/aur-gnurobots/src/gnurobots-1.2.0/src/main.c:433: undefined reference to `g_list_foreach'
  177. /tmp/yaourt-tmp-retry/aur-gnurobots/src/gnurobots-1.2.0/src/main.c:434: undefined reference to `g_list_free'
  178. /tmp/yaourt-tmp-retry/aur-gnurobots/src/gnurobots-1.2.0/src/main.c:436: undefined reference to `g_printf'
  179. /tmp/yaourt-tmp-retry/aur-gnurobots/src/gnurobots-1.2.0/src/main.c:438: undefined reference to `g_printf'
  180. /tmp/yaourt-tmp-retry/aur-gnurobots/src/gnurobots-1.2.0/src/main.c:439: undefined reference to `g_printf'
  181. /tmp/yaourt-tmp-retry/aur-gnurobots/src/gnurobots-1.2.0/src/main.c:440: undefined reference to `g_printf'
  182. /tmp/yaourt-tmp-retry/aur-gnurobots/src/gnurobots-1.2.0/src/main.c:441: undefined reference to `g_printf'
  183. main.o:/tmp/yaourt-tmp-retry/aur-gnurobots/src/gnurobots-1.2.0/src/main.c:442: more undefined references to `g_printf' follow
  184. api.o: In function `api_robot_get_shields':
  185. /tmp/yaourt-tmp-retry/aur-gnurobots/src/gnurobots-1.2.0/src/api.c:107: undefined reference to `g_object_get'
  186. api.o: In function `api_robot_get_energy':
  187. /tmp/yaourt-tmp-retry/aur-gnurobots/src/gnurobots-1.2.0/src/api.c:118: undefined reference to `g_object_get'
  188. api.o: In function `api_robot_get_score':
  189. /tmp/yaourt-tmp-retry/aur-gnurobots/src/gnurobots-1.2.0/src/api.c:129: undefined reference to `g_object_get'
  190. map.o: In function `g_once_init_enter':
  191. /usr/include/glib-2.0/glib/gthread.h:348: undefined reference to `g_atomic_pointer_get'
  192. /usr/include/glib-2.0/glib/gthread.h:351: undefined reference to `g_once_init_enter_impl'
  193. map.o: In function `map_class_intern_init':
  194. /tmp/yaourt-tmp-retry/aur-gnurobots/src/gnurobots-1.2.0/src/map.c:29: undefined reference to `g_type_class_peek_parent'
  195. map.o: In function `map_get_type':
  196. /tmp/yaourt-tmp-retry/aur-gnurobots/src/gnurobots-1.2.0/src/map.c:29: undefined reference to `g_intern_static_string'
  197. /tmp/yaourt-tmp-retry/aur-gnurobots/src/gnurobots-1.2.0/src/map.c:29: undefined reference to `g_type_register_static_simple'
  198. /tmp/yaourt-tmp-retry/aur-gnurobots/src/gnurobots-1.2.0/src/map.c:29: undefined reference to `g_once_init_leave'
  199. map.o: In function `map_class_init':
  200. /tmp/yaourt-tmp-retry/aur-gnurobots/src/gnurobots-1.2.0/src/map.c:48: undefined reference to `g_type_check_class_cast'
  201. /tmp/yaourt-tmp-retry/aur-gnurobots/src/gnurobots-1.2.0/src/map.c:53: undefined reference to `g_param_spec_pointer'
  202. /tmp/yaourt-tmp-retry/aur-gnurobots/src/gnurobots-1.2.0/src/map.c:53: undefined reference to `g_type_check_class_cast'
  203. /tmp/yaourt-tmp-retry/aur-gnurobots/src/gnurobots-1.2.0/src/map.c:53: undefined reference to `g_object_class_install_property'
  204. map.o: In function `map_set_property':
  205. /tmp/yaourt-tmp-retry/aur-gnurobots/src/gnurobots-1.2.0/src/map.c:176: undefined reference to `g_type_check_instance_is_a'
  206. /tmp/yaourt-tmp-retry/aur-gnurobots/src/gnurobots-1.2.0/src/map.c:176: undefined reference to `g_return_if_fail_warning'
  207. /tmp/yaourt-tmp-retry/aur-gnurobots/src/gnurobots-1.2.0/src/map.c:178: undefined reference to `g_type_check_instance_cast'
  208. /tmp/yaourt-tmp-retry/aur-gnurobots/src/gnurobots-1.2.0/src/map.c:188: undefined reference to `g_free'
  209. /tmp/yaourt-tmp-retry/aur-gnurobots/src/gnurobots-1.2.0/src/map.c:191: undefined reference to `g_free'
  210. /tmp/yaourt-tmp-retry/aur-gnurobots/src/gnurobots-1.2.0/src/map.c:195: undefined reference to `g_value_get_pointer'
  211. /tmp/yaourt-tmp-retry/aur-gnurobots/src/gnurobots-1.2.0/src/map.c:198: undefined reference to `g_malloc'
  212. /tmp/yaourt-tmp-retry/aur-gnurobots/src/gnurobots-1.2.0/src/map.c:202: undefined reference to `g_malloc'
  213. /tmp/yaourt-tmp-retry/aur-gnurobots/src/gnurobots-1.2.0/src/map.c:207: undefined reference to `g_type_name'
  214. /tmp/yaourt-tmp-retry/aur-gnurobots/src/gnurobots-1.2.0/src/map.c:207: undefined reference to `g_type_name'
  215. /tmp/yaourt-tmp-retry/aur-gnurobots/src/gnurobots-1.2.0/src/map.c:207: undefined reference to `g_log'
  216. map.o: In function `map_get_property':
  217. /tmp/yaourt-tmp-retry/aur-gnurobots/src/gnurobots-1.2.0/src/map.c:219: undefined reference to `g_type_check_instance_is_a'
  218. /tmp/yaourt-tmp-retry/aur-gnurobots/src/gnurobots-1.2.0/src/map.c:219: undefined reference to `g_return_if_fail_warning'
  219. /tmp/yaourt-tmp-retry/aur-gnurobots/src/gnurobots-1.2.0/src/map.c:221: undefined reference to `g_type_check_instance_cast'
  220. /tmp/yaourt-tmp-retry/aur-gnurobots/src/gnurobots-1.2.0/src/map.c:226: undefined reference to `g_memdup'
  221. /tmp/yaourt-tmp-retry/aur-gnurobots/src/gnurobots-1.2.0/src/map.c:226: undefined reference to `g_value_set_pointer'
  222. /tmp/yaourt-tmp-retry/aur-gnurobots/src/gnurobots-1.2.0/src/map.c:229: undefined reference to `g_type_name'
  223. /tmp/yaourt-tmp-retry/aur-gnurobots/src/gnurobots-1.2.0/src/map.c:229: undefined reference to `g_type_name'
  224. /tmp/yaourt-tmp-retry/aur-gnurobots/src/gnurobots-1.2.0/src/map.c:229: undefined reference to `g_log'
  225. map.o: In function `map_new_from_file':
  226. /tmp/yaourt-tmp-retry/aur-gnurobots/src/gnurobots-1.2.0/src/map.c:249: undefined reference to `g_object_new'
  227. /tmp/yaourt-tmp-retry/aur-gnurobots/src/gnurobots-1.2.0/src/map.c:249: undefined reference to `g_type_check_instance_cast'
  228. /tmp/yaourt-tmp-retry/aur-gnurobots/src/gnurobots-1.2.0/src/map.c:260: undefined reference to `g_log'
  229. grobot.o: In function `g_once_init_enter':
  230. /usr/include/glib-2.0/glib/gthread.h:348: undefined reference to `g_atomic_pointer_get'
  231. /usr/include/glib-2.0/glib/gthread.h:351: undefined reference to `g_once_init_enter_impl'
  232. grobot.o: In function `g_robot_class_intern_init':
  233. /tmp/yaourt-tmp-retry/aur-gnurobots/src/gnurobots-1.2.0/src/grobot.c:27: undefined reference to `g_type_class_peek_parent'
  234. grobot.o: In function `g_robot_get_type':
  235. /tmp/yaourt-tmp-retry/aur-gnurobots/src/gnurobots-1.2.0/src/grobot.c:27: undefined reference to `g_intern_static_string'
  236. /tmp/yaourt-tmp-retry/aur-gnurobots/src/gnurobots-1.2.0/src/grobot.c:27: undefined reference to `g_type_register_static_simple'
  237. /tmp/yaourt-tmp-retry/aur-gnurobots/src/gnurobots-1.2.0/src/grobot.c:27: undefined reference to `g_once_init_leave'
  238. grobot.o: In function `g_robot_class_init':
  239. /tmp/yaourt-tmp-retry/aur-gnurobots/src/gnurobots-1.2.0/src/grobot.c:81: undefined reference to `g_type_class_ref'
  240. /tmp/yaourt-tmp-retry/aur-gnurobots/src/gnurobots-1.2.0/src/grobot.c:88: undefined reference to `g_param_spec_int'
  241. /tmp/yaourt-tmp-retry/aur-gnurobots/src/gnurobots-1.2.0/src/grobot.c:88: undefined reference to `g_type_check_class_cast'
  242. /tmp/yaourt-tmp-retry/aur-gnurobots/src/gnurobots-1.2.0/src/grobot.c:88: undefined reference to `g_object_class_install_property'
  243. /tmp/yaourt-tmp-retry/aur-gnurobots/src/gnurobots-1.2.0/src/grobot.c:94: undefined reference to `g_param_spec_int'
  244. /tmp/yaourt-tmp-retry/aur-gnurobots/src/gnurobots-1.2.0/src/grobot.c:94: undefined reference to `g_type_check_class_cast'
  245. /tmp/yaourt-tmp-retry/aur-gnurobots/src/gnurobots-1.2.0/src/grobot.c:94: undefined reference to `g_object_class_install_property'
  246. /tmp/yaourt-tmp-retry/aur-gnurobots/src/gnurobots-1.2.0/src/grobot.c:100: undefined reference to `g_param_spec_int'
  247. /tmp/yaourt-tmp-retry/aur-gnurobots/src/gnurobots-1.2.0/src/grobot.c:100: undefined reference to `g_type_check_class_cast'
  248. /tmp/yaourt-tmp-retry/aur-gnurobots/src/gnurobots-1.2.0/src/grobot.c:100: undefined reference to `g_object_class_install_property'
  249. /tmp/yaourt-tmp-retry/aur-gnurobots/src/gnurobots-1.2.0/src/grobot.c:106: undefined reference to `g_param_spec_long'
  250. /tmp/yaourt-tmp-retry/aur-gnurobots/src/gnurobots-1.2.0/src/grobot.c:106: undefined reference to `g_type_check_class_cast'
  251. /tmp/yaourt-tmp-retry/aur-gnurobots/src/gnurobots-1.2.0/src/grobot.c:106: undefined reference to `g_object_class_install_property'
  252. /tmp/yaourt-tmp-retry/aur-gnurobots/src/gnurobots-1.2.0/src/grobot.c:113: undefined reference to `g_param_spec_long'
  253. /tmp/yaourt-tmp-retry/aur-gnurobots/src/gnurobots-1.2.0/src/grobot.c:113: undefined reference to `g_type_check_class_cast'
  254. /tmp/yaourt-tmp-retry/aur-gnurobots/src/gnurobots-1.2.0/src/grobot.c:113: undefined reference to `g_object_class_install_property'
  255. /tmp/yaourt-tmp-retry/aur-gnurobots/src/gnurobots-1.2.0/src/grobot.c:120: undefined reference to `g_param_spec_long'
  256. /tmp/yaourt-tmp-retry/aur-gnurobots/src/gnurobots-1.2.0/src/grobot.c:120: undefined reference to `g_type_check_class_cast'
  257. /tmp/yaourt-tmp-retry/aur-gnurobots/src/gnurobots-1.2.0/src/grobot.c:120: undefined reference to `g_object_class_install_property'
  258. /tmp/yaourt-tmp-retry/aur-gnurobots/src/gnurobots-1.2.0/src/grobot.c:127: undefined reference to `g_param_spec_long'
  259. /tmp/yaourt-tmp-retry/aur-gnurobots/src/gnurobots-1.2.0/src/grobot.c:127: undefined reference to `g_type_check_class_cast'
  260. /tmp/yaourt-tmp-retry/aur-gnurobots/src/gnurobots-1.2.0/src/grobot.c:127: undefined reference to `g_object_class_install_property'
  261. /tmp/yaourt-tmp-retry/aur-gnurobots/src/gnurobots-1.2.0/src/grobot.c:134: undefined reference to `g_param_spec_long'
  262. /tmp/yaourt-tmp-retry/aur-gnurobots/src/gnurobots-1.2.0/src/grobot.c:134: undefined reference to `g_type_check_class_cast'
  263. /tmp/yaourt-tmp-retry/aur-gnurobots/src/gnurobots-1.2.0/src/grobot.c:134: undefined reference to `g_object_class_install_property'
  264. /tmp/yaourt-tmp-retry/aur-gnurobots/src/gnurobots-1.2.0/src/grobot.c:141: undefined reference to `g_param_spec_object'
  265. /tmp/yaourt-tmp-retry/aur-gnurobots/src/gnurobots-1.2.0/src/grobot.c:141: undefined reference to `g_type_check_class_cast'
  266. /tmp/yaourt-tmp-retry/aur-gnurobots/src/gnurobots-1.2.0/src/grobot.c:141: undefined reference to `g_object_class_install_property'
  267. /tmp/yaourt-tmp-retry/aur-gnurobots/src/gnurobots-1.2.0/src/grobot.c:148: undefined reference to `g_param_spec_object'
  268. /tmp/yaourt-tmp-retry/aur-gnurobots/src/gnurobots-1.2.0/src/grobot.c:148: undefined reference to `g_type_check_class_cast'
  269. /tmp/yaourt-tmp-retry/aur-gnurobots/src/gnurobots-1.2.0/src/grobot.c:148: undefined reference to `g_object_class_install_property'
  270. /tmp/yaourt-tmp-retry/aur-gnurobots/src/gnurobots-1.2.0/src/grobot.c:155: undefined reference to `g_cclosure_marshal_VOID__VOID'
  271. /tmp/yaourt-tmp-retry/aur-gnurobots/src/gnurobots-1.2.0/src/grobot.c:155: undefined reference to `g_signal_new'
  272. grobot.o: In function `g_robot_set_property':
  273. /tmp/yaourt-tmp-retry/aur-gnurobots/src/gnurobots-1.2.0/src/grobot.c:170: undefined reference to `g_type_check_instance_is_a'
  274. /tmp/yaourt-tmp-retry/aur-gnurobots/src/gnurobots-1.2.0/src/grobot.c:170: undefined reference to `g_return_if_fail_warning'
  275. /tmp/yaourt-tmp-retry/aur-gnurobots/src/gnurobots-1.2.0/src/grobot.c:172: undefined reference to `g_type_check_instance_cast'
  276. /tmp/yaourt-tmp-retry/aur-gnurobots/src/gnurobots-1.2.0/src/grobot.c:177: undefined reference to `g_value_get_int'
  277. /tmp/yaourt-tmp-retry/aur-gnurobots/src/gnurobots-1.2.0/src/grobot.c:180: undefined reference to `g_value_get_int'
  278. /tmp/yaourt-tmp-retry/aur-gnurobots/src/gnurobots-1.2.0/src/grobot.c:183: undefined reference to `g_value_get_int'
  279. /tmp/yaourt-tmp-retry/aur-gnurobots/src/gnurobots-1.2.0/src/grobot.c:186: undefined reference to `g_value_get_long'
  280. /tmp/yaourt-tmp-retry/aur-gnurobots/src/gnurobots-1.2.0/src/grobot.c:189: undefined reference to `g_value_get_long'
  281. /tmp/yaourt-tmp-retry/aur-gnurobots/src/gnurobots-1.2.0/src/grobot.c:192: undefined reference to `g_value_get_long'
  282. /tmp/yaourt-tmp-retry/aur-gnurobots/src/gnurobots-1.2.0/src/grobot.c:195: undefined reference to `g_value_get_long'
  283. /tmp/yaourt-tmp-retry/aur-gnurobots/src/gnurobots-1.2.0/src/grobot.c:198: undefined reference to `g_value_get_long'
  284. /tmp/yaourt-tmp-retry/aur-gnurobots/src/gnurobots-1.2.0/src/grobot.c:203: undefined reference to `g_object_unref'
  285. /tmp/yaourt-tmp-retry/aur-gnurobots/src/gnurobots-1.2.0/src/grobot.c:206: undefined reference to `g_value_get_object'
  286. /tmp/yaourt-tmp-retry/aur-gnurobots/src/gnurobots-1.2.0/src/grobot.c:209: undefined reference to `g_object_ref'
  287. /tmp/yaourt-tmp-retry/aur-gnurobots/src/gnurobots-1.2.0/src/grobot.c:220: undefined reference to `g_object_unref'
  288. /tmp/yaourt-tmp-retry/aur-gnurobots/src/gnurobots-1.2.0/src/grobot.c:223: undefined reference to `g_value_get_object'
  289. /tmp/yaourt-tmp-retry/aur-gnurobots/src/gnurobots-1.2.0/src/grobot.c:226: undefined reference to `g_object_ref'
  290. /tmp/yaourt-tmp-retry/aur-gnurobots/src/gnurobots-1.2.0/src/grobot.c:235: undefined reference to `g_type_name'
  291. /tmp/yaourt-tmp-retry/aur-gnurobots/src/gnurobots-1.2.0/src/grobot.c:235: undefined reference to `g_type_name'
  292. /tmp/yaourt-tmp-retry/aur-gnurobots/src/gnurobots-1.2.0/src/grobot.c:235: undefined reference to `g_log'
  293. grobot.o: In function `g_robot_get_property':
  294. /tmp/yaourt-tmp-retry/aur-gnurobots/src/gnurobots-1.2.0/src/grobot.c:247: undefined reference to `g_type_check_instance_is_a'
  295. /tmp/yaourt-tmp-retry/aur-gnurobots/src/gnurobots-1.2.0/src/grobot.c:247: undefined reference to `g_return_if_fail_warning'
  296. /tmp/yaourt-tmp-retry/aur-gnurobots/src/gnurobots-1.2.0/src/grobot.c:249: undefined reference to `g_type_check_instance_cast'
  297. /tmp/yaourt-tmp-retry/aur-gnurobots/src/gnurobots-1.2.0/src/grobot.c:254: undefined reference to `g_value_set_int'
  298. /tmp/yaourt-tmp-retry/aur-gnurobots/src/gnurobots-1.2.0/src/grobot.c:257: undefined reference to `g_value_set_int'
  299. /tmp/yaourt-tmp-retry/aur-gnurobots/src/gnurobots-1.2.0/src/grobot.c:260: undefined reference to `g_value_set_int'
  300. /tmp/yaourt-tmp-retry/aur-gnurobots/src/gnurobots-1.2.0/src/grobot.c:263: undefined reference to `g_value_set_long'
  301. /tmp/yaourt-tmp-retry/aur-gnurobots/src/gnurobots-1.2.0/src/grobot.c:266: undefined reference to `g_value_set_long'
  302. /tmp/yaourt-tmp-retry/aur-gnurobots/src/gnurobots-1.2.0/src/grobot.c:269: undefined reference to `g_value_set_long'
  303. /tmp/yaourt-tmp-retry/aur-gnurobots/src/gnurobots-1.2.0/src/grobot.c:272: undefined reference to `g_value_set_long'
  304. /tmp/yaourt-tmp-retry/aur-gnurobots/src/gnurobots-1.2.0/src/grobot.c:275: undefined reference to `g_value_set_long'
  305. /tmp/yaourt-tmp-retry/aur-gnurobots/src/gnurobots-1.2.0/src/grobot.c:278: undefined reference to `g_type_check_instance_cast'
  306. /tmp/yaourt-tmp-retry/aur-gnurobots/src/gnurobots-1.2.0/src/grobot.c:278: undefined reference to `g_object_ref'
  307. /tmp/yaourt-tmp-retry/aur-gnurobots/src/gnurobots-1.2.0/src/grobot.c:278: undefined reference to `g_value_set_object'
  308. /tmp/yaourt-tmp-retry/aur-gnurobots/src/gnurobots-1.2.0/src/grobot.c:281: undefined reference to `g_type_check_instance_cast'
  309. /tmp/yaourt-tmp-retry/aur-gnurobots/src/gnurobots-1.2.0/src/grobot.c:281: undefined reference to `g_object_ref'
  310. /tmp/yaourt-tmp-retry/aur-gnurobots/src/gnurobots-1.2.0/src/grobot.c:281: undefined reference to `g_value_set_object'
  311. /tmp/yaourt-tmp-retry/aur-gnurobots/src/gnurobots-1.2.0/src/grobot.c:284: undefined reference to `g_type_name'
  312. /tmp/yaourt-tmp-retry/aur-gnurobots/src/gnurobots-1.2.0/src/grobot.c:284: undefined reference to `g_type_name'
  313. /tmp/yaourt-tmp-retry/aur-gnurobots/src/gnurobots-1.2.0/src/grobot.c:284: undefined reference to `g_log'
  314. grobot.o: In function `g_robot_new':
  315. /tmp/yaourt-tmp-retry/aur-gnurobots/src/gnurobots-1.2.0/src/grobot.c:293: undefined reference to `g_object_new'
  316. /tmp/yaourt-tmp-retry/aur-gnurobots/src/gnurobots-1.2.0/src/grobot.c:293: undefined reference to `g_type_check_instance_cast'
  317. grobot.o: In function `g_robot_dispose':
  318. /tmp/yaourt-tmp-retry/aur-gnurobots/src/gnurobots-1.2.0/src/grobot.c:306: undefined reference to `g_type_check_instance_cast'
  319. /tmp/yaourt-tmp-retry/aur-gnurobots/src/gnurobots-1.2.0/src/grobot.c:310: undefined reference to `g_type_check_instance_cast'
  320. /tmp/yaourt-tmp-retry/aur-gnurobots/src/gnurobots-1.2.0/src/grobot.c:310: undefined reference to `g_object_unref'
  321. /tmp/yaourt-tmp-retry/aur-gnurobots/src/gnurobots-1.2.0/src/grobot.c:315: undefined reference to `g_type_check_instance_cast'
  322. /tmp/yaourt-tmp-retry/aur-gnurobots/src/gnurobots-1.2.0/src/grobot.c:315: undefined reference to `g_object_unref'
  323. grobot.o: In function `g_robot_turn':
  324. /tmp/yaourt-tmp-retry/aur-gnurobots/src/gnurobots-1.2.0/src/grobot.c:350: undefined reference to `gdk_threads_enter'
  325. /tmp/yaourt-tmp-retry/aur-gnurobots/src/gnurobots-1.2.0/src/grobot.c:354: undefined reference to `gdk_threads_leave'
  326. /tmp/yaourt-tmp-retry/aur-gnurobots/src/gnurobots-1.2.0/src/grobot.c:360: undefined reference to `g_signal_emit'
  327. grobot.o: In function `g_robot_move':
  328. /tmp/yaourt-tmp-retry/aur-gnurobots/src/gnurobots-1.2.0/src/grobot.c:371: undefined reference to `g_return_if_fail_warning'
  329. /tmp/yaourt-tmp-retry/aur-gnurobots/src/gnurobots-1.2.0/src/grobot.c:409: undefined reference to `g_signal_emit'
  330. /tmp/yaourt-tmp-retry/aur-gnurobots/src/gnurobots-1.2.0/src/grobot.c:419: undefined reference to `gdk_threads_enter'
  331. /tmp/yaourt-tmp-retry/aur-gnurobots/src/gnurobots-1.2.0/src/grobot.c:422: undefined reference to `gdk_threads_leave'
  332. /tmp/yaourt-tmp-retry/aur-gnurobots/src/gnurobots-1.2.0/src/grobot.c:435: undefined reference to `g_signal_emit'
  333. /tmp/yaourt-tmp-retry/aur-gnurobots/src/gnurobots-1.2.0/src/grobot.c:446: undefined reference to `g_signal_emit'
  334. /tmp/yaourt-tmp-retry/aur-gnurobots/src/gnurobots-1.2.0/src/grobot.c:456: undefined reference to `g_signal_emit'
  335. grobot.o: In function `g_robot_smell':
  336. /tmp/yaourt-tmp-retry/aur-gnurobots/src/gnurobots-1.2.0/src/grobot.c:472: undefined reference to `g_return_if_fail_warning'
  337. /tmp/yaourt-tmp-retry/aur-gnurobots/src/gnurobots-1.2.0/src/grobot.c:480: undefined reference to `g_signal_emit'
  338. /tmp/yaourt-tmp-retry/aur-gnurobots/src/gnurobots-1.2.0/src/grobot.c:483: undefined reference to `gdk_threads_enter'
  339. /tmp/yaourt-tmp-retry/aur-gnurobots/src/gnurobots-1.2.0/src/grobot.c:486: undefined reference to `gdk_threads_leave'
  340. grobot.o: In function `g_robot_feel':
  341. /tmp/yaourt-tmp-retry/aur-gnurobots/src/gnurobots-1.2.0/src/grobot.c:514: undefined reference to `g_return_if_fail_warning'
  342. /tmp/yaourt-tmp-retry/aur-gnurobots/src/gnurobots-1.2.0/src/grobot.c:542: undefined reference to `g_signal_emit'
  343. /tmp/yaourt-tmp-retry/aur-gnurobots/src/gnurobots-1.2.0/src/grobot.c:549: undefined reference to `gdk_threads_enter'
  344. /tmp/yaourt-tmp-retry/aur-gnurobots/src/gnurobots-1.2.0/src/grobot.c:552: undefined reference to `gdk_threads_leave'
  345. /tmp/yaourt-tmp-retry/aur-gnurobots/src/gnurobots-1.2.0/src/grobot.c:559: undefined reference to `g_signal_emit'
  346. grobot.o: In function `g_robot_look':
  347. /tmp/yaourt-tmp-retry/aur-gnurobots/src/gnurobots-1.2.0/src/grobot.c:578: undefined reference to `g_return_if_fail_warning'
  348. /tmp/yaourt-tmp-retry/aur-gnurobots/src/gnurobots-1.2.0/src/grobot.c:606: undefined reference to `g_signal_emit'
  349. /tmp/yaourt-tmp-retry/aur-gnurobots/src/gnurobots-1.2.0/src/grobot.c:613: undefined reference to `gdk_threads_enter'
  350. /tmp/yaourt-tmp-retry/aur-gnurobots/src/gnurobots-1.2.0/src/grobot.c:616: undefined reference to `gdk_threads_leave'
  351. grobot.o: In function `g_robot_grab':
  352. /tmp/yaourt-tmp-retry/aur-gnurobots/src/gnurobots-1.2.0/src/grobot.c:640: undefined reference to `g_return_if_fail_warning'
  353. /tmp/yaourt-tmp-retry/aur-gnurobots/src/gnurobots-1.2.0/src/grobot.c:672: undefined reference to `g_signal_emit'
  354. /tmp/yaourt-tmp-retry/aur-gnurobots/src/gnurobots-1.2.0/src/grobot.c:675: undefined reference to `gdk_threads_enter'
  355. /tmp/yaourt-tmp-retry/aur-gnurobots/src/gnurobots-1.2.0/src/grobot.c:678: undefined reference to `gdk_threads_leave'
  356. /tmp/yaourt-tmp-retry/aur-gnurobots/src/gnurobots-1.2.0/src/grobot.c:694: undefined reference to `g_signal_emit'
  357. /tmp/yaourt-tmp-retry/aur-gnurobots/src/gnurobots-1.2.0/src/grobot.c:710: undefined reference to `gdk_threads_enter'
  358. /tmp/yaourt-tmp-retry/aur-gnurobots/src/gnurobots-1.2.0/src/grobot.c:712: undefined reference to `gdk_threads_leave'
  359. grobot.o: In function `g_robot_zap':
  360. /tmp/yaourt-tmp-retry/aur-gnurobots/src/gnurobots-1.2.0/src/grobot.c:722: undefined reference to `g_return_if_fail_warning'
  361. /tmp/yaourt-tmp-retry/aur-gnurobots/src/gnurobots-1.2.0/src/grobot.c:754: undefined reference to `g_signal_emit'
  362. /tmp/yaourt-tmp-retry/aur-gnurobots/src/gnurobots-1.2.0/src/grobot.c:757: undefined reference to `gdk_threads_enter'
  363. /tmp/yaourt-tmp-retry/aur-gnurobots/src/gnurobots-1.2.0/src/grobot.c:760: undefined reference to `gdk_threads_leave'
  364. /tmp/yaourt-tmp-retry/aur-gnurobots/src/gnurobots-1.2.0/src/grobot.c:774: undefined reference to `gdk_threads_enter'
  365. /tmp/yaourt-tmp-retry/aur-gnurobots/src/gnurobots-1.2.0/src/grobot.c:776: undefined reference to `gdk_threads_leave'
  366. /tmp/yaourt-tmp-retry/aur-gnurobots/src/gnurobots-1.2.0/src/grobot.c:782: undefined reference to `gdk_threads_enter'
  367. /tmp/yaourt-tmp-retry/aur-gnurobots/src/gnurobots-1.2.0/src/grobot.c:784: undefined reference to `gdk_threads_leave'
  368. grobot.o: In function `g_robot_stop':
  369. /tmp/yaourt-tmp-retry/aur-gnurobots/src/gnurobots-1.2.0/src/grobot.c:794: undefined reference to `g_signal_emit'
  370. ui-window.o: In function `g_once_init_enter':
  371. /usr/include/glib-2.0/glib/gthread.h:348: undefined reference to `g_atomic_pointer_get'
  372. /usr/include/glib-2.0/glib/gthread.h:351: undefined reference to `g_once_init_enter_impl'
  373. ui-window.o: In function `ui_window_class_intern_init':
  374. /tmp/yaourt-tmp-retry/aur-gnurobots/src/gnurobots-1.2.0/src/ui-window.c:34: undefined reference to `g_type_class_peek_parent'
  375. ui-window.o: In function `ui_window_get_type':
  376. /tmp/yaourt-tmp-retry/aur-gnurobots/src/gnurobots-1.2.0/src/ui-window.c:34: undefined reference to `g_intern_static_string'
  377. /tmp/yaourt-tmp-retry/aur-gnurobots/src/gnurobots-1.2.0/src/ui-window.c:34: undefined reference to `gtk_window_get_type'
  378. /tmp/yaourt-tmp-retry/aur-gnurobots/src/gnurobots-1.2.0/src/ui-window.c:34: undefined reference to `g_type_register_static_simple'
  379. /tmp/yaourt-tmp-retry/aur-gnurobots/src/gnurobots-1.2.0/src/ui-window.c:34: undefined reference to `g_once_init_leave'
  380. ui-window.o: In function `ui_window_new':
  381. /tmp/yaourt-tmp-retry/aur-gnurobots/src/gnurobots-1.2.0/src/ui-window.c:40: undefined reference to `gtk_widget_get_type'
  382. /tmp/yaourt-tmp-retry/aur-gnurobots/src/gnurobots-1.2.0/src/ui-window.c:40: undefined reference to `g_object_new'
  383. /tmp/yaourt-tmp-retry/aur-gnurobots/src/gnurobots-1.2.0/src/ui-window.c:40: undefined reference to `g_type_check_instance_cast'
  384. ui-window.o: In function `on_ui_window_destroy':
  385. /tmp/yaourt-tmp-retry/aur-gnurobots/src/gnurobots-1.2.0/src/ui-window.c:45: undefined reference to `gtk_widget_hide'
  386. /tmp/yaourt-tmp-retry/aur-gnurobots/src/gnurobots-1.2.0/src/ui-window.c:46: undefined reference to `gtk_main_quit'
  387. ui-window.o: In function `ui_window_init':
  388. /tmp/yaourt-tmp-retry/aur-gnurobots/src/gnurobots-1.2.0/src/ui-window.c:52: undefined reference to `g_type_instance_get_private'
  389. /tmp/yaourt-tmp-retry/aur-gnurobots/src/gnurobots-1.2.0/src/ui-window.c:54: undefined reference to `g_type_check_instance_cast'
  390. /tmp/yaourt-tmp-retry/aur-gnurobots/src/gnurobots-1.2.0/src/ui-window.c:54: undefined reference to `g_signal_connect_data'
  391. /tmp/yaourt-tmp-retry/aur-gnurobots/src/gnurobots-1.2.0/src/ui-window.c:57: undefined reference to `gtk_window_get_type'
  392. /tmp/yaourt-tmp-retry/aur-gnurobots/src/gnurobots-1.2.0/src/ui-window.c:57: undefined reference to `g_type_check_instance_cast'
  393. /tmp/yaourt-tmp-retry/aur-gnurobots/src/gnurobots-1.2.0/src/ui-window.c:57: undefined reference to `gtk_window_set_title'
  394. /tmp/yaourt-tmp-retry/aur-gnurobots/src/gnurobots-1.2.0/src/ui-window.c:58: undefined reference to `gtk_window_get_type'
  395. /tmp/yaourt-tmp-retry/aur-gnurobots/src/gnurobots-1.2.0/src/ui-window.c:58: undefined reference to `g_type_check_instance_cast'
  396. /tmp/yaourt-tmp-retry/aur-gnurobots/src/gnurobots-1.2.0/src/ui-window.c:58: undefined reference to `gtk_window_set_resizable'
  397. ui-window.o: In function `ui_window_postinit':
  398. /tmp/yaourt-tmp-retry/aur-gnurobots/src/gnurobots-1.2.0/src/ui-window.c:65: undefined reference to `gtk_vbox_new'
  399. /tmp/yaourt-tmp-retry/aur-gnurobots/src/gnurobots-1.2.0/src/ui-window.c:68: undefined reference to `g_type_check_instance_cast'
  400. /tmp/yaourt-tmp-retry/aur-gnurobots/src/gnurobots-1.2.0/src/ui-window.c:71: undefined reference to `gtk_box_get_type'
  401. /tmp/yaourt-tmp-retry/aur-gnurobots/src/gnurobots-1.2.0/src/ui-window.c:71: undefined reference to `g_type_check_instance_cast'
  402. /tmp/yaourt-tmp-retry/aur-gnurobots/src/gnurobots-1.2.0/src/ui-window.c:71: undefined reference to `gtk_box_pack_start'
  403. /tmp/yaourt-tmp-retry/aur-gnurobots/src/gnurobots-1.2.0/src/ui-window.c:72: undefined reference to `gtk_box_get_type'
  404. /tmp/yaourt-tmp-retry/aur-gnurobots/src/gnurobots-1.2.0/src/ui-window.c:72: undefined reference to `g_type_check_instance_cast'
  405. /tmp/yaourt-tmp-retry/aur-gnurobots/src/gnurobots-1.2.0/src/ui-window.c:72: undefined reference to `gtk_box_pack_start'
  406. /tmp/yaourt-tmp-retry/aur-gnurobots/src/gnurobots-1.2.0/src/ui-window.c:74: undefined reference to `gtk_container_get_type'
  407. /tmp/yaourt-tmp-retry/aur-gnurobots/src/gnurobots-1.2.0/src/ui-window.c:74: undefined reference to `g_type_check_instance_cast'
  408. /tmp/yaourt-tmp-retry/aur-gnurobots/src/gnurobots-1.2.0/src/ui-window.c:74: undefined reference to `gtk_container_add'
  409. /tmp/yaourt-tmp-retry/aur-gnurobots/src/gnurobots-1.2.0/src/ui-window.c:76: undefined reference to `gtk_widget_show'
  410. /tmp/yaourt-tmp-retry/aur-gnurobots/src/gnurobots-1.2.0/src/ui-window.c:77: undefined reference to `gtk_widget_show'
  411. /tmp/yaourt-tmp-retry/aur-gnurobots/src/gnurobots-1.2.0/src/ui-window.c:78: undefined reference to `gtk_widget_show'
  412. /tmp/yaourt-tmp-retry/aur-gnurobots/src/gnurobots-1.2.0/src/ui-window.c:79: undefined reference to `gtk_widget_get_type'
  413. /tmp/yaourt-tmp-retry/aur-gnurobots/src/gnurobots-1.2.0/src/ui-window.c:79: undefined reference to `g_type_check_instance_cast'
  414. /tmp/yaourt-tmp-retry/aur-gnurobots/src/gnurobots-1.2.0/src/ui-window.c:79: undefined reference to `gtk_widget_show'
  415. /tmp/yaourt-tmp-retry/aur-gnurobots/src/gnurobots-1.2.0/src/ui-window.c:81: undefined reference to `g_type_check_instance_cast'
  416. ui-window.o: In function `ui_window_class_init':
  417. /tmp/yaourt-tmp-retry/aur-gnurobots/src/gnurobots-1.2.0/src/ui-window.c:86: undefined reference to `g_type_check_class_cast'
  418. /tmp/yaourt-tmp-retry/aur-gnurobots/src/gnurobots-1.2.0/src/ui-window.c:86: undefined reference to `g_type_class_add_private'
  419. ui-cmdwin.o: In function `g_once_init_enter':
  420. /usr/include/glib-2.0/glib/gthread.h:348: undefined reference to `g_atomic_pointer_get'
  421. /usr/include/glib-2.0/glib/gthread.h:351: undefined reference to `g_once_init_enter_impl'
  422. ui-cmdwin.o: In function `ui_cmdwin_class_intern_init':
  423. /tmp/yaourt-tmp-retry/aur-gnurobots/src/gnurobots-1.2.0/src/ui-cmdwin.c:36: undefined reference to `g_type_class_peek_parent'
  424. ui-cmdwin.o: In function `ui_cmdwin_get_type':
  425. /tmp/yaourt-tmp-retry/aur-gnurobots/src/gnurobots-1.2.0/src/ui-cmdwin.c:36: undefined reference to `g_intern_static_string'
  426. /tmp/yaourt-tmp-retry/aur-gnurobots/src/gnurobots-1.2.0/src/ui-cmdwin.c:36: undefined reference to `gtk_vbox_get_type'
  427. /tmp/yaourt-tmp-retry/aur-gnurobots/src/gnurobots-1.2.0/src/ui-cmdwin.c:36: undefined reference to `g_type_register_static_simple'
  428. /tmp/yaourt-tmp-retry/aur-gnurobots/src/gnurobots-1.2.0/src/ui-cmdwin.c:36: undefined reference to `g_once_init_leave'
  429. ui-cmdwin.o: In function `ui_cmdwin_new':
  430. /tmp/yaourt-tmp-retry/aur-gnurobots/src/gnurobots-1.2.0/src/ui-cmdwin.c:40: undefined reference to `gtk_widget_get_type'
  431. /tmp/yaourt-tmp-retry/aur-gnurobots/src/gnurobots-1.2.0/src/ui-cmdwin.c:40: undefined reference to `g_object_new'
  432. /tmp/yaourt-tmp-retry/aur-gnurobots/src/gnurobots-1.2.0/src/ui-cmdwin.c:40: undefined reference to `g_type_check_instance_cast'
  433. ui-cmdwin.o: In function `ui_cmdwin_init':
  434. /tmp/yaourt-tmp-retry/aur-gnurobots/src/gnurobots-1.2.0/src/ui-cmdwin.c:48: undefined reference to `g_type_instance_get_private'
  435. /tmp/yaourt-tmp-retry/aur-gnurobots/src/gnurobots-1.2.0/src/ui-cmdwin.c:50: undefined reference to `vte_terminal_new'
  436. /tmp/yaourt-tmp-retry/aur-gnurobots/src/gnurobots-1.2.0/src/ui-cmdwin.c:52: undefined reference to `gtk_box_get_type'
  437. /tmp/yaourt-tmp-retry/aur-gnurobots/src/gnurobots-1.2.0/src/ui-cmdwin.c:52: undefined reference to `g_type_check_instance_cast'
  438. /tmp/yaourt-tmp-retry/aur-gnurobots/src/gnurobots-1.2.0/src/ui-cmdwin.c:52: undefined reference to `gtk_box_pack_start'
  439. /tmp/yaourt-tmp-retry/aur-gnurobots/src/gnurobots-1.2.0/src/ui-cmdwin.c:54: undefined reference to `gtk_widget_get_type'
  440. /tmp/yaourt-tmp-retry/aur-gnurobots/src/gnurobots-1.2.0/src/ui-cmdwin.c:54: undefined reference to `g_type_check_instance_cast'
  441. /tmp/yaourt-tmp-retry/aur-gnurobots/src/gnurobots-1.2.0/src/ui-cmdwin.c:54: undefined reference to `gtk_widget_set_size_request'
  442. /tmp/yaourt-tmp-retry/aur-gnurobots/src/gnurobots-1.2.0/src/ui-cmdwin.c:56: undefined reference to `g_assertion_message_expr'
  443. /tmp/yaourt-tmp-retry/aur-gnurobots/src/gnurobots-1.2.0/src/ui-cmdwin.c:57: undefined reference to `vte_terminal_get_type'
  444. /tmp/yaourt-tmp-retry/aur-gnurobots/src/gnurobots-1.2.0/src/ui-cmdwin.c:57: undefined reference to `g_type_check_instance_cast'
  445. /tmp/yaourt-tmp-retry/aur-gnurobots/src/gnurobots-1.2.0/src/ui-cmdwin.c:57: undefined reference to `vte_terminal_set_pty'
  446. /tmp/yaourt-tmp-retry/aur-gnurobots/src/gnurobots-1.2.0/src/ui-cmdwin.c:61: undefined reference to `rl_instream'
  447. /tmp/yaourt-tmp-retry/aur-gnurobots/src/gnurobots-1.2.0/src/ui-cmdwin.c:62: undefined reference to `rl_outstream'
  448. /tmp/yaourt-tmp-retry/aur-gnurobots/src/gnurobots-1.2.0/src/ui-cmdwin.c:64: undefined reference to `gtk_widget_show'
  449. ui-cmdwin.o: In function `ui_cmdwin_class_init':
  450. /tmp/yaourt-tmp-retry/aur-gnurobots/src/gnurobots-1.2.0/src/ui-cmdwin.c:69: undefined reference to `g_type_check_class_cast'
  451. /tmp/yaourt-tmp-retry/aur-gnurobots/src/gnurobots-1.2.0/src/ui-cmdwin.c:69: undefined reference to `g_type_class_add_private'
  452. ui-cmdwin.o: In function `ui_cmdwin_get_string':
  453. /tmp/yaourt-tmp-retry/aur-gnurobots/src/gnurobots-1.2.0/src/ui-cmdwin.c:78: undefined reference to `readline'
  454. /tmp/yaourt-tmp-retry/aur-gnurobots/src/gnurobots-1.2.0/src/ui-cmdwin.c:82: undefined reference to `add_history'
  455. /tmp/yaourt-tmp-retry/aur-gnurobots/src/gnurobots-1.2.0/src/ui-cmdwin.c:83: undefined reference to `g_strlcpy'
  456. ui-arena.o: In function `g_once_init_enter':
  457. /usr/include/glib-2.0/glib/gthread.h:348: undefined reference to `g_atomic_pointer_get'
  458. /usr/include/glib-2.0/glib/gthread.h:351: undefined reference to `g_once_init_enter_impl'
  459. ui-arena.o: In function `ui_arena_class_intern_init':
  460. /tmp/yaourt-tmp-retry/aur-gnurobots/src/gnurobots-1.2.0/src/ui-arena.c:73: undefined reference to `g_type_class_peek_parent'
  461. ui-arena.o: In function `ui_arena_get_type':
  462. /tmp/yaourt-tmp-retry/aur-gnurobots/src/gnurobots-1.2.0/src/ui-arena.c:73: undefined reference to `g_intern_static_string'
  463. /tmp/yaourt-tmp-retry/aur-gnurobots/src/gnurobots-1.2.0/src/ui-arena.c:73: undefined reference to `gtk_drawing_area_get_type'
  464. /tmp/yaourt-tmp-retry/aur-gnurobots/src/gnurobots-1.2.0/src/ui-arena.c:73: undefined reference to `g_type_register_static_simple'
  465. /tmp/yaourt-tmp-retry/aur-gnurobots/src/gnurobots-1.2.0/src/ui-arena.c:73: undefined reference to `g_once_init_leave'
  466. ui-arena.o: In function `ui_arena_new':
  467. /tmp/yaourt-tmp-retry/aur-gnurobots/src/gnurobots-1.2.0/src/ui-arena.c:84: undefined reference to `gtk_widget_get_type'
  468. /tmp/yaourt-tmp-retry/aur-gnurobots/src/gnurobots-1.2.0/src/ui-arena.c:84: undefined reference to `g_object_new'
  469. /tmp/yaourt-tmp-retry/aur-gnurobots/src/gnurobots-1.2.0/src/ui-arena.c:84: undefined reference to `g_type_check_instance_cast'
  470. ui-arena.o: In function `ui_arena_init':
  471. /tmp/yaourt-tmp-retry/aur-gnurobots/src/gnurobots-1.2.0/src/ui-arena.c:89: undefined reference to `g_type_instance_get_private'
  472. /tmp/yaourt-tmp-retry/aur-gnurobots/src/gnurobots-1.2.0/src/ui-arena.c:95: undefined reference to `pango_font_description_from_string'
  473. /tmp/yaourt-tmp-retry/aur-gnurobots/src/gnurobots-1.2.0/src/ui-arena.c:95: undefined reference to `gdk_font_from_description'
  474. /tmp/yaourt-tmp-retry/aur-gnurobots/src/gnurobots-1.2.0/src/ui-arena.c:98: undefined reference to `gtk_widget_get_type'
  475. /tmp/yaourt-tmp-retry/aur-gnurobots/src/gnurobots-1.2.0/src/ui-arena.c:98: undefined reference to `g_type_check_instance_cast'
  476. /tmp/yaourt-tmp-retry/aur-gnurobots/src/gnurobots-1.2.0/src/ui-arena.c:98: undefined reference to `gtk_widget_set_size_request'
  477. /tmp/yaourt-tmp-retry/aur-gnurobots/src/gnurobots-1.2.0/src/ui-arena.c:101: undefined reference to `g_type_check_instance_cast'
  478. /tmp/yaourt-tmp-retry/aur-gnurobots/src/gnurobots-1.2.0/src/ui-arena.c:101: undefined reference to `g_signal_connect_data'
  479. /tmp/yaourt-tmp-retry/aur-gnurobots/src/gnurobots-1.2.0/src/ui-arena.c:103: undefined reference to `g_type_check_instance_cast'
  480. /tmp/yaourt-tmp-retry/aur-gnurobots/src/gnurobots-1.2.0/src/ui-arena.c:103: undefined reference to `g_signal_connect_data'
  481. /tmp/yaourt-tmp-retry/aur-gnurobots/src/gnurobots-1.2.0/src/ui-arena.c:106: undefined reference to `gtk_widget_get_type'
  482. /tmp/yaourt-tmp-retry/aur-gnurobots/src/gnurobots-1.2.0/src/ui-arena.c:106: undefined reference to `g_type_check_instance_cast'
  483. /tmp/yaourt-tmp-retry/aur-gnurobots/src/gnurobots-1.2.0/src/ui-arena.c:106: undefined reference to `gtk_widget_set_events'
  484. ui-arena.o: In function `ui_arena_class_init':
  485. /tmp/yaourt-tmp-retry/aur-gnurobots/src/gnurobots-1.2.0/src/ui-arena.c:112: undefined reference to `g_type_check_class_cast'
  486. /tmp/yaourt-tmp-retry/aur-gnurobots/src/gnurobots-1.2.0/src/ui-arena.c:112: undefined reference to `g_type_class_add_private'
  487. ui-arena.o: In function `ui_arena_expose':
  488. /tmp/yaourt-tmp-retry/aur-gnurobots/src/gnurobots-1.2.0/src/ui-arena.c:120: undefined reference to `gtk_widget_get_type'
  489. /tmp/yaourt-tmp-retry/aur-gnurobots/src/gnurobots-1.2.0/src/ui-arena.c:120: undefined reference to `g_type_check_instance_cast'
  490. /tmp/yaourt-tmp-retry/aur-gnurobots/src/gnurobots-1.2.0/src/ui-arena.c:119: undefined reference to `gdk_draw_drawable'
  491. /tmp/yaourt-tmp-retry/aur-gnurobots/src/gnurobots-1.2.0/src/ui-arena.c:126: undefined reference to `gdk_draw_rectangle'
  492. ui-arena.o: In function `ui_arena_configure':
  493. /tmp/yaourt-tmp-retry/aur-gnurobots/src/gnurobots-1.2.0/src/ui-arena.c:138: undefined reference to `g_object_unref'
  494. /tmp/yaourt-tmp-retry/aur-gnurobots/src/gnurobots-1.2.0/src/ui-arena.c:140: undefined reference to `gdk_pixmap_new'
  495. /tmp/yaourt-tmp-retry/aur-gnurobots/src/gnurobots-1.2.0/src/ui-arena.c:143: undefined reference to `gdk_draw_rectangle'
  496. ui-arena.o: In function `ui_arena_set_map':
  497. /tmp/yaourt-tmp-retry/aur-gnurobots/src/gnurobots-1.2.0/src/ui-arena.c:153: undefined reference to `g_type_check_instance_cast'
  498. /tmp/yaourt-tmp-retry/aur-gnurobots/src/gnurobots-1.2.0/src/ui-arena.c:153: undefined reference to `g_object_get'
  499. /tmp/yaourt-tmp-retry/aur-gnurobots/src/gnurobots-1.2.0/src/ui-arena.c:159: undefined reference to `gtk_widget_get_type'
  500. /tmp/yaourt-tmp-retry/aur-gnurobots/src/gnurobots-1.2.0/src/ui-arena.c:159: undefined reference to `g_type_check_instance_cast'
  501. /tmp/yaourt-tmp-retry/aur-gnurobots/src/gnurobots-1.2.0/src/ui-arena.c:159: undefined reference to `gtk_widget_set_size_request'
  502. ui-arena.o: In function `ui_arena_draw':
  503. /tmp/yaourt-tmp-retry/aur-gnurobots/src/gnurobots-1.2.0/src/ui-arena.c:212: undefined reference to `gtk_widget_get_type'
  504. /tmp/yaourt-tmp-retry/aur-gnurobots/src/gnurobots-1.2.0/src/ui-arena.c:212: undefined reference to `g_type_check_instance_cast'
  505. /tmp/yaourt-tmp-retry/aur-gnurobots/src/gnurobots-1.2.0/src/ui-arena.c:212: undefined reference to `gtk_widget_queue_draw_area'
  506. ui-arena.o: In function `create_image':
  507. /tmp/yaourt-tmp-retry/aur-gnurobots/src/gnurobots-1.2.0/src/ui-arena.c:233: undefined reference to `gdk_drawable_get_type'
  508. /tmp/yaourt-tmp-retry/aur-gnurobots/src/gnurobots-1.2.0/src/ui-arena.c:233: undefined reference to `g_type_check_instance_cast'
  509. /tmp/yaourt-tmp-retry/aur-gnurobots/src/gnurobots-1.2.0/src/ui-arena.c:233: undefined reference to `gdk_pixmap_create_from_xpm_d'
  510. /tmp/yaourt-tmp-retry/aur-gnurobots/src/gnurobots-1.2.0/src/ui-arena.c:236: undefined reference to `g_fprintf'
  511. ui-arena.o: In function `put_tile':
  512. /tmp/yaourt-tmp-retry/aur-gnurobots/src/gnurobots-1.2.0/src/ui-arena.c:243: undefined reference to `gdk_drawable_get_type'
  513. /tmp/yaourt-tmp-retry/aur-gnurobots/src/gnurobots-1.2.0/src/ui-arena.c:243: undefined reference to `g_type_check_instance_cast'
  514. /tmp/yaourt-tmp-retry/aur-gnurobots/src/gnurobots-1.2.0/src/ui-arena.c:242: undefined reference to `gtk_widget_get_type'
  515. /tmp/yaourt-tmp-retry/aur-gnurobots/src/gnurobots-1.2.0/src/ui-arena.c:242: undefined reference to `g_type_check_instance_cast'
  516. /tmp/yaourt-tmp-retry/aur-gnurobots/src/gnurobots-1.2.0/src/ui-arena.c:242: undefined reference to `gtk_widget_get_type'
  517. /tmp/yaourt-tmp-retry/aur-gnurobots/src/gnurobots-1.2.0/src/ui-arena.c:242: undefined reference to `g_type_check_instance_cast'
  518. /tmp/yaourt-tmp-retry/aur-gnurobots/src/gnurobots-1.2.0/src/ui-arena.c:241: undefined reference to `gdk_draw_drawable'
  519. ui-arena.o: In function `ui_arena_update_status':
  520. /tmp/yaourt-tmp-retry/aur-gnurobots/src/gnurobots-1.2.0/src/ui-arena.c:255: undefined reference to `gtk_widget_get_type'
  521. /tmp/yaourt-tmp-retry/aur-gnurobots/src/gnurobots-1.2.0/src/ui-arena.c:255: undefined reference to `g_type_check_instance_cast'
  522. /tmp/yaourt-tmp-retry/aur-gnurobots/src/gnurobots-1.2.0/src/ui-arena.c:254: undefined reference to `gdk_draw_drawable'
  523. /tmp/yaourt-tmp-retry/aur-gnurobots/src/gnurobots-1.2.0/src/ui-arena.c:262: undefined reference to `gtk_widget_get_type'
  524. /tmp/yaourt-tmp-retry/aur-gnurobots/src/gnurobots-1.2.0/src/ui-arena.c:262: undefined reference to `g_type_check_instance_cast'
  525. /tmp/yaourt-tmp-retry/aur-gnurobots/src/gnurobots-1.2.0/src/ui-arena.c:261: undefined reference to `gdk_draw_string'
  526. /tmp/yaourt-tmp-retry/aur-gnurobots/src/gnurobots-1.2.0/src/ui-arena.c:267: undefined reference to `g_sprintf'
  527. /tmp/yaourt-tmp-retry/aur-gnurobots/src/gnurobots-1.2.0/src/ui-arena.c:269: undefined reference to `gtk_widget_get_type'
  528. /tmp/yaourt-tmp-retry/aur-gnurobots/src/gnurobots-1.2.0/src/ui-arena.c:269: undefined reference to `g_type_check_instance_cast'
  529. /tmp/yaourt-tmp-retry/aur-gnurobots/src/gnurobots-1.2.0/src/ui-arena.c:268: undefined reference to `gdk_draw_string'
  530. /tmp/yaourt-tmp-retry/aur-gnurobots/src/gnurobots-1.2.0/src/ui-arena.c:275: undefined reference to `g_sprintf'
  531. /tmp/yaourt-tmp-retry/aur-gnurobots/src/gnurobots-1.2.0/src/ui-arena.c:277: undefined reference to `gtk_widget_get_type'
  532. /tmp/yaourt-tmp-retry/aur-gnurobots/src/gnurobots-1.2.0/src/ui-arena.c:277: undefined reference to `g_type_check_instance_cast'
  533. /tmp/yaourt-tmp-retry/aur-gnurobots/src/gnurobots-1.2.0/src/ui-arena.c:276: undefined reference to `gdk_draw_string'
  534. /tmp/yaourt-tmp-retry/aur-gnurobots/src/gnurobots-1.2.0/src/ui-arena.c:283: undefined reference to `g_sprintf'
  535. /tmp/yaourt-tmp-retry/aur-gnurobots/src/gnurobots-1.2.0/src/ui-arena.c:285: undefined reference to `gtk_widget_get_type'
  536. /tmp/yaourt-tmp-retry/aur-gnurobots/src/gnurobots-1.2.0/src/ui-arena.c:285: undefined reference to `g_type_check_instance_cast'
  537. /tmp/yaourt-tmp-retry/aur-gnurobots/src/gnurobots-1.2.0/src/ui-arena.c:284: undefined reference to `gdk_draw_string'
  538. /tmp/yaourt-tmp-retry/aur-gnurobots/src/gnurobots-1.2.0/src/ui-arena.c:289: undefined reference to `gtk_widget_get_type'
  539. /tmp/yaourt-tmp-retry/aur-gnurobots/src/gnurobots-1.2.0/src/ui-arena.c:289: undefined reference to `g_type_check_instance_cast'
  540. /tmp/yaourt-tmp-retry/aur-gnurobots/src/gnurobots-1.2.0/src/ui-arena.c:289: undefined reference to `gtk_widget_queue_draw_area'
  541. ui-arena.o: In function `ui_arena_add_thing':
  542. /tmp/yaourt-tmp-retry/aur-gnurobots/src/gnurobots-1.2.0/src/ui-arena.c:327: undefined reference to `gtk_widget_get_type'
  543. /tmp/yaourt-tmp-retry/aur-gnurobots/src/gnurobots-1.2.0/src/ui-arena.c:327: undefined reference to `g_type_check_instance_cast'
  544. /tmp/yaourt-tmp-retry/aur-gnurobots/src/gnurobots-1.2.0/src/ui-arena.c:327: undefined reference to `gtk_widget_queue_draw_area'
  545. ui-arena.o: In function `ui_arena_move_robot':
  546. /tmp/yaourt-tmp-retry/aur-gnurobots/src/gnurobots-1.2.0/src/ui-arena.c:340: undefined reference to `g_assertion_message_expr'
  547. /tmp/yaourt-tmp-retry/aur-gnurobots/src/gnurobots-1.2.0/src/ui-arena.c:352: undefined reference to `gtk_widget_get_type'
  548. /tmp/yaourt-tmp-retry/aur-gnurobots/src/gnurobots-1.2.0/src/ui-arena.c:352: undefined reference to `g_type_check_instance_cast'
  549. /tmp/yaourt-tmp-retry/aur-gnurobots/src/gnurobots-1.2.0/src/ui-arena.c:352: undefined reference to `gtk_widget_queue_draw_area'
  550. /tmp/yaourt-tmp-retry/aur-gnurobots/src/gnurobots-1.2.0/src/ui-arena.c:377: undefined reference to `g_printf'
  551. /tmp/yaourt-tmp-retry/aur-gnurobots/src/gnurobots-1.2.0/src/ui-arena.c:408: undefined reference to `gtk_widget_get_type'
  552. /tmp/yaourt-tmp-retry/aur-gnurobots/src/gnurobots-1.2.0/src/ui-arena.c:408: undefined reference to `g_type_check_instance_cast'
  553. /tmp/yaourt-tmp-retry/aur-gnurobots/src/gnurobots-1.2.0/src/ui-arena.c:408: undefined reference to `gtk_widget_queue_draw_area'
  554. /tmp/yaourt-tmp-retry/aur-gnurobots/src/gnurobots-1.2.0/src/ui-arena.c:410: undefined reference to `gdk_window_process_all_updates'
  555. /tmp/yaourt-tmp-retry/aur-gnurobots/src/gnurobots-1.2.0/src/ui-arena.c:412: undefined reference to `g_usleep'
  556. /tmp/yaourt-tmp-retry/aur-gnurobots/src/gnurobots-1.2.0/src/ui-arena.c:418: undefined reference to `g_usleep'
  557. ui-arena.o: In function `ui_arena_robot_smell':
  558. /tmp/yaourt-tmp-retry/aur-gnurobots/src/gnurobots-1.2.0/src/ui-arena.c:429: undefined reference to `g_usleep'
  559. ui-arena.o: In function `ui_arena_robot_zap':
  560. /tmp/yaourt-tmp-retry/aur-gnurobots/src/gnurobots-1.2.0/src/ui-arena.c:438: undefined reference to `g_usleep'
  561. ui-arena.o: In function `ui_arena_robot_feel':
  562. /tmp/yaourt-tmp-retry/aur-gnurobots/src/gnurobots-1.2.0/src/ui-arena.c:447: undefined reference to `g_usleep'
  563. ui-arena.o:/tmp/yaourt-tmp-retry/aur-gnurobots/src/gnurobots-1.2.0/src/ui-arena.c:456: more undefined references to `g_usleep' follow
  564. collect2: ld returned 1 exit status
  565. make[2]: *** [gnurobots] Error 1
  566. make[2]: Leaving directory `/tmp/yaourt-tmp-retry/aur-gnurobots/src/gnurobots-1.2.0/src'
  567. make[1]: *** [all-recursive] Error 1
  568. make[1]: Leaving directory `/tmp/yaourt-tmp-retry/aur-gnurobots/src/gnurobots-1.2.0'
  569. make: *** [all] Error 2
  570. ==> ERROR: Build Failed.
  571.     Aborting...
  572. ==> ERROR: Makepkg was unable to build gnurobots.
clone this paste RAW Paste Data