SHARE
TWEET

Clementine_Build_Error

a guest Sep 2nd, 2012 46 Never
  1. [100%] Building CXX object src/CMakeFiles/clementine_lib.dir/moodbar/moc_moodbarloader.cxx.o
  2. [100%] Building CXX object src/CMakeFiles/clementine_lib.dir/moodbar/moc_moodbarpipeline.cxx.o
  3. [100%] Building CXX object src/CMakeFiles/clementine_lib.dir/moodbar/moc_moodbarproxystyle.cxx.o
  4. [100%] Building CXX object src/CMakeFiles/clementine_lib.dir/core/moc_ubuntuunityhack.cxx.o
  5. [100%] Building CXX object src/CMakeFiles/clementine_lib.dir/qrc_data.cxx.o
  6. [100%] Building CXX object src/CMakeFiles/clementine_lib.dir/qrc_translations.cxx.o
  7. Linking CXX static library libclementine_lib.a
  8. [100%] Built target clementine_lib
  9. Scanning dependencies of target clementine
  10. [100%] Building CXX object src/CMakeFiles/clementine.dir/main.cpp.o
  11. Linking CXX executable ../clementine
  12. CMakeFiles/clementine.dir/main.cpp.o: In function `main':
  13. main.cpp:(.text.startup+0x546): undefined reference to `QCA::Initializer::Initializer(QCA::MemoryMode, int)'
  14. main.cpp:(.text.startup+0x990): undefined reference to `QCA::Initializer::~Initializer()'
  15. main.cpp:(.text.startup+0xd9d): undefined reference to `QCA::Initializer::~Initializer()'
  16. collect2: error: ld returned 1 exit status
  17. make[2]: *** [clementine] Error 1
  18. make[1]: *** [src/CMakeFiles/clementine.dir/all] Error 2
  19. make: *** [all] Error 2
RAW Paste Data
Top