This week only. Pastebin PRO Accounts Christmas Special! Don't miss out!Want more features on Pastebin? Sign Up, it's FREE!
Guest

tilemill fail

By: a guest on Nov 6th, 2012  |  syntax: Bash  |  size: 12.55 KB  |  views: 94  |  expires: Never
download  |  raw  |  embed  |  report abuse  |  print
Text below is selected. Please press Ctrl+C to copy to your clipboard. (⌘+C on Mac)
  1. Waf: Leaving directory `/var/tmp/yaourt-tmp-christian/aur-tilemill/pkg/usr/lib/node_modules/tilemill/node_modules/millstone/node_modules/srs/build'
  2. Build failed:  -> task failed (err #1):
  3.        {task: /var/tmp/yaourt-tmp-christian/aur-tilemill/pkg/usr/lib/node_modules/tilemill/node_modules/millstone/node_modules/srs/tools/scons/scons.py -C ../deps/osr SConstruct -> }
  4. [ 5/20] cxx: src/mapnik_feature.cpp -> build/Release/src/mapnik_feature_1.o
  5. 13:18:28 runner system command -> ['/usr/bin/g++', '-march=x86-64', '-mtune=generic', '-O2', '-pipe', '-fstack-protector', '--param=ssp-buffer-size=4', '-D_FORTIFY_SOURCE=2', '-g', '-O3', '-D_FILE_OFFSET_BITS=64', '-D_LARGEFILE_SOURCE', '-fPIC', '-DPIC', '-I/usr/include', '-I/usr/include/mapnik/agg', '-I/usr/include', '-I/usr/include/freetype2', '-I/usr/include/libxml2', '-DHAVE_JPEG', '-DBOOST_REGEX_HAS_ICU', '-ansi', '-Wall', '-pthread', '-ftemplate-depth-300', '-DLINUX', '-DBOOST_SPIRIT_THREADSAFE', '-DMAPNIK_THREADSAFE', '-O3', '-fno-strict-aliasing', '-finline-functions', '-Wno-inline', '-Wno-parentheses', '-Wno-char-subscripts', '-DNDEBUG', '-DHAVE_CAIRO', '-DHAVE_LIBXML2', '-I/usr/include/cairomm-1.0', '-I/usr/lib/cairomm-1.0/include', '-I/usr/include/cairo', '-I/usr/include/sigc++-2.0', '-I/usr/lib/sigc++-2.0/include', '-I/usr/include/glib-2.0', '-I/usr/lib/glib-2.0/include', '-I/usr/include/pixman-1', '-I/usr/include/libpng15', '-D_LARGEFILE_SOURCE', '-D_FILE_OFFSET_BITS=64', '-D_GNU_SOURCE', '-I/usr/include/node', '../src/mapnik_feature.cpp', '-c', '-o', 'Release/src/mapnik_feature_1.o']
  6. [2/2] cxx_link: build/Release/src/eio_1.o -> build/Release/eio.node
  7. [ 6/20] cxx: src/mapnik_image.cpp -> build/Release/src/mapnik_image_1.o
  8. 13:18:30 runner system command -> ['/usr/bin/g++', '-march=x86-64', '-mtune=generic', '-O2', '-pipe', '-fstack-protector', '--param=ssp-buffer-size=4', '-D_FORTIFY_SOURCE=2', '-g', '-O3', '-D_FILE_OFFSET_BITS=64', '-D_LARGEFILE_SOURCE', '-fPIC', '-DPIC', '-I/usr/include', '-I/usr/include/mapnik/agg', '-I/usr/include', '-I/usr/include/freetype2', '-I/usr/include/libxml2', '-DHAVE_JPEG', '-DBOOST_REGEX_HAS_ICU', '-ansi', '-Wall', '-pthread', '-ftemplate-depth-300', '-DLINUX', '-DBOOST_SPIRIT_THREADSAFE', '-DMAPNIK_THREADSAFE', '-O3', '-fno-strict-aliasing', '-finline-functions', '-Wno-inline', '-Wno-parentheses', '-Wno-char-subscripts', '-DNDEBUG', '-DHAVE_CAIRO', '-DHAVE_LIBXML2', '-I/usr/include/cairomm-1.0', '-I/usr/lib/cairomm-1.0/include', '-I/usr/include/cairo', '-I/usr/include/sigc++-2.0', '-I/usr/lib/sigc++-2.0/include', '-I/usr/include/glib-2.0', '-I/usr/lib/glib-2.0/include', '-I/usr/include/pixman-1', '-I/usr/include/libpng15', '-D_LARGEFILE_SOURCE', '-D_FILE_OFFSET_BITS=64', '-D_GNU_SOURCE', '-I/usr/include/node', '../src/mapnik_image.cpp', '-c', '-o', 'Release/src/mapnik_image_1.o']
  9. cc1plus: fatal error: ../src/mapnik_feature.cpp: No such file or directory
  10. compilation terminated.
  11. cc1plus: fatal error: ../src/mapnik_image.cpp: No such file or directory
  12. compilation terminated.
  13. npm ERR! error rolling back Error: ENOTEMPTY, rmdir '/var/tmp/yaourt-tmp-christian/aur-tilemill/pkg/usr/lib/node_modules/tilemill/node_modules/tilelive-mapnik/node_modules/eio'
  14. npm ERR! error rolling back  tilemill@0.10.1 { [Error: ENOTEMPTY, rmdir '/var/tmp/yaourt-tmp-christian/aur-tilemill/pkg/usr/lib/node_modules/tilemill/node_modules/tilelive-mapnik/node_modules/eio']
  15. npm ERR! error rolling back   errno: 53,
  16. npm ERR! error rolling back   code: 'ENOTEMPTY',
  17. npm ERR! error rolling back   path: '/var/tmp/yaourt-tmp-christian/aur-tilemill/pkg/usr/lib/node_modules/tilemill/node_modules/tilelive-mapnik/node_modules/eio' }
  18. npm ERR! srs@0.2.17 install: `node-waf -v configure build`
  19. npm ERR! `sh "-c" "node-waf -v configure build"` failed with 1
  20. npm ERR!
  21. npm ERR! Failed at the srs@0.2.17 install script.
  22. npm ERR! This is most likely a problem with the srs package,
  23. npm ERR! not with npm itself.
  24. npm ERR! Tell the author that this fails on your system:
  25. npm ERR!     node-waf -v configure build
  26. npm ERR! You can get their info via:
  27. npm ERR!     npm owner ls srs
  28. npm ERR! There is likely additional logging output above.
  29.  
  30. npm ERR! System Linux 3.6.6-1-ARCH
  31. npm ERR! command "/usr/bin/node" "/usr/bin/npm" "install" "-g" "--prefix" "/var/tmp/yaourt-tmp-christian/aur-tilemill/pkg/usr" "tilemill@0.10.1"
  32. npm ERR! cwd /var/tmp/yaourt-tmp-christian/aur-tilemill/pkg/usr/lib/node_modules
  33. npm ERR! node -v v0.8.14
  34. npm ERR! npm -v 1.1.65
  35. npm ERR! code ELIFECYCLE
  36. rm: cannot remove ‘./Release/.deps/Release/obj.target/sqlite3/deps/sqlite3/sqlite3.o.d.raw’: No such file or directory
  37. make: *** [Release/obj.target/sqlite3/deps/sqlite3/sqlite3.o] Error 1
  38. make: Leaving directory `/var/tmp/yaourt-tmp-christian/aur-tilemill/pkg/usr/lib/node_modules/tilemill/node_modules/sqlite3/build'
  39. gyp ERR! build error
  40. gyp ERR! stack Error: `make` failed with exit code: 2
  41. gyp ERR! stack     at ChildProcess.onExit (/usr/lib/node_modules/npm/node_modules/node-gyp/lib/build.js:236:23)
  42. gyp ERR! stack     at ChildProcess.EventEmitter.emit (events.js:99:17)
  43. gyp ERR! stack     at Process._handle.onexit (child_process.js:678:10)
  44. gyp ERR! System Linux 3.6.6-1-ARCH
  45. gyp ERR! command "node" "/usr/lib/node_modules/npm/node_modules/node-gyp/bin/node-gyp.js" "rebuild"
  46. gyp ERR! cwd /var/tmp/yaourt-tmp-christian/aur-tilemill/pkg/usr/lib/node_modules/tilemill/node_modules/sqlite3
  47. gyp ERR! node -v v0.8.14
  48. gyp ERR! node-gyp -v v0.7.1
  49. gyp ERR! not ok
  50. /usr/bin/ld: cannot open output file /var/tmp/yaourt-tmp-christian/aur-tilemill/pkg/usr/lib/node_modules/tilemill/node_modules/tilelive-mapnik/node_modules/eio/build/Release/eio.node: No such file or directory
  51. collect2: error: ld returned 1 exit status
  52. Traceback (most recent call last):
  53.   File "/usr/bin/node-waf", line 16, in <module>
  54.     Scripting.prepare(t, os.getcwd(), VERSION, wafdir)
  55.   File "/usr/bin/../lib/node/wafadmin/Scripting.py", line 145, in prepare
  56.     prepare_impl(t, cwd, ver, wafdir)
  57.   File "/usr/bin/../lib/node/wafadmin/Scripting.py", line 135, in prepare_impl
  58.     main()
  59.   File "/usr/bin/../lib/node/wafadmin/Scripting.py", line 188, in main
  60.     fun(ctx)
  61.   File "/usr/bin/../lib/node/wafadmin/Scripting.py", line 386, in build
  62.     return build_impl(bld)
  63.   File "/usr/bin/../lib/node/wafadmin/Scripting.py", line 408, in build_impl
  64.     info("Waf: Leaving directory `%s'" % bld.bldnode.abspath())
  65.  File "/usr/bin/../lib/node/wafadmin/Node.py", line 420, in abspath
  66.    ret = self.__class__.bld.cache_node_abspath[variant].get(self.id, None)
  67. AttributeError: 'NoneType' object has no attribute 'cache_node_abspath'
  68. pwd: error retrieving current directory: getcwd: cannot access parent directories: No such file or directory
  69. configure: error: working directory cannot be determined
  70. Traceback (most recent call last):
  71.  File "/usr/bin/node-waf", line 16, in <module>
  72.    Scripting.prepare(t, os.getcwd(), VERSION, wafdir)
  73.  File "/usr/bin/../lib/node/wafadmin/Scripting.py", line 145, in prepare
  74.    prepare_impl(t, cwd, ver, wafdir)
  75.  File "/usr/bin/../lib/node/wafadmin/Scripting.py", line 135, in prepare_impl
  76.    main()
  77.  File "/usr/bin/../lib/node/wafadmin/Scripting.py", line 188, in main
  78.    fun(ctx)
  79.  File "/usr/bin/../lib/node/wafadmin/Scripting.py", line 266, in configure
  80.    env.store(Options.lockfile)
  81.  File "/usr/bin/../lib/node/wafadmin/Environment.py", line 167, in store
  82.    file = open(filename, 'w')
  83. IOError: [Errno 2] No such file or directory: '.lock-wscript'
  84. ../src/mapnik_map.cpp:40:21: fatal error: utils.hpp: No such file or directory
  85. compilation terminated.
  86. npm http GET https://registry.npmjs.org/bindings
  87. npm http 304 https://registry.npmjs.org/bindings
  88.  
  89. Nothing to clean (project not configured)
  90. Checking for program g++ or c++          : /usr/bin/g++
  91. Checking for program cpp                 : /usr/bin/cpp
  92. Checking for program ar                  : /usr/bin/ar
  93. Checking for program ranlib              : /usr/bin/ranlib
  94. Checking for g++                         : ok  
  95. Checking for gtk+-2.0                    : yes
  96. Checking for glib-2.0                    : yes
  97. Checking for webkit-1.0                  : yes
  98. 'configure' finished successfully (0.772s)
  99. Waf: Entering directory `/var/tmp/yaourt-tmp-christian/aur-tilemill/pkg/usr/lib/node_modules/tilemill/node_modules/topcube/build'
  100. [1/2] cxx: topcube.cpp -> build/Release/topcube_1.o
  101. [2/2] cxx_link: build/Release/topcube_1.o -> build/Release/topcube
  102. collect2: error: ld returned 1 exit status
  103. Traceback (most recent call last):
  104.  File "/usr/bin/node-waf", line 16, in <module>
  105.    Scripting.prepare(t, os.getcwd(), VERSION, wafdir)
  106.  File "/usr/bin/../lib/node/wafadmin/Scripting.py", line 145, in prepare
  107.    prepare_impl(t, cwd, ver, wafdir)
  108.  File "/usr/bin/../lib/node/wafadmin/Scripting.py", line 135, in prepare_impl
  109.    main()
  110.  File "/usr/bin/../lib/node/wafadmin/Scripting.py", line 188, in main
  111.    fun(ctx)
  112.  File "/usr/bin/../lib/node/wafadmin/Scripting.py", line 386, in build
  113.    return build_impl(bld)
  114.  File "/usr/bin/../lib/node/wafadmin/Scripting.py", line 408, in build_impl
  115.    info("Waf: Leaving directory `%s'" % bld.bldnode.abspath())
  116.  File "/usr/bin/../lib/node/wafadmin/Node.py", line 420, in abspath
  117.    ret = self.__class__.bld.cache_node_abspath[variant].get(self.id, None)
  118. AttributeError: 'NoneType' object has no attribute 'cache_node_abspath'
  119.  
  120.  
  121. > contextify@0.1.3 install /var/tmp/yaourt-tmp-christian/aur-tilemill/pkg/usr/lib/node_modules/tilemill/node_modules/bones/node_modules/jquery/node_modules/jsdom/node_modules/contextify
  122. > node-gyp rebuild
  123.  
  124. Traceback (most recent call last):
  125.  File "/usr/bin/node-waf", line 16, in <module>
  126.    Scripting.prepare(t, os.getcwd(), VERSION, wafdir)
  127.  File "/usr/bin/../lib/node/wafadmin/Scripting.py", line 145, in prepare
  128.    prepare_impl(t, cwd, ver, wafdir)
  129.  File "/usr/bin/../lib/node/wafadmin/Scripting.py", line 135, in prepare_impl
  130.    main()
  131.  File "/usr/bin/../lib/node/wafadmin/Scripting.py", line 188, in main
  132.    fun(ctx)
  133.  File "/usr/bin/../lib/node/wafadmin/Scripting.py", line 386, in build
  134.    return build_impl(bld)
  135.  File "/usr/bin/../lib/node/wafadmin/Scripting.py", line 408, in build_impl
  136.    info("Waf: Leaving directory `%s'" % bld.bldnode.abspath())
  137.  File "/usr/bin/../lib/node/wafadmin/Node.py", line 420, in abspath
  138.    ret = self.__class__.bld.cache_node_abspath[variant].get(self.id, None)
  139. AttributeError: 'NoneType' object has no attribute 'cache_node_abspath'
  140. Traceback (most recent call last):
  141.  File "/home/christian/.node-gyp/0.8.14/tools/gyp/gyp", line 18, in <module>
  142.    sys.exit(gyp.main(sys.argv[1:]))
  143.  File "/home/christian/.node-gyp/0.8.14/tools/gyp/pylib/gyp/__init__.py", line 511, in main
  144.    return gyp_main(args)
  145.  File "/home/christian/.node-gyp/0.8.14/tools/gyp/pylib/gyp/__init__.py", line 494, in gyp_main
  146.    options.circular_check)
  147.  File "/home/christian/.node-gyp/0.8.14/tools/gyp/pylib/gyp/__init__.py", line 133, in Load
  148.    depth, generator_input_info, check, circular_check)
  149.  File "/home/christian/.node-gyp/0.8.14/tools/gyp/pylib/gyp/input.py", line 2378, in Load
  150.    depth, check)
  151.  File "/home/christian/.node-gyp/0.8.14/tools/gyp/pylib/gyp/input.py", line 358, in LoadTargetBuildFile
  152.    includes, True, check)
  153.  File "/home/christian/.node-gyp/0.8.14/tools/gyp/pylib/gyp/input.py", line 208, in LoadOneBuildFile
  154.    raise Exception("%s not found (cwd: %s)" % (build_file_path, os.getcwd()))
  155. Exception: binding.gyp not found (cwd: /var/tmp/yaourt-tmp-christian/aur-tilemill/pkg/usr/lib/node_modules/tilemill/node_modules/bones/node_modules/jquery/node_modules/jsdom/node_modules/contextify) while trying to load binding.gyp
  156. gyp ERR! configure error
  157. gyp ERR! stack Error: `gyp` failed with exit code: 1
  158. gyp ERR! stack     at ChildProcess.onCpExit (/usr/lib/node_modules/npm/node_modules/node-gyp/lib/configure.js:350:16)
  159. gyp ERR! stack     at ChildProcess.EventEmitter.emit (events.js:99:17)
  160. gyp ERR! stack     at Process._handle.onexit (child_process.js:678:10)
  161. gyp ERR! System Linux 3.6.6-1-ARCH
  162. gyp ERR! command "node" "/usr/lib/node_modules/npm/node_modules/node-gyp/bin/node-gyp.js" "rebuild"
  163. gyp ERR! cwd /var/tmp/yaourt-tmp-christian/aur-tilemill/pkg/usr/lib/node_modules/tilemill/node_modules/bones/node_modules/jquery/node_modules/jsdom/node_modules/contextify
  164. gyp ERR! node -v v0.8.14
  165. gyp ERR! node-gyp -v v0.7.1
  166. gyp ERR! not ok
  167. npm WARN optional dep failed, continuing contextify@0.1.3
  168. npm ERR!
  169. npm ERR! Additional logging details can be found in:
  170. npm ERR!     /var/tmp/yaourt-tmp-christian/aur-tilemill/pkg/usr/lib/node_modules/npm-debug.log
  171. npm ERR! not ok code 0
  172. ==> ERROR: A failure occurred in package().
  173.    Aborting...
  174. ==> ERROR: Makepkg was unable to build tilemill.
clone this paste RAW Paste Data