Pastebin launched a little side project called VERYVIRAL.com, check it out ;-) Want more features on Pastebin? Sign Up, it's FREE!
Guest

Untitled

By: a guest on Jan 18th, 2013  |  syntax: Bash  |  size: 34.79 KB  |  views: 67  |  expires: Never
download  |  raw  |  embed  |  report abuse  |  print
Text below is selected. Please press Ctrl+C to copy to your clipboard. (⌘+C on Mac)
  1. #[32;01m * #[39;49;00mPackage:    dev-python/pygobject-3.4.2-r1
  2. #[32;01m * #[39;49;00mRepository: gentoo
  3. #[32;01m * #[39;49;00mMaintainer: gnome@gentoo.org python@gentoo.org
  4. #[32;01m * #[39;49;00mUSE:        amd64 cairo elibc_glibc kernel_linux python_targets_python2_7 python_targets_python3_2 threads userland_GNU
  5. #[32;01m * #[39;49;00mFEATURES:   sandbox
  6. >>> Unpacking source...
  7. >>> Unpacking pygobject-3.4.2.tar.xz to /var/tmp/portage/dev-python/pygobject-3.4.2-r1/work
  8. >>> Source unpacked in /var/tmp/portage/dev-python/pygobject-3.4.2-r1/work
  9. >>> Preparing source in /var/tmp/portage/dev-python/pygobject-3.4.2-r1/work/pygobject-3.4.2 ...
  10.  #[32;01m*#[0m Applying pygobject-3.4.1.1-make_check.patch ...
  11. #[A#[72C #[34;01m[ #[32;01mok#[34;01m ]#[0m
  12.  #[32;01m*#[0m Applying pygobject-3.4.2-run-tests-with-old-python.patch ...
  13. #[A#[72C #[34;01m[ #[32;01mok#[34;01m ]#[0m
  14.  #[32;01m*#[0m Running eautoreconf in '/var/tmp/portage/dev-python/pygobject-3.4.2-r1/work/pygobject-3.4.2' ...
  15.  #[32;01m*#[0m Running libtoolize --install --copy --force --automake ...
  16. #[A#[72C #[34;01m[ #[32;01mok#[34;01m ]#[0m
  17.  #[32;01m*#[0m Running aclocal -I m4 ...
  18. #[A#[72C #[34;01m[ #[32;01mok#[34;01m ]#[0m
  19.  #[32;01m*#[0m Running autoconf ...
  20. #[A#[72C #[34;01m[ #[32;01mok#[34;01m ]#[0m
  21.  #[32;01m*#[0m Running autoheader ...
  22. #[A#[72C #[34;01m[ #[32;01mok#[34;01m ]#[0m
  23.  #[32;01m*#[0m Running automake --add-missing --copy ...
  24. #[A#[72C #[34;01m[ #[32;01mok#[34;01m ]#[0m
  25.  #[32;01m*#[0m Running elibtoolize in: pygobject-3.4.2/
  26.  #[32;01m*#[0m   Applying portage/1.2.0 patch ...
  27.  #[32;01m*#[0m   Applying sed/1.5.6 patch ...
  28.  #[32;01m*#[0m   Applying as-needed/2.4.2 patch ...
  29.  #[32;01m*#[0m Fixing OMF Makefiles ...
  30. #[A#[72C #[34;01m[ #[32;01mok#[34;01m ]#[0m
  31.  #[32;01m*#[0m Disabling deprecation warnings ...
  32. #[A#[72C #[34;01m[ #[32;01mok#[34;01m ]#[0m
  33.  #[32;01m*#[0m Will copy sources from /var/tmp/portage/dev-python/pygobject-3.4.2-r1/work/pygobject-3.4.2
  34.  #[32;01m*#[0m python2_7: copying to /var/tmp/portage/dev-python/pygobject-3.4.2-r1/work/pygobject-3.4.2-python2_7
  35.  #[32;01m*#[0m python3_2: copying to /var/tmp/portage/dev-python/pygobject-3.4.2-r1/work/pygobject-3.4.2-python3_2
  36. >>> Source prepared.
  37. >>> Configuring source in /var/tmp/portage/dev-python/pygobject-3.4.2-r1/work/pygobject-3.4.2 ...
  38.  #[32;01m*#[0m python3.2: running run_in_build_dir gnome2_src_configure
  39.  * econf: updating pygobject-3.4.2/config.guess with /usr/share/gnuconfig/config.guess
  40.  * econf: updating pygobject-3.4.2/config.sub with /usr/share/gnuconfig/config.sub
  41.  * econf: updating pygobject-3.4.2-python2_7/config.guess with /usr/share/gnuconfig/config.guess
  42.  * econf: updating pygobject-3.4.2-python2_7/config.sub with /usr/share/gnuconfig/config.sub
  43.  * econf: updating pygobject-3.4.2-python3_2/config.guess with /usr/share/gnuconfig/config.guess
  44.  * econf: updating pygobject-3.4.2-python3_2/config.sub with /usr/share/gnuconfig/config.sub
  45. ./configure --prefix=/usr --build=x86_64-pc-linux-gnu --host=x86_64-pc-linux-gnu --mandir=/usr/share/man --infodir=/usr/share/info --datadir=/usr/share --sysconfdir=/etc --localstatedir=/var/lib --libdir=/usr/lib64 --disable-silent-rules --disable-dependency-tracking --disable-maintainer-mode --disable-dependency-tracking --with-ffi --enable-cairo --enable-thread
  46. checking whether make supports nested variables... yes
  47. checking for a BSD-compatible install... /usr/bin/install -c
  48. checking whether build environment is sane... yes
  49. checking for a thread-safe mkdir -p... /bin/mkdir -p
  50. checking for gawk... gawk
  51. checking whether make sets $(MAKE)... yes
  52. checking whether to enable maintainer-specific portions of Makefiles... no
  53. checking build system type... x86_64-pc-linux-gnu
  54. checking host system type... x86_64-pc-linux-gnu
  55. checking for some Win32 platform... no
  56. checking for native Win32... no
  57. checking how to print strings... printf
  58. checking for style of include used by make... GNU
  59. checking for x86_64-pc-linux-gnu-gcc... x86_64-pc-linux-gnu-gcc
  60. checking whether the C compiler works... yes
  61. checking for C compiler default output file name... a.out
  62. checking for suffix of executables...
  63. checking whether we are cross compiling... no
  64. checking for suffix of object files... o
  65. checking whether we are using the GNU C compiler... yes
  66. checking whether x86_64-pc-linux-gnu-gcc accepts -g... yes
  67. checking for x86_64-pc-linux-gnu-gcc option to accept ISO C89... none needed
  68. checking dependency style of x86_64-pc-linux-gnu-gcc... none
  69. checking for a sed that does not truncate output... /bin/sed
  70. checking for grep that handles long lines and -e... /bin/grep
  71. checking for egrep... /bin/grep -E
  72. checking for fgrep... /bin/grep -F
  73. checking for ld used by x86_64-pc-linux-gnu-gcc... /usr/x86_64-pc-linux-gnu/bin/ld
  74. checking if the linker (/usr/x86_64-pc-linux-gnu/bin/ld) is GNU ld... yes
  75. checking for BSD- or MS-compatible name lister (nm)... /usr/bin/nm -B
  76. checking the name lister (/usr/bin/nm -B) interface... BSD nm
  77. checking whether ln -s works... yes
  78. checking the maximum length of command line arguments... 1572864
  79. checking whether the shell understands some XSI constructs... yes
  80. checking whether the shell understands "+="... yes
  81. checking how to convert x86_64-pc-linux-gnu file names to x86_64-pc-linux-gnu format... func_convert_file_noop
  82. checking how to convert x86_64-pc-linux-gnu file names to toolchain format... func_convert_file_noop
  83. checking for /usr/x86_64-pc-linux-gnu/bin/ld option to reload object files... -r
  84. checking for x86_64-pc-linux-gnu-objdump... objdump
  85. checking how to recognize dependent libraries... pass_all
  86. checking for x86_64-pc-linux-gnu-dlltool... dlltool
  87. checking how to associate runtime and link libraries... printf %s\n
  88. checking for x86_64-pc-linux-gnu-ar... x86_64-pc-linux-gnu-ar
  89. checking for archiver @FILE support... @
  90. checking for x86_64-pc-linux-gnu-strip... x86_64-pc-linux-gnu-strip
  91. checking for x86_64-pc-linux-gnu-ranlib... x86_64-pc-linux-gnu-ranlib
  92. checking command to parse /usr/bin/nm -B output from x86_64-pc-linux-gnu-gcc object... ok
  93. checking for sysroot... no
  94. checking for x86_64-pc-linux-gnu-mt... no
  95. checking for mt... no
  96. checking if : is a manifest tool... no
  97. checking how to run the C preprocessor... x86_64-pc-linux-gnu-gcc -E
  98. checking for ANSI C header files... yes
  99. checking for sys/types.h... yes
  100. checking for sys/stat.h... yes
  101. checking for stdlib.h... yes
  102. checking for string.h... yes
  103. checking for memory.h... yes
  104. checking for strings.h... yes
  105. checking for inttypes.h... yes
  106. checking for stdint.h... yes
  107. checking for unistd.h... yes
  108. checking for dlfcn.h... yes
  109. checking for objdir... .libs
  110. checking if x86_64-pc-linux-gnu-gcc supports -fno-rtti -fno-exceptions... no
  111. checking for x86_64-pc-linux-gnu-gcc option to produce PIC... -fPIC -DPIC
  112. checking if x86_64-pc-linux-gnu-gcc PIC flag -fPIC -DPIC works... yes
  113. checking if x86_64-pc-linux-gnu-gcc static flag -static works... yes
  114. checking if x86_64-pc-linux-gnu-gcc supports -c -o file.o... yes
  115. checking if x86_64-pc-linux-gnu-gcc supports -c -o file.o... (cached) yes
  116. checking whether the x86_64-pc-linux-gnu-gcc linker (/usr/x86_64-pc-linux-gnu/bin/ld -m elf_x86_64) supports shared libraries... yes
  117. checking whether -lc should be explicitly linked in... no
  118. checking dynamic linker characteristics... GNU/Linux ld.so
  119. checking how to hardcode library paths into programs... immediate
  120. checking whether stripping libraries is possible... yes
  121. checking if libtool supports shared libraries... yes
  122. checking whether to build shared libraries... yes
  123. checking whether to build static libraries... no
  124. configure: creating ./config.lt
  125. config.lt: creating libtool
  126. checking for library containing strerror... none required
  127. checking for x86_64-pc-linux-gnu-gcc... (cached) x86_64-pc-linux-gnu-gcc
  128. checking whether we are using the GNU C compiler... (cached) yes
  129. checking whether x86_64-pc-linux-gnu-gcc accepts -g... (cached) yes
  130. checking for x86_64-pc-linux-gnu-gcc option to accept ISO C89... (cached) none needed
  131. checking dependency style of x86_64-pc-linux-gnu-gcc... (cached) none
  132. checking for x86_64-pc-linux-gnu-gcc... (cached) x86_64-pc-linux-gnu-gcc
  133. checking whether we are using the GNU C compiler... (cached) yes
  134. checking whether x86_64-pc-linux-gnu-gcc accepts -g... (cached) yes
  135. checking for x86_64-pc-linux-gnu-gcc option to accept ISO C89... (cached) none needed
  136. checking dependency style of x86_64-pc-linux-gnu-gcc... (cached) none
  137. checking whether x86_64-pc-linux-gnu-gcc and cc understand -c and -o together... yes
  138. checking whether /usr/bin/python3.2 version >= 2.6... yes
  139. checking for /usr/bin/python3.2 version... 3.2
  140. checking for /usr/bin/python3.2 platform... linux2
  141. checking for /usr/bin/python3.2 script directory... ${prefix}/lib64/python3.2/site-packages
  142. checking for /usr/bin/python3.2 extension module directory... ${exec_prefix}/lib64/python3.2/site-packages
  143. checking for /usr/bin/python3.2 >= 3.1... yes
  144. checking for python version... (cached) 3.2
  145. checking for python platform... (cached) linux2
  146. checking for python script directory... (cached) ${prefix}/lib64/python3.2/site-packages
  147. checking for python extension module directory... (cached) ${exec_prefix}/lib64/python3.2/site-packages
  148. checking for headers required to compile python extensions... found
  149. checking for PySignal_SetWakeupFd in Python.h... no
  150. checking for python module thread... no
  151. checking for python module _thread... yes
  152. checking whether to enable threading in pygobject... yes
  153. checking for x86_64-pc-linux-gnu-pkg-config... no
  154. checking for pkg-config... /usr/bin/pkg-config
  155. checking pkg-config is at least version 0.16... yes
  156. checking for GLIB - version >= 2.31.0... yes (version 2.34.3)
  157. checking for ffi... checking for FFI... yes
  158. checking for GIO... yes
  159. checking for GI... yes
  160. checking for CAIRO... yes
  161. checking for PYCAIRO... yes
  162. checking whether x86_64-pc-linux-gnu-gcc understands -Wall... yes
  163. checking whether x86_64-pc-linux-gnu-gcc understands -Werror=implicit-function-declaration...
  164.  yes
  165. checking whether x86_64-pc-linux-gnu-gcc understands -Werror=pointer-arith... yes
  166. checking whether x86_64-pc-linux-gnu-gcc understands -Werror=format-security... yes
  167. checking whether x86_64-pc-linux-gnu-gcc understands -Werror=missing-include-dirs... yes
  168. checking whether x86_64-pc-linux-gnu-gcc understands -Werror=format... yes
  169. checking whether x86_64-pc-linux-gnu-gcc understands -fno-strict-aliasing... yes
  170. checking whether x86_64-pc-linux-gnu-gcc understands -std=c9x... yes
  171. configure: creating ./config.status
  172. config.status: creating Makefile
  173. config.status: creating pygobject-3.0.pc
  174. config.status: creating pygobject-3.0-uninstalled.pc
  175. config.status: creating gi/Makefile
  176. config.status: creating gi/repository/Makefile
  177. config.status: creating gi/overrides/Makefile
  178. config.status: creating gi/_glib/Makefile
  179. config.status: creating gi/_gobject/Makefile
  180. config.status: creating examples/Makefile
  181. config.status: creating tests/Makefile
  182. config.status: creating PKG-INFO
  183. config.status: creating config.h
  184. config.status: executing depfiles commands
  185. config.status: executing libtool commands
  186.  
  187. libffi support: yes
  188.  
  189.  #[32;01m*#[0m python2.7: running run_in_build_dir gnome2_src_configure
  190.  * econf: updating pygobject-3.4.2/config.guess with /usr/share/gnuconfig/config.guess
  191.  * econf: updating pygobject-3.4.2/config.sub with /usr/share/gnuconfig/config.sub
  192.  * econf: updating pygobject-3.4.2-python2_7/config.guess with /usr/share/gnuconfig/config.guess
  193.  * econf: updating pygobject-3.4.2-python2_7/config.sub with /usr/share/gnuconfig/config.sub
  194.  * econf: updating pygobject-3.4.2-python3_2/config.guess with /usr/share/gnuconfig/config.guess
  195.  * econf: updating pygobject-3.4.2-python3_2/config.sub with /usr/share/gnuconfig/config.sub
  196. ./configure --prefix=/usr --build=x86_64-pc-linux-gnu --host=x86_64-pc-linux-gnu --mandir=/usr/share/man --infodir=/usr/share/info --datadir=/usr/share --sysconfdir=/etc --localstatedir=/var/lib --libdir=/usr/lib64 --disable-silent-rules --disable-dependency-tracking --disable-maintainer-mode --disable-maintainer-mode --disable-dependency-tracking --with-ffi --enable-cairo --enable-thread
  197. checking whether make supports nested variables... yes
  198. checking for a BSD-compatible install... /usr/bin/install -c
  199. checking whether build environment is sane... yes
  200. checking for a thread-safe mkdir -p... /bin/mkdir -p
  201. checking for gawk... gawk
  202. checking whether make sets $(MAKE)... yes
  203. checking whether to enable maintainer-specific portions of Makefiles... no
  204. checking build system type... x86_64-pc-linux-gnu
  205. checking host system type... x86_64-pc-linux-gnu
  206. checking for some Win32 platform... no
  207. checking for native Win32... no
  208. checking how to print strings... printf
  209. checking for style of include used by make... GNU
  210. checking for x86_64-pc-linux-gnu-gcc... x86_64-pc-linux-gnu-gcc
  211. checking whether the C compiler works... yes
  212. checking for C compiler default output file name... a.out
  213. checking for suffix of executables...
  214. checking whether we are cross compiling... no
  215. checking for suffix of object files... o
  216. checking whether we are using the GNU C compiler... yes
  217. checking whether x86_64-pc-linux-gnu-gcc accepts -g... yes
  218. checking for x86_64-pc-linux-gnu-gcc option to accept ISO C89... none needed
  219. checking dependency style of x86_64-pc-linux-gnu-gcc... none
  220. checking for a sed that does not truncate output... /bin/sed
  221. checking for grep that handles long lines and -e... /bin/grep
  222. checking for egrep... /bin/grep -E
  223. checking for fgrep... /bin/grep -F
  224. checking for ld used by x86_64-pc-linux-gnu-gcc... /usr/x86_64-pc-linux-gnu/bin/ld
  225. checking if the linker (/usr/x86_64-pc-linux-gnu/bin/ld) is GNU ld... yes
  226. checking for BSD- or MS-compatible name lister (nm)... /usr/bin/nm -B
  227. checking the name lister (/usr/bin/nm -B) interface... BSD nm
  228. checking whether ln -s works... yes
  229. checking the maximum length of command line arguments... 1572864
  230. checking whether the shell understands some XSI constructs... yes
  231. checking whether the shell understands "+="... yes
  232. checking how to convert x86_64-pc-linux-gnu file names to x86_64-pc-linux-gnu format... func_convert_file_noop
  233. checking how to convert x86_64-pc-linux-gnu file names to toolchain format... func_convert_file_noop
  234. checking for /usr/x86_64-pc-linux-gnu/bin/ld option to reload object files... -r
  235. checking for x86_64-pc-linux-gnu-objdump... objdump
  236. checking how to recognize dependent libraries... pass_all
  237. checking for x86_64-pc-linux-gnu-dlltool... dlltool
  238. checking how to associate runtime and link libraries... printf %s\n
  239. checking for x86_64-pc-linux-gnu-ar... x86_64-pc-linux-gnu-ar
  240. checking for archiver @FILE support... @
  241. checking for x86_64-pc-linux-gnu-strip... x86_64-pc-linux-gnu-strip
  242. checking for x86_64-pc-linux-gnu-ranlib... x86_64-pc-linux-gnu-ranlib
  243. checking command to parse /usr/bin/nm -B output from x86_64-pc-linux-gnu-gcc object... ok
  244. checking for sysroot... no
  245. checking for x86_64-pc-linux-gnu-mt... no
  246. checking for mt... no
  247. checking if : is a manifest tool... no
  248. checking how to run the C preprocessor... x86_64-pc-linux-gnu-gcc -E
  249. checking for ANSI C header files... yes
  250. checking for sys/types.h... yes
  251. checking for sys/stat.h... yes
  252. checking for stdlib.h... yes
  253. checking for string.h... yes
  254. checking for memory.h... yes
  255. checking for strings.h... yes
  256. checking for inttypes.h... yes
  257. checking for stdint.h... yes
  258. checking for unistd.h... yes
  259. checking for dlfcn.h... yes
  260. checking for objdir... .libs
  261. checking if x86_64-pc-linux-gnu-gcc supports -fno-rtti -fno-exceptions... no
  262. checking for x86_64-pc-linux-gnu-gcc option to produce PIC... -fPIC -DPIC
  263. checking if x86_64-pc-linux-gnu-gcc PIC flag -fPIC -DPIC works... yes
  264. checking if x86_64-pc-linux-gnu-gcc static flag -static works... yes
  265. checking if x86_64-pc-linux-gnu-gcc supports -c -o file.o... yes
  266. checking if x86_64-pc-linux-gnu-gcc supports -c -o file.o... (cached) yes
  267. checking whether the x86_64-pc-linux-gnu-gcc linker (/usr/x86_64-pc-linux-gnu/bin/ld -m elf_x86_64) supports shared libraries... yes
  268. checking whether -lc should be explicitly linked in... no
  269. checking dynamic linker characteristics... GNU/Linux ld.so
  270. checking how to hardcode library paths into programs... immediate
  271. checking whether stripping libraries is possible... yes
  272. checking if libtool supports shared libraries... yes
  273. checking whether to build shared libraries... yes
  274. checking whether to build static libraries... no
  275. configure: creating ./config.lt
  276. config.lt: creating libtool
  277. checking for library containing strerror... none required
  278. checking for x86_64-pc-linux-gnu-gcc... (cached) x86_64-pc-linux-gnu-gcc
  279. checking whether we are using the GNU C compiler... (cached) yes
  280. checking whether x86_64-pc-linux-gnu-gcc accepts -g... (cached) yes
  281. checking for x86_64-pc-linux-gnu-gcc option to accept ISO C89... (cached) none needed
  282. checking dependency style of x86_64-pc-linux-gnu-gcc... (cached) none
  283. checking for x86_64-pc-linux-gnu-gcc... (cached) x86_64-pc-linux-gnu-gcc
  284. checking whether we are using the GNU C compiler... (cached) yes
  285. checking whether x86_64-pc-linux-gnu-gcc accepts -g... (cached) yes
  286. checking for x86_64-pc-linux-gnu-gcc option to accept ISO C89... (cached) none needed
  287. checking dependency style of x86_64-pc-linux-gnu-gcc... (cached) none
  288. checking whether x86_64-pc-linux-gnu-gcc and cc understand -c and -o together... yes
  289. checking whether /usr/bin/python2.7 version >= 2.6... yes
  290. checking for /usr/bin/python2.7 version... 2.7
  291. checking for /usr/bin/python2.7 platform... linux2
  292. checking for /usr/bin/python2.7 script directory... ${prefix}/lib64/python2.7/site-packages
  293. checking for /usr/bin/python2.7 extension module directory... ${exec_prefix}/lib64/python2.7/site-packages
  294. checking for python version... (cached) 2.7
  295. checking for python platform... (cached) linux2
  296. checking for python script directory... (cached) ${prefix}/lib64/python2.7/site-packages
  297. checking for python extension module directory... (cached) ${exec_prefix}/lib64/python2.7/site-packages
  298. checking for headers required to compile python extensions... found
  299. checking for PySignal_SetWakeupFd in Python.h... no
  300. checking for python module thread... yes
  301. checking whether to enable threading in pygobject... yes
  302. checking for x86_64-pc-linux-gnu-pkg-config... no
  303. checking for pkg-config... /usr/bin/pkg-config
  304. checking pkg-config is at least version 0.16... yes
  305. checking for GLIB - version >= 2.31.0... yes (version 2.34.3)
  306. checking for ffi... checking for FFI... yes
  307. checking for GIO... yes
  308. checking for GI... yes
  309. checking for CAIRO... yes
  310. checking for PYCAIRO... yes
  311. checking whether x86_64-pc-linux-gnu-gcc understands -Wall... yes
  312. checking whether x86_64-pc-linux-gnu-gcc understands -Werror=implicit-function-declaration... yes
  313. checking whether x86_64-pc-linux-gnu-gcc understands -Werror=pointer-arith... yes
  314. checking whether x86_64-pc-linux-gnu-gcc understands -Werror=format-security... yes
  315. checking whether x86_64-pc-linux-gnu-gcc understands -Werror=missing-include-dirs... yes
  316. checking whether x86_64-pc-linux-gnu-gcc understands -Werror=format... yes
  317. checking whether x86_64-pc-linux-gnu-gcc understands -fno-strict-aliasing... yes
  318. checking whether x86_64-pc-linux-gnu-gcc understands -std=c9x... yes
  319. configure: creating ./config.status
  320. config.status: creating Makefile
  321. config.status: creating pygobject-3.0.pc
  322. config.status: creating pygobject-3.0-uninstalled.pc
  323. config.status: creating gi/Makefile
  324. config.status: creating gi/repository/Makefile
  325. config.status: creating gi/overrides/Makefile
  326. config.status: creating gi/_glib/Makefile
  327. config.status: creating gi/_gobject/Makefile
  328. config.status: creating examples/Makefile
  329. config.status: creating tests/Makefile
  330. config.status: creating PKG-INFO
  331. config.status: creating config.h
  332. config.status: executing depfiles commands
  333. config.status: executing libtool commands
  334.  
  335. libffi support: yes
  336.  
  337. >>> Source configured.
  338. >>> Compiling source in /var/tmp/portage/dev-python/pygobject-3.4.2-r1/work/pygobject-3.4.2
  339.  ...
  340.  #[32;01m*#[0m python3.2: running run_in_build_dir gnome2_src_compile
  341. make -j9
  342. make  all-recursive
  343. make[1]: Entering directory `/var/tmp/portage/dev-python/pygobject-3.4.2-r1/work/pygobject-3.4.2-python3_2'
  344. Making all in examples
  345. make[2]: Entering directory `/var/tmp/portage/dev-python/pygobject-3.4.2-r1/work/pygobject-3.4.2-python3_2/examples'
  346. make[2]: Nothing to be done for `all'.
  347. make[2]: Leaving directory `/var/tmp/portage/dev-python/pygobject-3.4.2-r1/work/pygobject-3.4.2-python3_2/examples'
  348. Making all in gi
  349. make[2]: Entering directory `/var/tmp/portage/dev-python/pygobject-3.4.2-r1/work/pygobject-3.4.2-python3_2/gi'
  350. Making all in repository
  351. make[3]: Entering directory `/var/tmp/portage/dev-python/pygobject-3.4.2-r1/work/pygobject-3.4.2-python3_2/gi/repository'
  352. for f in __init__.py; do \
  353.     [ -e ./$f ] || ln -s ./$f ./$f; \
  354. done
  355. make[3]: Leaving directory `/var/tmp/portage/dev-python/pygobject-3.4.2-r1/work/pygobject-3.4.2-python3_2/gi/repository'
  356. Making all in overrides
  357. make[3]: Entering directory `/var/tmp/portage/dev-python/pygobject-3.4.2-r1/work/pygobject-3.4.2-python3_2/gi/overrides'
  358. for f in GLib.py Gtk.py Gdk.py Gio.py GIMarshallingTests.py Pango.py keysyms.py __init__.py; do \
  359.     [ -e ./$f ] || ln -s ./$f ./$f; \
  360. done
  361. make[3]: Leaving directory `/var/tmp/portage/dev-python/pygobject-3.4.2-r1/work/pygobject-3.4.2-python3_2/gi/overrides'
  362. Making all in _glib
  363. make[3]: Entering directory `/var/tmp/portage/dev-python/pygobject-3.4.2-r1/work/pygobject-3.4.2-python3_2/gi/_glib'
  364. /bin/sh ../../libtool  --tag=CC   --mode=compile x86_64-pc-linux-gnu-gcc -DHAVE_CONFIG_H -I. -I../..  -I/usr/include/python3.2 -I/usr/include/python3.2 -DPY_SSIZE_T_CLEAN  -pthread -I/usr/include/glib-2.0 -I/usr/lib64/glib-2.0/include   -march=native -O2 -pipe -Wall -Werror=implicit-function-declaration -Werror=pointer-arith -Werror=format-security -Werror=missing-include-dirs -Werror=format -fno-strict-aliasing -std=c9x -c -o libpyglib_gi_2_0_python3.2_la-pyglib.lo `test -f 'pyglib.c' || echo './'`pyglib.c
  365. /bin/sh ../../libtool  --tag=CC   --mode=compile x86_64-pc-linux-gnu-gcc -DHAVE_CONFIG_H -I. -I../..  -I/usr/include/python3.2 -I/usr/include/python3.2 -DPY_SSIZE_T_CLEAN  -pthread -I/usr/include/glib-2.0 -I/usr/lib64/glib-2.0/include    -march=native -O2 -pipe -Wall -Werror=implicit-function-declaration -Werror=pointer-arith -Werror=format-security -Werror=missing-include-dirs -Werror=format -fno-strict-aliasing -std=c9x -c -o _glib_la-glibmodule.lo `test -f 'glibmodule.c' || echo './'`glibmodule.c
  366. /bin/sh ../../libtool  --tag=CC   --mode=compile x86_64-pc-linux-gnu-gcc -DHAVE_CONFIG_H -I. -I../..  -I/usr/include/python3.2 -I/usr/include/python3.2 -DPY_SSIZE_T_CLEAN  -pthread -I/usr/include/glib-2.0 -I/usr/lib64/glib-2.0/include    -march=native -O2 -pipe -Wall -Werror=implicit-function-declaration -Werror=pointer-arith -Werror=format-security -Werror=missing-include-dirs -Werror=format -fno-strict-aliasing -std=c9x -c -o _glib_la-pygiochannel.lo `test -f 'pygiochannel.c' || echo './'`pygiochannel.c
  367. /bin/sh ../../libtool  --tag=CC   --mode=compile x86_64-pc-linux-gnu-gcc -DHAVE_CONFIG_H -I. -I../..  -I/usr/include/python3.2 -I/usr/include/python3.2 -DPY_SSIZE_T_CLEAN  -pthread -I/usr/include/glib-2.0 -I/usr/lib64/glib-2.0/include    -march=native -O2 -pipe -Wall -Werror=implicit-function-declaration -Werror=pointer-arith -Werror=format-security -Werror=missing-include-dirs -Werror=format -fno-strict-aliasing -std=c9x -c -o _glib_la-pygoptioncontext.lo `test -f 'pygoptioncontext.c' || echo './'`pygoptioncontext.c
  368. /bin/sh ../../libtool  --tag=CC   --mode=compile x86_64-pc-linux-gnu-gcc -DHAVE_CONFIG_H -I. -I../..  -I/usr/include/python3.2 -I/usr/include/python3.2 -DPY_SSIZE_T_CLEAN  -pthread -I/usr/include/glib-2.0 -I/usr/lib64/glib-2.0/include    -march=native -O2 -pipe -Wall -Werror=implicit-function-declaration -Werror=pointer-arith -Werror=format-security -Werror=missing-include-dirs -Werror=format -fno-strict-aliasing -std=c9x -c -o _glib_la-pygoptiongroup.lo `test -f 'pygoptiongroup.c' || echo './'`pygoptiongroup.c
  369. /bin/sh ../../libtool  --tag=CC   --mode=compile x86_64-pc-linux-gnu-gcc -DHAVE_CONFIG_H -I. -I../..  -I/usr/include/python3.2 -I/usr/include/python3.2 -DPY_SSIZE_T_CLEAN  -pthread -I/usr/include/glib-2.0 -I/usr/lib64/glib-2.0/include    -march=native -O2 -pipe -Wall -Werror=implicit-function-declaration -Werror=pointer-arith -Werror=format-security -Werror=missing-include-dirs -Werror=format -fno-strict-aliasing -std=c9x -c -o _glib_la-pygmaincontext.lo `test -f 'pygmaincontext.c' || echo './'`pygmaincontext.c
  370. /bin/sh ../../libtool  --tag=CC   --mode=compile x86_64-pc-linux-gnu-gcc -DHAVE_CONFIG_H -I. -I../..  -I/usr/include/python3.2 -I/usr/include/python3.2 -DPY_SSIZE_T_CLEAN  -pthread -I/usr/include/glib-2.0 -I/usr/lib64/glib-2.0/include    -march=native -O2 -pipe -Wall -Werror=implicit-function-declaration -Werror=pointer-arith -Werror=format-security -Werror=missing-include-dirs -Werror=format -fno-strict-aliasing -std=c9x -c -o _glib_la-pygmainloop.lo `test -f 'pygmainloop.c' || echo './'`pygmainloop.c
  371. /bin/sh ../../libtool  --tag=CC   --mode=compile x86_64-pc-linux-gnu-gcc -DHAVE_CONFIG_H -I. -I../..  -I/usr/include/python3.2 -I/usr/include/python3.2 -DPY_SSIZE_T_CLEAN  -pthread -I/usr/include/glib-2.0 -I/usr/lib64/glib-2.0/include    -march=native -O2 -pipe -Wall -Werror=implicit-function-declaration -Werror=pointer-arith -Werror=format-security -Werror=missing-include-dirs -Werror=format -fno-strict-aliasing -std=c9x -c -o _glib_la-pygsource.lo `test -f 'pygsource.c' || echo './'`pygsource.c
  372. /bin/sh ../../libtool  --tag=CC   --mode=compile x86_64-pc-linux-gnu-gcc -DHAVE_CONFIG_H -I. -I../..  -I/usr/include/python3.2 -I/usr/include/python3.2 -DPY_SSIZE_T_CLEAN  -pthread -I/usr/include/glib-2.0 -I/usr/lib64/glib-2.0/include    -march=native -O2 -pipe -Wall -Werror=implicit-function-declaration -Werror=pointer-arith -Werror=format-security -Werror=missing-include-dirs -Werror=format -fno-strict-aliasing -std=c9x -c -o _glib_la-pygspawn.lo `test -f 'pygspawn.c' || echo './'`pygspawn.c
  373. libtool: compile:  x86_64-pc-linux-gnu-gcc -DHAVE_CONFIG_H -I. -I../.. -I/usr/include/python3.2 -I/usr/include/python3.2 -DPY_SSIZE_T_CLEAN -pthread -I/usr/include/glib-2.0 -I/usr/lib64/glib-2.0/include -march=native -O2 -pipe -Wall -Werror=implicit-function-declaration -Werror=pointer-arith -Werror=format-security -Werror=missing-include-dirs -Werror=format -fno-strict-aliasing -std=c9x -c pygiochannel.c  -fPIC -DPIC -o .libs/_glib_la-pygiochannel.o
  374. libtool: compile:  x86_64-pc-linux-gnu-gcc -DHAVE_CONFIG_H -I. -I../.. -I/usr/include/python3.2 -I/usr/include/python3.2 -DPY_SSIZE_T_CLEAN -pthread -I/usr/include/glib-2.0 -I/usr/lib64/glib-2.0/include -march=native -O2 -pipe -Wall -Werror=implicit-function-declaration -Werror=pointer-arith -Werror=format-security -Werror=missing-include-dirs -Werror=format -fno-strict-aliasing -std=c9x -c pygoptiongroup.c  -fPIC -DPIC -o .libs/_glib_la-pygoptiongroup.o
  375. libtool: compile:  x86_64-pc-linux-gnu-gcc -DHAVE_CONFIG_H -I. -I../.. -I/usr/include/python3.2 -I/usr/include/python3.2 -DPY_SSIZE_T_CLEAN -pthread -I/usr/include/glib-2.0 -I/usr/lib64/glib-2.0/include -march=native -O2 -pipe -Wall -Werror=implicit-function-declaration -Werror=pointer-arith -Werror=format-security -Werror=missing-include-dirs -Werror=format -fno-strict-aliasing -std=c9x -c pyglib.c  -fPIC -DPIC -o .libs/libpyglib_gi_2_0_python3.2_la-pyglib.o
  376. libtool: compile:  x86_64-pc-linux-gnu-gcc -DHAVE_CONFIG_H -I. -I../.. -I/usr/include/python3.2 -I/usr/include/python3.2 -DPY_SSIZE_T_CLEAN -pthread -I/usr/include/glib-2.0 -I/usr/lib64/glib-2.0/include -march=native -O2 -pipe -Wall -Werror=implicit-function-declaration -Werror=pointer-arith -Werror=format-security -Werror=missing-include-dirs -Werror=format -fno-strict-aliasing -std=c9x -c pygsource.c  -fPIC -DPIC -o .libs/_glib_la-pygsource.o
  377. libtool: compile:  x86_64-pc-linux-gnu-gcc -DHAVE_CONFIG_H -I. -I../.. -I/usr/include/python3.2 -I/usr/include/python3.2 -DPY_SSIZE_T_CLEAN -pthread -I/usr/include/glib-2.0 -I/usr/lib64/glib-2.0/include -march=native -O2 -pipe -Wall -Werror=implicit-function-declaration -Werror=pointer-arith -Werror=format-security -Werror=missing-include-dirs -Werror=format -fno-strict-aliasing -std=c9x -c pygoptioncontext.c  -fPIC -DPIC -o .libs/_glib_la-pygoptioncontext.o
  378. libtool: compile:  x86_64-pc-linux-gnu-gcc -DHAVE_CONFIG_H -I. -I../.. -I/usr/include/python3.2 -I/usr/include/python3.2 -DPY_SSIZE_T_CLEAN -pthread -I/usr/include/glib-2.0 -I/usr/lib64/glib-2.0/include -march=native -O2 -pipe -Wall -Werror=implicit-function-declaration -Werror=pointer-arith -Werror=format-security -Werror=missing-include-dirs -Werror=format -fno-strict-aliasing -std=c9x -c glibmodule.c  -fPIC -DPIC -o .libs/_glib_la-glibmodule.o
  379. libtool: compile:  x86_64-pc-linux-gnu-gcc -DHAVE_CONFIG_H -I. -I../.. -I/usr/include/python3.2 -I/usr/include/python3.2 -DPY_SSIZE_T_CLEAN -pthread -I/usr/include/glib-2.0 -I/usr/lib64/glib-2.0/include -march=native -O2 -pipe -Wall -Werror=implicit-function-declaration -Werror=pointer-arith -Werror=format-security -Werror=missing-include-dirs -Werror=format -fno-strict-aliasing -std=c9x -c pygmaincontext.c  -fPIC -DPIC -o .libs/_glib_la-pygmaincontext.o
  380. libtool: compile:  x86_64-pc-linux-gnu-gcc -DHAVE_CONFIG_H -I. -I../.. -I/usr/include/python3.2 -I/usr/include/python3.2 -DPY_SSIZE_T_CLEAN -pthread -I/usr/include/glib-2.0 -I/usr/lib64/glib-2.0/include -march=native -O2 -pipe -Wall -Werror=implicit-function-declaration -Werror=pointer-arith -Werror=format-security -Werror=missing-include-dirs -Werror=format -fno-strict-aliasing -std=c9x -c pygmainloop.c  -fPIC -DPIC -o .libs/_glib_la-pygmainloop.o
  381. libtool: compile:  x86_64-pc-linux-gnu-gcc -DHAVE_CONFIG_H -I. -I../.. -I/usr/include/python3.2 -I/usr/include/python3.2 -DPY_SSIZE_T_CLEAN
  382.  -pthread -I/usr/include/glib-2.0 -I/usr/lib64/glib-2.0/include -march=native -O2 -pipe -Wall -Werror=implicit-function-declaration -Werror=pointer-arith -Werror=format-security -Werror=missing-include-dirs -Werror=format -fno-strict-aliasing -std=c9x -c pygspawn.c  -fPIC -DPIC -o .libs/_glib_la-pygspawn.o
  383. In file included from /usr/include/python3.2/Python.h:111:0,
  384.                  from pygmainloop.c:29:
  385. /usr/include/python3.2/modsupport.h:27:1: error: '_PyArg_ParseTuple_SizeT' is an unrecognized format function type [-Werror=format=]
  386.  PyAPI_FUNC(int) PyArg_ParseTuple(PyObject *, const char *, ...) Py_FORMAT_PARSE
  387.  ^
  388. In file included from /usr/include/python3.2/Python.h:111:0,
  389.                  from ./pyglib.h:25,
  390.                  from pygoptiongroup.c:27:
  391. /usr/include/python3.2/modsupport.h:27:1: error: '_PyArg_ParseTuple_SizeT' is an unrecognized format function type [-Werror=format=]
  392.  PyAPI_FUNC(int) PyArg_ParseTuple(PyObject *, const char *, ...) Py_FORMAT_PARSE
  393.  ^
  394. In file included from /usr/include/python3.2/Python.h:111:0,
  395.                  from pyglib.c:26:
  396. /usr/include/python3.2/modsupport.h:27:1: error: '_PyArg_ParseTuple_SizeT' is an unrecognized format function type [-Werror=format=]
  397.  PyAPI_FUNC(int) PyArg_ParseTuple(PyObject *, const char *, ...) Py_FORMAT_PARSE
  398.  ^
  399. In file included from /usr/include/python3.2/Python.h:111:0,
  400.                  from pygiochannel.c:7:
  401. /usr/include/python3.2/modsupport.h:27:1: error: '_PyArg_ParseTuple_SizeT' is an unrecognized format function type [-Werror=format=]
  402.  PyAPI_FUNC(int) PyArg_ParseTuple(PyObject *, const char *, ...) Py_FORMAT_PARSE
  403.  ^
  404. In file included from /usr/include/python3.2/Python.h:111:0,
  405.                  from glibmodule.c:28:
  406. /usr/include/python3.2/modsupport.h:27:1: error: '_PyArg_ParseTuple_SizeT' is an unrecognized format function type [-Werror=format=]
  407.  PyAPI_FUNC(int) PyArg_ParseTuple(PyObject *, const char *, ...) Py_FORMAT_PARSE
  408.  ^
  409. In file included from /usr/include/python3.2/Python.h:111:0,
  410.                  from pygmaincontext.c:27:
  411. /usr/include/python3.2/modsupport.h:27:1: error: '_PyArg_ParseTuple_SizeT' is an unrecognized format function type [-Werror=format=]
  412.  PyAPI_FUNC(int) PyArg_ParseTuple(PyObject *, const char *, ...) Py_FORMAT_PARSE
  413.  ^
  414. In file included from /usr/include/python3.2/Python.h:111:0,
  415.                  from pygspawn.c:24:
  416. /usr/include/python3.2/modsupport.h:27:1: error: '_PyArg_ParseTuple_SizeT' is an unrecognized format function type [-Werror=format=]
  417.  PyAPI_FUNC(int) PyArg_ParseTuple(PyObject *, const char *, ...) Py_FORMAT_PARSE
  418.  ^
  419. In file included from /usr/include/python3.2/Python.h:111:0,
  420.                  from pygsource.c:30:
  421. /usr/include/python3.2/modsupport.h:27:1: error: '_PyArg_ParseTuple_SizeT' is an unrecognized format function type [-Werror=format=]
  422.  PyAPI_FUNC(int) PyArg_ParseTuple(PyObject *, const char *, ...) Py_FORMAT_PARSE
  423.  ^
  424. cc1: some warnings being treated as errors
  425. pygmainloop.c:38:12: warning: 'pipe_fds' defined but not used [-Wunused-variable]
  426.  static int pipe_fds[2];
  427.             ^
  428. make[3]: *** [_glib_la-pygoptiongroup.lo] Error 1
  429. make[3]: *** Waiting for unfinished jobs....
  430. In file included from /usr/include/python3.2/Python.h:111:0,
  431.                  from ./pyglib.h:25,
  432.                  from pygoptioncontext.c:27:
  433. /usr/include/python3.2/modsupport.h:27:1: error: '_PyArg_ParseTuple_SizeT' is an unrecognized format function type [-Werror=format=]
  434.  PyAPI_FUNC(int) PyArg_ParseTuple(PyObject *, const char *, ...) Py_FORMAT_PARSE
  435.  ^
  436. cc1: some warnings being treated as errors
  437. make[3]: *** [_glib_la-pygmainloop.lo] Error 1
  438. cc1: some warnings being treated as errors
  439. cc1: some warnings being treated as errors
  440. make[3]: *** [libpyglib_gi_2_0_python3.2_la-pyglib.lo] Error 1
  441. make[3]: *** [_glib_la-pygiochannel.lo] Error 1
  442. cc1: some warnings being treated as errors
  443. make[3]: *** [_glib_la-glibmodule.lo] Error 1
  444. cc1: some warnings being treated as errors
  445. make[3]: *** [_glib_la-pygmaincontext.lo] Error 1
  446. cc1: some warnings being treated as errors
  447. make[3]: *** [_glib_la-pygspawn.lo] Error 1
  448. cc1: some warnings being treated as errors
  449. make[3]: *** [_glib_la-pygsource.lo] Error 1
  450. cc1: some warnings being treated as errors
  451. make[3]: *** [_glib_la-pygoptioncontext.lo] Error 1
  452. make[3]: Leaving directory `/var/tmp/portage/dev-python/pygobject-3.4.2-r1/work/pygobject-3.4.2-python3_2/gi/_glib'
  453. make[2]: *** [all-recursive] Error 1
  454. make[2]: Leaving directory `/var/tmp/portage/dev-python/pygobject-3.4.2-r1/work/pygobject-3.4.2-python3_2/gi'
  455. make[1]: *** [all-recursive] Error 1
  456. make[1]: Leaving directory `/var/tmp/portage/dev-python/pygobject-3.4.2-r1/work/pygobject-3.4.2-python3_2'
  457. make: *** [all] Error 2
  458. #[31;01m*#[0m ERROR: dev-python/pygobject-3.4.2-r1 failed (compile phase):
  459. #[31;01m*#[0m   emake failed
  460. #[31;01m*#[0m
  461. #[31;01m*#[0m If you need support, post the output of `emerge --info '=dev-python/pygobject-3.4.2-r1'`,
  462. #[31;01m*#[0m the complete build log and the output of `emerge -pqv '=dev-python/pygobject-3.4.2-r1'`.
  463. #[31;01m*#[0m The complete build log is located at '/var/tmp/portage/dev-python/pygobject-3.4.2-r1/temp/build.log'.
  464. #[31;01m*#[0m The ebuild environment file is located at '/var/tmp/portage/dev-python/pygobject-3.4.2-r1/temp/environment'.
  465. #[31;01m*#[0m Working directory: '/var/tmp/portage/dev-python/pygobject-3.4.2-r1/work/pygobject-3.4.2-python3_2'
  466. #[31;01m*#[0m S: '/var/tmp/portage/dev-python/pygobject-3.4.2-r1/work/pygobject-3.4.2'
clone this paste RAW Paste Data