Pastebin launched a little side project called VERYVIRAL.com, check it out ;-) Want more features on Pastebin? Sign Up, it's FREE!
Guest

Untitled

By: a guest on Mar 23rd, 2014  |  syntax: None  |  size: 35.82 KB  |  views: 134  |  expires: Never
download  |  raw  |  embed  |  report abuse  |  print
Text below is selected. Please press Ctrl+C to copy to your clipboard. (⌘+C on Mac)
  1. marius:~/grive-git$ makepkg -s        
  2. ==> Making package: grive-git 20130619-1 (su. 23. mars 08:05:51 +0100 2014)
  3. ==> Checking runtime dependencies...
  4. ==> Checking buildtime dependencies...
  5. ==> Retrieving sources...
  6. ==> Extracting sources...
  7. ==> Removing existing pkg/ directory...
  8. ==> Starting build()...
  9. ==> Connecting to GIT server....
  10. Already up-to-date.
  11. ==> The local files are updated.
  12. ==> GIT checkout done or server timeout
  13. ==> Starting make...
  14. -- The C compiler identification is GNU 4.8.2
  15. -- The CXX compiler identification is GNU 4.8.2
  16. -- Check for working C compiler: /usr/bin/cc
  17. -- Check for working C compiler: /usr/bin/cc -- works
  18. -- Detecting C compiler ABI info
  19. -- Detecting C compiler ABI info - done
  20. -- Check for working CXX compiler: /usr/bin/c++
  21. -- Check for working CXX compiler: /usr/bin/c++ -- works
  22. -- Detecting CXX compiler ABI info
  23. -- Detecting CXX compiler ABI info - done
  24. -- Found libgcrypt: -lgcrypt -lgpg-error
  25. -- Found JSON-C: /usr/lib64/libjson.so
  26. -- Found CURL: /usr/local/lib/libcurl.a (found version "7.28.1")
  27. -- Found EXPAT: /usr/lib64/libexpat.so (found version "2.1.0")
  28. -- Boost version: 1.55.0
  29. -- Found the following Boost libraries:
  30. --   program_options
  31. --   filesystem
  32. --   unit_test_framework
  33. --   system
  34. -- Found libbfd: /usr/lib64/libbfd.a
  35. -- Found libiberty: /usr/lib64/libiberty.a
  36. -- Found ZLIB: /usr/lib64/libz.so (found version "1.2.8")
  37. -- Boost version: 1.55.0
  38. -- Found the following Boost libraries:
  39. --   program_options
  40. -- Looking for Q_WS_X11
  41. -- Looking for Q_WS_X11 - found
  42. -- Looking for Q_WS_WIN
  43. -- Looking for Q_WS_WIN - not found
  44. -- Looking for Q_WS_QWS
  45. -- Looking for Q_WS_QWS - not found
  46. -- Looking for Q_WS_MAC
  47. -- Looking for Q_WS_MAC - not found
  48. -- Found Qt4: /usr/bin/qmake-qt4 (found version "4.8.5")
  49. -- Boost version: 1.55.0
  50. -- Configuring done
  51. -- Generating done
  52. -- Build files have been written to: /home/marius/grive-git/src/build
  53. Scanning dependencies of target grive
  54. [  1%] Building CXX object libgrive/CMakeFiles/grive.dir/src/drive/State.cc.o
  55. [  3%] Building CXX object libgrive/CMakeFiles/grive.dir/src/drive/Feed.cc.o
  56. [  5%] Building CXX object libgrive/CMakeFiles/grive.dir/src/drive/Drive.cc.o
  57. [  7%] Building CXX object libgrive/CMakeFiles/grive.dir/src/drive/CommonUri.cc.o
  58. [  8%] Building CXX object libgrive/CMakeFiles/grive.dir/src/drive/Entry.cc.o
  59. [ 10%] Building CXX object libgrive/CMakeFiles/grive.dir/src/drive/Resource.cc.o
  60. [ 12%] Building CXX object libgrive/CMakeFiles/grive.dir/src/drive/ResourceTree.cc.o
  61. [ 14%] Building CXX object libgrive/CMakeFiles/grive.dir/src/drive2/Feed.cc.o
  62. [ 16%] Building CXX object libgrive/CMakeFiles/grive.dir/src/drive2/Drive.cc.o
  63. [ 17%] Building CXX object libgrive/CMakeFiles/grive.dir/src/drive2/Resource.cc.o
  64. [ 19%] Building CXX object libgrive/CMakeFiles/grive.dir/src/http/XmlResponse.cc.o
  65. [ 21%] Building CXX object libgrive/CMakeFiles/grive.dir/src/http/Download.cc.o
  66. [ 23%] Building CXX object libgrive/CMakeFiles/grive.dir/src/http/Header.cc.o
  67. [ 25%] Building CXX object libgrive/CMakeFiles/grive.dir/src/http/CurlAgent.cc.o
  68. [ 26%] Building CXX object libgrive/CMakeFiles/grive.dir/src/http/ResponseLog.cc.o
  69. [ 28%] Building CXX object libgrive/CMakeFiles/grive.dir/src/http/StringResponse.cc.o
  70. [ 30%] Building CXX object libgrive/CMakeFiles/grive.dir/src/protocol/Json.cc.o
  71. [ 32%] Building CXX object libgrive/CMakeFiles/grive.dir/src/protocol/JsonResponse.cc.o
  72. [ 33%] Building CXX object libgrive/CMakeFiles/grive.dir/src/protocol/AuthAgent.cc.o
  73. [ 35%] Building CXX object libgrive/CMakeFiles/grive.dir/src/protocol/OAuth2.cc.o
  74. [ 37%] Building CXX object libgrive/CMakeFiles/grive.dir/src/json/ValBuilder.cc.o
  75. [ 39%] Building CXX object libgrive/CMakeFiles/grive.dir/src/json/Val.cc.o
  76. [ 41%] Building CXX object libgrive/CMakeFiles/grive.dir/src/json/JsonParser.cc.o
  77. [ 42%] Building CXX object libgrive/CMakeFiles/grive.dir/src/json/JsonWriter.cc.o
  78. [ 44%] Building CXX object libgrive/CMakeFiles/grive.dir/src/json/ValResponse.cc.o
  79. [ 46%] Building CXX object libgrive/CMakeFiles/grive.dir/src/util/Config.cc.o
  80. [ 48%] Building CXX object libgrive/CMakeFiles/grive.dir/src/util/SignalHandler.cc.o
  81. [ 50%] Building CXX object libgrive/CMakeFiles/grive.dir/src/util/MemMap.cc.o
  82. [ 51%] Building CXX object libgrive/CMakeFiles/grive.dir/src/util/StdStream.cc.o
  83. [ 53%] Building CXX object libgrive/CMakeFiles/grive.dir/src/util/File.cc.o
  84. [ 55%] Building CXX object libgrive/CMakeFiles/grive.dir/src/util/Crypt.cc.o
  85. [ 57%] Building CXX object libgrive/CMakeFiles/grive.dir/src/util/Exception.cc.o
  86. [ 58%] Building CXX object libgrive/CMakeFiles/grive.dir/src/util/DateTime.cc.o
  87. [ 60%] Building CXX object libgrive/CMakeFiles/grive.dir/src/util/StringStream.cc.o
  88. [ 62%] Building CXX object libgrive/CMakeFiles/grive.dir/src/util/OS.cc.o
  89. [ 64%] Building CXX object libgrive/CMakeFiles/grive.dir/src/util/log/DefaultLog.cc.o
  90. [ 66%] Building CXX object libgrive/CMakeFiles/grive.dir/src/util/log/CompositeLog.cc.o
  91. [ 67%] Building CXX object libgrive/CMakeFiles/grive.dir/src/util/log/Log.cc.o
  92. [ 69%] Building CXX object libgrive/CMakeFiles/grive.dir/src/util/log/CommonLog.cc.o
  93. [ 71%] Building CXX object libgrive/CMakeFiles/grive.dir/src/xml/String.cc.o
  94. [ 73%] Building CXX object libgrive/CMakeFiles/grive.dir/src/xml/Node.cc.o
  95. [ 75%] Building CXX object libgrive/CMakeFiles/grive.dir/src/xml/NodeSet.cc.o
  96. [ 76%] Building CXX object libgrive/CMakeFiles/grive.dir/src/xml/TreeBuilder.cc.o
  97. [ 78%] Building CXX object libgrive/CMakeFiles/grive.dir/src/bfd/SymbolInfo.cc.o
  98. [ 80%] Building CXX object libgrive/CMakeFiles/grive.dir/src/bfd/Backtrace.cc.o
  99. [ 82%] Building CXX object libgrive/CMakeFiles/grive.dir/src/bfd/Debug.cc.o
  100. Linking CXX static library libgrive.a
  101. [ 82%] Built target grive
  102. Scanning dependencies of target btest
  103. [ 83%] Building CXX object libgrive/CMakeFiles/btest.dir/test/btest/JsonValTest.cc.o
  104. [ 85%] Building CXX object libgrive/CMakeFiles/btest.dir/test/btest/ValTest.cc.o
  105. [ 87%] Building CXX object libgrive/CMakeFiles/btest.dir/test/btest/UnitTest.cc.o
  106. Linking CXX executable btest
  107. [ 87%] Built target btest
  108. Scanning dependencies of target grive_executable
  109. [ 89%] Building CXX object grive/CMakeFiles/grive_executable.dir/src/main.cc.o
  110. Linking CXX executable grive
  111. /usr/local/lib/libcurl.a(libcurl_la-url.o): In function `Curl_disconnect':
  112. url.c:(.text+0xd56): undefined reference to `idn_free'
  113. url.c:(.text+0xd67): undefined reference to `idn_free'
  114. /usr/local/lib/libcurl.a(libcurl_la-url.o): In function `fix_hostname':
  115. url.c:(.text.unlikely+0x73): undefined reference to `stringprep_check_version'
  116. url.c:(.text.unlikely+0x95): undefined reference to `idna_to_ascii_lz'
  117. url.c:(.text.unlikely+0x9d): undefined reference to `stringprep_locale_charset'
  118. url.c:(.text.unlikely+0xf8): undefined reference to `idna_to_unicode_lzlz'
  119. url.c:(.text.unlikely+0x10d): undefined reference to `tld_check_lz'
  120. url.c:(.text.unlikely+0x11b): undefined reference to `tld_strerror'
  121. url.c:(.text.unlikely+0x156): undefined reference to `idn_free'
  122. /usr/local/lib/libcurl.a(libcurl_la-strerror.o): In function `Curl_idn_strerror':
  123. strerror.c:(.text+0x723): undefined reference to `idna_strerror'
  124. /usr/local/lib/libcurl.a(libcurl_la-ssluse.o): In function `ossl_send':
  125. ssluse.c:(.text+0x1c): undefined reference to `ERR_clear_error'
  126. ssluse.c:(.text+0x48): undefined reference to `SSL_write'
  127. ssluse.c:(.text+0x70): undefined reference to `SSL_get_error'
  128. ssluse.c:(.text+0x88): undefined reference to `ERR_get_error'
  129. ssluse.c:(.text+0x93): undefined reference to `ERR_error_string'
  130. /usr/local/lib/libcurl.a(libcurl_la-ssluse.o): In function `x509_name_oneline':
  131. ssluse.c:(.text+0x136): undefined reference to `BIO_s_mem'
  132. ssluse.c:(.text+0x13e): undefined reference to `BIO_new'
  133. ssluse.c:(.text+0x15d): undefined reference to `X509_NAME_print_ex'
  134. ssluse.c:(.text+0x174): undefined reference to `BIO_ctrl'
  135. ssluse.c:(.text+0x1a3): undefined reference to `BIO_free'
  136. /usr/local/lib/libcurl.a(libcurl_la-ssluse.o): In function `cert_verify_callback':
  137. ssluse.c:(.text+0x1ce): undefined reference to `X509_STORE_CTX_get_current_cert'
  138. ssluse.c:(.text+0x1d6): undefined reference to `X509_get_subject_name'
  139. /usr/local/lib/libcurl.a(libcurl_la-ssluse.o): In function `X509V3_ext':
  140. ssluse.c:(.text+0x6e0): undefined reference to `sk_num'
  141. ssluse.c:(.text+0x710): undefined reference to `sk_num'
  142. ssluse.c:(.text+0x725): undefined reference to `sk_value'
  143. ssluse.c:(.text+0x72d): undefined reference to `BIO_s_mem'
  144. ssluse.c:(.text+0x735): undefined reference to `BIO_new'
  145. ssluse.c:(.text+0x749): undefined reference to `X509_EXTENSION_get_object'
  146. ssluse.c:(.text+0x75e): undefined reference to `i2t_ASN1_OBJECT'
  147. ssluse.c:(.text+0x766): undefined reference to `X509_EXTENSION_get_critical'
  148. ssluse.c:(.text+0x79d): undefined reference to `X509V3_EXT_print'
  149. ssluse.c:(.text+0x7bf): undefined reference to `BIO_ctrl'
  150. ssluse.c:(.text+0x848): undefined reference to `BIO_free'
  151. ssluse.c:(.text+0x851): undefined reference to `sk_num'
  152. ssluse.c:(.text+0x8cd): undefined reference to `ASN1_STRING_print'
  153. /usr/local/lib/libcurl.a(libcurl_la-ssluse.o): In function `ossl_recv':
  154. ssluse.c:(.text+0x90c): undefined reference to `ERR_clear_error'
  155. ssluse.c:(.text+0x938): undefined reference to `SSL_read'
  156. ssluse.c:(.text+0x968): undefined reference to `SSL_get_error'
  157. ssluse.c:(.text+0x991): undefined reference to `ERR_get_error'
  158. ssluse.c:(.text+0x9a6): undefined reference to `ERR_error_string'
  159. /usr/local/lib/libcurl.a(libcurl_la-ssluse.o): In function `servercert':
  160. ssluse.c:(.text+0xd1d): undefined reference to `SSL_get_peer_certificate'
  161. ssluse.c:(.text+0xd4b): undefined reference to `X509_get_subject_name'
  162. ssluse.c:(.text+0xd78): undefined reference to `X509_free'
  163. ssluse.c:(.text+0xdf9): undefined reference to `SSL_get_peer_cert_chain'
  164. ssluse.c:(.text+0xe11): undefined reference to `sk_num'
  165. ssluse.c:(.text+0xe8b): undefined reference to `sk_value'
  166. ssluse.c:(.text+0xe9b): undefined reference to `X509_get_subject_name'
  167. ssluse.c:(.text+0xedf): undefined reference to `X509_get_issuer_name'
  168. ssluse.c:(.text+0xf23): undefined reference to `ASN1_INTEGER_get'
  169. ssluse.c:(.text+0xf74): undefined reference to `X509_get_serialNumber'
  170. ssluse.c:(.text+0x1026): undefined reference to `i2t_ASN1_OBJECT'
  171. ssluse.c:(.text+0x1103): undefined reference to `i2t_ASN1_OBJECT'
  172. ssluse.c:(.text+0x113d): undefined reference to `X509_get_pubkey'
  173. ssluse.c:(.text+0x116e): undefined reference to `EVP_PKEY_free'
  174. ssluse.c:(.text+0x119e): undefined reference to `BIO_s_mem'
  175. ssluse.c:(.text+0x11a6): undefined reference to `BIO_new'
  176. ssluse.c:(.text+0x11b4): undefined reference to `PEM_write_bio_X509'
  177. ssluse.c:(.text+0x11c8): undefined reference to `BIO_ctrl'
  178. ssluse.c:(.text+0x1208): undefined reference to `BIO_free'
  179. ssluse.c:(.text+0x1342): undefined reference to `X509_get_ext_d2i'
  180. ssluse.c:(.text+0x1356): undefined reference to `sk_num'
  181. ssluse.c:(.text+0x13a8): undefined reference to `sk_value'
  182. ssluse.c:(.text+0x13b9): undefined reference to `ASN1_STRING_data'
  183. ssluse.c:(.text+0x13c7): undefined reference to `ASN1_STRING_length'
  184. ssluse.c:(.text+0x1414): undefined reference to `ASN1_INTEGER_get'
  185. ssluse.c:(.text+0x1474): undefined reference to `GENERAL_NAMES_free'
  186. ssluse.c:(.text+0x1490): undefined reference to `X509_get_subject_name'
  187. ssluse.c:(.text+0x14b7): undefined reference to `X509_NAME_get_index_by_NID'
  188. ssluse.c:(.text+0x14cf): undefined reference to `X509_NAME_get_entry'
  189. ssluse.c:(.text+0x14d7): undefined reference to `X509_NAME_ENTRY_get_data'
  190. ssluse.c:(.text+0x14eb): undefined reference to `ASN1_STRING_type'
  191. ssluse.c:(.text+0x1501): undefined reference to `ASN1_STRING_to_UTF8'
  192. ssluse.c:(.text+0x1569): undefined reference to `CRYPTO_free'
  193. ssluse.c:(.text+0x157b): undefined reference to `X509_get_issuer_name'
  194. ssluse.c:(.text+0x15ac): undefined reference to `X509_free'
  195. ssluse.c:(.text+0x15d6): undefined reference to `BN_num_bits'
  196. ssluse.c:(.text+0x1604): undefined reference to `BN_num_bits'
  197. ssluse.c:(.text+0x1632): undefined reference to `BN_num_bits'
  198. ssluse.c:(.text+0x1660): undefined reference to `BN_num_bits'
  199. ssluse.c:(.text+0x1692): undefined reference to `BN_num_bits'
  200. ssluse.c:(.text+0x16c3): undefined reference to `BN_bn2bin'
  201. ssluse.c:(.text+0x1706): undefined reference to `BN_num_bits'
  202. ssluse.c:(.text+0x1734): undefined reference to `BN_num_bits'
  203. ssluse.c:(.text+0x1762): undefined reference to `BN_num_bits'
  204. ssluse.c:(.text+0x1794): undefined reference to `BN_num_bits'
  205. ssluse.c:(.text+0x17c5): undefined reference to `BN_bn2bin'
  206. ssluse.c:(.text+0x1809): undefined reference to `BN_num_bits'
  207. ssluse.c:(.text+0x1829): undefined reference to `BN_num_bits'
  208. ssluse.c:(.text+0x1868): undefined reference to `BN_num_bits'
  209. ssluse.c:(.text+0x1896): undefined reference to `BN_num_bits'
  210. ssluse.c:(.text+0x18c4): undefined reference to `BN_num_bits'
  211. /usr/local/lib/libcurl.a(libcurl_la-ssluse.o):ssluse.c:(.text+0x18f2): more undefined references to `BN_num_bits' follow
  212. /usr/local/lib/libcurl.a(libcurl_la-ssluse.o): In function `servercert':
  213. ssluse.c:(.text+0x19df): undefined reference to `BN_bn2bin'
  214. ssluse.c:(.text+0x1a8d): undefined reference to `BN_bn2bin'
  215. ssluse.c:(.text+0x1ad0): undefined reference to `BN_bn2bin'
  216. ssluse.c:(.text+0x1b13): undefined reference to `BN_bn2bin'
  217. ssluse.c:(.text+0x1b56): undefined reference to `BN_bn2bin'
  218. /usr/local/lib/libcurl.a(libcurl_la-ssluse.o):ssluse.c:(.text+0x1b99): more undefined references to `BN_bn2bin' follow
  219. /usr/local/lib/libcurl.a(libcurl_la-ssluse.o): In function `servercert':
  220. ssluse.c:(.text+0x1e46): undefined reference to `GENERAL_NAMES_free'
  221. ssluse.c:(.text+0x1e8a): undefined reference to `X509_free'
  222. ssluse.c:(.text+0x1ee1): undefined reference to `PEM_read_X509'
  223. ssluse.c:(.text+0x1f01): undefined reference to `X509_check_issued'
  224. ssluse.c:(.text+0x1f36): undefined reference to `X509_free'
  225. ssluse.c:(.text+0x1f3e): undefined reference to `X509_free'
  226. ssluse.c:(.text+0x1ff6): undefined reference to `X509_free'
  227. ssluse.c:(.text+0x2081): undefined reference to `X509_free'
  228. ssluse.c:(.text+0x2088): undefined reference to `X509_free'
  229. /usr/local/lib/libcurl.a(libcurl_la-ssluse.o):ssluse.c:(.text+0x20ba): more undefined references to `X509_free' follow
  230. /usr/local/lib/libcurl.a(libcurl_la-ssluse.o): In function `servercert':
  231. ssluse.c:(.text+0x20c3): undefined reference to `SSL_get_verify_result'
  232. ssluse.c:(.text+0x20fb): undefined reference to `X509_verify_cert_error_string'
  233. ssluse.c:(.text+0x212e): undefined reference to `GENERAL_NAMES_free'
  234. ssluse.c:(.text+0x218c): undefined reference to `ASN1_STRING_length'
  235. ssluse.c:(.text+0x21ab): undefined reference to `CRYPTO_malloc'
  236. ssluse.c:(.text+0x21c0): undefined reference to `ASN1_STRING_data'
  237. ssluse.c:(.text+0x2224): undefined reference to `X509_verify_cert_error_string'
  238. /usr/local/lib/libcurl.a(libcurl_la-ssluse.o): In function `Curl_ossl_seed':
  239. ssluse.c:(.text+0x2281): undefined reference to `RAND_load_file'
  240. ssluse.c:(.text+0x2286): undefined reference to `RAND_status'
  241. ssluse.c:(.text+0x229b): undefined reference to `RAND_egd'
  242. ssluse.c:(.text+0x22a5): undefined reference to `RAND_status'
  243. ssluse.c:(.text+0x22de): undefined reference to `RAND_add'
  244. ssluse.c:(.text+0x22ef): undefined reference to `RAND_status'
  245. ssluse.c:(.text+0x2338): undefined reference to `RAND_file_name'
  246. ssluse.c:(.text+0x234e): undefined reference to `RAND_load_file'
  247. ssluse.c:(.text+0x2353): undefined reference to `RAND_status'
  248. /usr/local/lib/libcurl.a(libcurl_la-ssluse.o): In function `ossl_connect_common':
  249. ssluse.c:(.text+0x2435): undefined reference to `ERR_clear_error'
  250. ssluse.c:(.text+0x243e): undefined reference to `SSL_connect'
  251. ssluse.c:(.text+0x2452): undefined reference to `SSL_get_error'
  252. ssluse.c:(.text+0x2470): undefined reference to `ERR_get_error'
  253. ssluse.c:(.text+0x24a8): undefined reference to `ERR_error_string_n'
  254. ssluse.c:(.text+0x2544): undefined reference to `SSL_get_current_cipher'
  255. ssluse.c:(.text+0x254c): undefined reference to `SSL_CIPHER_get_name'
  256. ssluse.c:(.text+0x25ad): undefined reference to `SSL_get_verify_result'
  257. ssluse.c:(.text+0x2619): undefined reference to `X509_verify_cert_error_string'
  258. ssluse.c:(.text+0x26d6): undefined reference to `SSLv23_client_method'
  259. ssluse.c:(.text+0x26ec): undefined reference to `SSL_CTX_free'
  260. ssluse.c:(.text+0x26f4): undefined reference to `SSL_CTX_new'
  261. ssluse.c:(.text+0x2715): undefined reference to `SSL_CTX_ctrl'
  262. ssluse.c:(.text+0x276e): undefined reference to `SSL_CTX_ctrl'
  263. ssluse.c:(.text+0x27da): undefined reference to `SSL_CTX_set_default_passwd_cb_userdata'
  264. ssluse.c:(.text+0x27eb): undefined reference to `SSL_CTX_set_default_passwd_cb'
  265. ssluse.c:(.text+0x2847): undefined reference to `d2i_PKCS12_fp'
  266. ssluse.c:(.text+0x286a): undefined reference to `PKCS12_PBE_add'
  267. ssluse.c:(.text+0x288d): undefined reference to `PKCS12_parse'
  268. ssluse.c:(.text+0x289a): undefined reference to `ERR_get_error'
  269. ssluse.c:(.text+0x28a4): undefined reference to `ERR_error_string'
  270. ssluse.c:(.text+0x28c2): undefined reference to `PKCS12_free'
  271. ssluse.c:(.text+0x2927): undefined reference to `TLSv1_client_method'
  272. ssluse.c:(.text+0x294d): undefined reference to `SSL_get1_session'
  273. ssluse.c:(.text+0x2a20): undefined reference to `SSLv3_client_method'
  274. ssluse.c:(.text+0x2a46): undefined reference to `SSLv2_client_method'
  275. ssluse.c:(.text+0x2a58): undefined reference to `ERR_peek_error'
  276. ssluse.c:(.text+0x2a62): undefined reference to `ERR_error_string'
  277. ssluse.c:(.text+0x2ae0): undefined reference to `SSL_CTX_set_cipher_list'
  278. ssluse.c:(.text+0x2b19): undefined reference to `SSL_CTX_load_verify_locations'
  279. ssluse.c:(.text+0x2b88): undefined reference to `SSL_CTX_callback_ctrl'
  280. ssluse.c:(.text+0x2bbd): undefined reference to `SSL_CTX_use_certificate_chain_file'
  281. ssluse.c:(.text+0x2bf2): undefined reference to `TLSv1_client_method'
  282. ssluse.c:(.text+0x2c35): undefined reference to `SSL_CTX_ctrl'
  283. ssluse.c:(.text+0x2c66): undefined reference to `SSL_CTX_use_certificate_file'
  284. ssluse.c:(.text+0x2cb6): undefined reference to `SSL_new'
  285. ssluse.c:(.text+0x2cce): undefined reference to `SSL_get_certificate'
  286. ssluse.c:(.text+0x2ce0): undefined reference to `X509_get_pubkey'
  287. ssluse.c:(.text+0x2cef): undefined reference to `SSL_get_privatekey'
  288. ssluse.c:(.text+0x2cfc): undefined reference to `EVP_PKEY_copy_parameters'
  289. ssluse.c:(.text+0x2d06): undefined reference to `EVP_PKEY_free'
  290. ssluse.c:(.text+0x2d10): undefined reference to `SSL_free'
  291. ssluse.c:(.text+0x2d1a): undefined reference to `SSL_CTX_check_private_key'
  292. ssluse.c:(.text+0x2d90): undefined reference to `ENGINE_ctrl'
  293. ssluse.c:(.text+0x2de2): undefined reference to `X509_LOOKUP_file'
  294. ssluse.c:(.text+0x2dee): undefined reference to `SSL_CTX_get_cert_store'
  295. ssluse.c:(.text+0x2df9): undefined reference to `X509_STORE_add_lookup'
  296. ssluse.c:(.text+0x2e13): undefined reference to `X509_load_crl_file'
  297. ssluse.c:(.text+0x2eb3): undefined reference to `ENGINE_ctrl_cmd'
  298. ssluse.c:(.text+0x2ed6): undefined reference to `SSL_CTX_use_certificate'
  299. ssluse.c:(.text+0x2efd): undefined reference to `X509_free'
  300. ssluse.c:(.text+0x2f0c): undefined reference to `PKCS12_free'
  301. ssluse.c:(.text+0x2f1b): undefined reference to `SSL_CTX_use_certificate'
  302. ssluse.c:(.text+0x2f3f): undefined reference to `EVP_PKEY_free'
  303. ssluse.c:(.text+0x2f49): undefined reference to `X509_free'
  304. ssluse.c:(.text+0x2f50): undefined reference to `X509_free'
  305. ssluse.c:(.text+0x2f5d): undefined reference to `sk_pop_free'
  306. ssluse.c:(.text+0x2f6a): undefined reference to `SSL_SESSION_free'
  307. ssluse.c:(.text+0x2fa9): undefined reference to `SSL_CTX_use_PrivateKey_file'
  308. ssluse.c:(.text+0x300a): undefined reference to `SSL_CTX_set_srp_username'
  309. ssluse.c:(.text+0x3076): undefined reference to `SSL_CTX_get_cert_store'
  310. ssluse.c:(.text+0x3083): undefined reference to `X509_STORE_set_flags'
  311. ssluse.c:(.text+0x30c3): undefined reference to `SSL_CTX_set_verify'
  312. ssluse.c:(.text+0x30fa): undefined reference to `SSL_free'
  313. ssluse.c:(.text+0x3103): undefined reference to `SSL_new'
  314. ssluse.c:(.text+0x3120): undefined reference to `SSL_set_connect_state'
  315. ssluse.c:(.text+0x3169): undefined reference to `SSL_set_session'
  316. ssluse.c:(.text+0x3176): undefined reference to `ERR_get_error'
  317. ssluse.c:(.text+0x3180): undefined reference to `ERR_error_string'
  318. ssluse.c:(.text+0x31e3): undefined reference to `UI_OpenSSL'
  319. ssluse.c:(.text+0x31fe): undefined reference to `ENGINE_load_private_key'
  320. ssluse.c:(.text+0x3219): undefined reference to `SSL_CTX_use_PrivateKey'
  321. ssluse.c:(.text+0x324a): undefined reference to `EVP_PKEY_free'
  322. ssluse.c:(.text+0x3276): undefined reference to `SSL_CTX_set_srp_password'
  323. ssluse.c:(.text+0x32ae): undefined reference to `SSL_CTX_set_cipher_list'
  324. ssluse.c:(.text+0x32f4): undefined reference to `ERR_get_error'
  325. ssluse.c:(.text+0x32fe): undefined reference to `ERR_error_string'
  326. ssluse.c:(.text+0x3329): undefined reference to `X509_free'
  327. ssluse.c:(.text+0x333f): undefined reference to `SSL_CTX_use_PrivateKey'
  328. ssluse.c:(.text+0x3381): undefined reference to `SSL_set_fd'
  329. ssluse.c:(.text+0x33fa): undefined reference to `EVP_PKEY_free'
  330. ssluse.c:(.text+0x340b): undefined reference to `SSL_CTX_check_private_key'
  331. ssluse.c:(.text+0x3429): undefined reference to `sk_num'
  332. ssluse.c:(.text+0x344d): undefined reference to `sk_value'
  333. ssluse.c:(.text+0x3461): undefined reference to `SSL_CTX_ctrl'
  334. ssluse.c:(.text+0x347b): undefined reference to `sk_value'
  335. ssluse.c:(.text+0x3488): undefined reference to `SSL_CTX_add_client_CA'
  336. ssluse.c:(.text+0x34a2): undefined reference to `sk_num'
  337. ssluse.c:(.text+0x34b2): undefined reference to `EVP_PKEY_free'
  338. ssluse.c:(.text+0x34bc): undefined reference to `X509_free'
  339. ssluse.c:(.text+0x34c3): undefined reference to `X509_free'
  340. ssluse.c:(.text+0x34d0): undefined reference to `sk_pop_free'
  341. ssluse.c:(.text+0x34df): undefined reference to `ERR_get_error'
  342. ssluse.c:(.text+0x34e9): undefined reference to `ERR_error_string'
  343. ssluse.c:(.text+0x358d): undefined reference to `SSL_ctrl'
  344. /usr/local/lib/libcurl.a(libcurl_la-ssluse.o): In function `Curl_ossl_init':
  345. ssluse.c:(.text+0x3605): undefined reference to `ENGINE_load_builtin_engines'
  346. ssluse.c:(.text+0x360a): undefined reference to `SSL_load_error_strings'
  347. ssluse.c:(.text+0x360f): undefined reference to `SSL_library_init'
  348. ssluse.c:(.text+0x3618): undefined reference to `OPENSSL_add_all_algorithms_noconf'
  349. /usr/local/lib/libcurl.a(libcurl_la-ssluse.o): In function `Curl_ossl_cleanup':
  350. ssluse.c:(.text+0x3635): undefined reference to `EVP_cleanup'
  351. ssluse.c:(.text+0x363a): undefined reference to `ENGINE_cleanup'
  352. ssluse.c:(.text+0x363f): undefined reference to `CRYPTO_cleanup_all_ex_data'
  353. ssluse.c:(.text+0x3644): undefined reference to `ERR_free_strings'
  354. /usr/local/lib/libcurl.a(libcurl_la-ssluse.o): In function `Curl_ossl_check_cxn':
  355. ssluse.c:(.text+0x3676): undefined reference to `SSL_peek'
  356. /usr/local/lib/libcurl.a(libcurl_la-ssluse.o): In function `Curl_ossl_set_engine':
  357. ssluse.c:(.text+0x36b5): undefined reference to `ENGINE_by_id'
  358. ssluse.c:(.text+0x36d2): undefined reference to `ENGINE_finish'
  359. ssluse.c:(.text+0x36de): undefined reference to `ENGINE_free'
  360. ssluse.c:(.text+0x36f1): undefined reference to `ENGINE_init'
  361. ssluse.c:(.text+0x3714): undefined reference to `ENGINE_free'
  362. ssluse.c:(.text+0x3719): undefined reference to `ERR_get_error'
  363. ssluse.c:(.text+0x3729): undefined reference to `ERR_error_string_n'
  364. /usr/local/lib/libcurl.a(libcurl_la-ssluse.o): In function `Curl_ossl_set_engine_default':
  365. ssluse.c:(.text+0x379d): undefined reference to `ENGINE_set_default'
  366. ssluse.c:(.text+0x37ad): undefined reference to `ENGINE_get_id'
  367. ssluse.c:(.text+0x37d1): undefined reference to `ENGINE_get_id'
  368. /usr/local/lib/libcurl.a(libcurl_la-ssluse.o): In function `Curl_ossl_engines_list':
  369. ssluse.c:(.text+0x3805): undefined reference to `ENGINE_get_first'
  370. ssluse.c:(.text+0x3824): undefined reference to `ENGINE_get_next'
  371. ssluse.c:(.text+0x3837): undefined reference to `ENGINE_get_id'
  372. /usr/local/lib/libcurl.a(libcurl_la-ssluse.o): In function `Curl_ossl_close':
  373. ssluse.c:(.text+0x388a): undefined reference to `SSL_shutdown'
  374. ssluse.c:(.text+0x3893): undefined reference to `SSL_set_connect_state'
  375. ssluse.c:(.text+0x389c): undefined reference to `SSL_free'
  376. ssluse.c:(.text+0x38b2): undefined reference to `SSL_CTX_free'
  377. /usr/local/lib/libcurl.a(libcurl_la-ssluse.o): In function `Curl_ossl_shutdown':
  378. ssluse.c:(.text+0x392b): undefined reference to `ERR_clear_error'
  379. ssluse.c:(.text+0x3943): undefined reference to `SSL_read'
  380. ssluse.c:(.text+0x3952): undefined reference to `SSL_get_error'
  381. ssluse.c:(.text+0x3973): undefined reference to `ERR_get_error'
  382. ssluse.c:(.text+0x3988): undefined reference to `ERR_error_string'
  383. ssluse.c:(.text+0x39b5): undefined reference to `SSL_free'
  384. ssluse.c:(.text+0x39ed): undefined reference to `SSL_get_shutdown'
  385. ssluse.c:(.text+0x3ab5): undefined reference to `SSL_shutdown'
  386. /usr/local/lib/libcurl.a(libcurl_la-ssluse.o): In function `Curl_ossl_close_all':
  387. ssluse.c:(.text+0x3b11): undefined reference to `ENGINE_finish'
  388. ssluse.c:(.text+0x3b1d): undefined reference to `ENGINE_free'
  389. /usr/local/lib/libcurl.a(libcurl_la-ssluse.o): In function `Curl_ossl_data_pending':
  390. ssluse.c:(.text+0x3b7b): undefined reference to `SSL_pending'
  391. /usr/local/lib/libcurl.a(libcurl_la-ssluse.o): In function `Curl_ossl_version':
  392. ssluse.c:(.text+0x3ba2): undefined reference to `SSLeay'
  393. /usr/local/lib/libcurl.a(libcurl_la-ssluse.o): In function `Curl_ossl_md5sum':
  394. ssluse.c:(.text+0x3c77): undefined reference to `MD5_Init'
  395. ssluse.c:(.text+0x3c85): undefined reference to `MD5_Update'
  396. ssluse.c:(.text+0x3c90): undefined reference to `MD5_Final'
  397. /usr/local/lib/libcurl.a(libcurl_la-ssluse.o): In function `Curl_ossl_cleanup':
  398. ssluse.c:(.text+0x364f): undefined reference to `ERR_remove_thread_state'
  399. /usr/local/lib/libcurl.a(libcurl_la-ssluse.o): In function `Curl_ossl_session_free':
  400. ssluse.c:(.text+0x3af1): undefined reference to `SSL_SESSION_free'
  401. /usr/local/lib/libcurl.a(libcurl_la-ssluse.o): In function `Curl_ossl_random':
  402. ssluse.c:(.text+0x3c55): undefined reference to `RAND_bytes'
  403. /usr/local/lib/libcurl.a(libcurl_la-md5.o): In function `Curl_md5it':
  404. md5.c:(.text+0x12): undefined reference to `MD5_Init'
  405. md5.c:(.text+0x2f): undefined reference to `MD5_Update'
  406. md5.c:(.text+0x3a): undefined reference to `MD5_Final'
  407. /usr/local/lib/libcurl.a(libcurl_la-md5.o):(.data.rel.ro+0x0): undefined reference to `MD5_Init'
  408. /usr/local/lib/libcurl.a(libcurl_la-md5.o):(.data.rel.ro+0x8): undefined reference to `MD5_Update'
  409. /usr/local/lib/libcurl.a(libcurl_la-md5.o):(.data.rel.ro+0x10): undefined reference to `MD5_Final'
  410. /usr/local/lib/libcurl.a(libcurl_la-md5.o):(.data.rel.ro+0x20): undefined reference to `MD5_Init'
  411. /usr/local/lib/libcurl.a(libcurl_la-md5.o):(.data.rel.ro+0x28): undefined reference to `MD5_Update'
  412. /usr/local/lib/libcurl.a(libcurl_la-md5.o):(.data.rel.ro+0x30): undefined reference to `MD5_Final'
  413. /usr/local/lib/libcurl.a(libcurl_la-ssh.o): In function `ssh_block2waitfor.part.0':
  414. ssh.c:(.text+0x4ac): undefined reference to `libssh2_session_block_directions'
  415. /usr/local/lib/libcurl.a(libcurl_la-ssh.o): In function `sftp_send':
  416. ssh.c:(.text+0x4fa): undefined reference to `libssh2_sftp_write'
  417. /usr/local/lib/libcurl.a(libcurl_la-ssh.o): In function `sftp_recv':
  418. ssh.c:(.text+0x58a): undefined reference to `libssh2_sftp_read'
  419. /usr/local/lib/libcurl.a(libcurl_la-ssh.o): In function `scp_send':
  420. ssh.c:(.text+0x5e6): undefined reference to `libssh2_channel_write_ex'
  421. /usr/local/lib/libcurl.a(libcurl_la-ssh.o): In function `scp_recv':
  422. ssh.c:(.text+0x676): undefined reference to `libssh2_channel_read_ex'
  423. /usr/local/lib/libcurl.a(libcurl_la-ssh.o): In function `ssh_statemach_act':
  424. ssh.c:(.text+0x950): undefined reference to `libssh2_session_set_blocking'
  425. ssh.c:(.text+0x96a): undefined reference to `libssh2_session_startup'
  426. ssh.c:(.text+0x9ab): undefined reference to `libssh2_hostkey_hash'
  427. ssh.c:(.text+0xa3e): undefined reference to `libssh2_session_hostkey'
  428. ssh.c:(.text+0xa99): undefined reference to `libssh2_knownhost_check'
  429. ssh.c:(.text+0xbb5): undefined reference to `libssh2_knownhost_free'
  430. ssh.c:(.text+0xbd5): undefined reference to `libssh2_agent_disconnect'
  431. ssh.c:(.text+0xbf5): undefined reference to `libssh2_agent_free'
  432. ssh.c:(.text+0xc27): undefined reference to `libssh2_session_free'
  433. ssh.c:(.text+0xdf1): undefined reference to `libssh2_channel_free'
  434. ssh.c:(.text+0xe34): undefined reference to `libssh2_session_disconnect_ex'
  435. ssh.c:(.text+0xea1): undefined reference to `libssh2_channel_free'
  436. ssh.c:(.text+0xef1): undefined reference to `libssh2_channel_wait_closed'
  437. ssh.c:(.text+0xf31): undefined reference to `libssh2_channel_send_eof'
  438. ssh.c:(.text+0xf71): undefined reference to `libssh2_channel_wait_eof'
  439. ssh.c:(.text+0xfec): undefined reference to `libssh2_scp_recv'
  440. ssh.c:(.text+0x1143): undefined reference to `libssh2_sftp_symlink_ex'
  441. ssh.c:(.text+0x1211): undefined reference to `libssh2_sftp_close_handle'
  442. ssh.c:(.text+0x12a9): undefined reference to `libssh2_sftp_stat_ex'
  443. ssh.c:(.text+0x1319): undefined reference to `libssh2_sftp_seek64'
  444. ssh.c:(.text+0x139c): undefined reference to `libssh2_sftp_mkdir_ex'
  445. ssh.c:(.text+0x1522): undefined reference to `libssh2_sftp_open_ex'
  446. ssh.c:(.text+0x1628): undefined reference to `libssh2_sftp_readdir_ex'
  447. ssh.c:(.text+0x1725): undefined reference to `libssh2_sftp_open_ex'
  448. ssh.c:(.text+0x17f1): undefined reference to `libssh2_sftp_close_handle'
  449. ssh.c:(.text+0x1821): undefined reference to `libssh2_sftp_shutdown'
  450. ssh.c:(.text+0x18ab): undefined reference to `libssh2_scp_send64'
  451. ssh.c:(.text+0x1944): undefined reference to `libssh2_sftp_open_ex'
  452. ssh.c:(.text+0x1978): undefined reference to `libssh2_sftp_close_handle'
  453. ssh.c:(.text+0x1a7d): undefined reference to `libssh2_sftp_unlink_ex'
  454. ssh.c:(.text+0x1ad5): undefined reference to `libssh2_sftp_rmdir_ex'
  455. ssh.c:(.text+0x1afa): undefined reference to `libssh2_sftp_last_error'
  456. ssh.c:(.text+0x1b8f): undefined reference to `libssh2_sftp_rename_ex'
  457. ssh.c:(.text+0x1bbc): undefined reference to `libssh2_sftp_last_error'
  458. ssh.c:(.text+0x1c57): undefined reference to `libssh2_sftp_mkdir_ex'
  459. ssh.c:(.text+0x1c84): undefined reference to `libssh2_sftp_last_error'
  460. ssh.c:(.text+0x1d1c): undefined reference to `libssh2_sftp_symlink_ex'
  461. ssh.c:(.text+0x1d49): undefined reference to `libssh2_sftp_last_error'
  462. ssh.c:(.text+0x1ddf): undefined reference to `libssh2_sftp_stat_ex'
  463. ssh.c:(.text+0x1e0c): undefined reference to `libssh2_sftp_last_error'
  464. ssh.c:(.text+0x1edb): undefined reference to `libssh2_sftp_stat_ex'
  465. ssh.c:(.text+0x1f08): undefined reference to `libssh2_sftp_last_error'
  466. ssh.c:(.text+0x200f): undefined reference to `libssh2_sftp_symlink_ex'
  467. ssh.c:(.text+0x2078): undefined reference to `libssh2_sftp_init'
  468. ssh.c:(.text+0x210c): undefined reference to `libssh2_userauth_keyboard_interactive_ex'
  469. ssh.c:(.text+0x244a): undefined reference to `libssh2_agent_connect'
  470. ssh.c:(.text+0x248e): undefined reference to `libssh2_agent_get_identity'
  471. ssh.c:(.text+0x24e0): undefined reference to `libssh2_agent_list_identities'
  472. ssh.c:(.text+0x25a2): undefined reference to `libssh2_userauth_publickey_fromfile_ex'
  473. ssh.c:(.text+0x265d): undefined reference to `libssh2_userauth_list'
  474. ssh.c:(.text+0x26ec): undefined reference to `libssh2_userauth_password_ex'
  475. ssh.c:(.text+0x2764): undefined reference to `libssh2_knownhost_add'
  476. ssh.c:(.text+0x278f): undefined reference to `libssh2_knownhost_writefile'
  477. ssh.c:(.text+0x2899): undefined reference to `libssh2_sftp_seek64'
  478. ssh.c:(.text+0x2cbb): undefined reference to `libssh2_sftp_seek64'
  479. ssh.c:(.text+0x2cf3): undefined reference to `libssh2_session_last_error'
  480. ssh.c:(.text+0x32cd): undefined reference to `libssh2_agent_userauth'
  481. ssh.c:(.text+0x3304): undefined reference to `libssh2_sftp_last_error'
  482. ssh.c:(.text+0x3347): undefined reference to `libssh2_sftp_last_error'
  483. ssh.c:(.text+0x3386): undefined reference to `libssh2_session_last_errno'
  484. ssh.c:(.text+0x3462): undefined reference to `libssh2_session_last_errno'
  485. ssh.c:(.text+0x3483): undefined reference to `libssh2_session_last_error'
  486. ssh.c:(.text+0x34dc): undefined reference to `libssh2_session_last_errno'
  487. ssh.c:(.text+0x34fa): undefined reference to `libssh2_session_last_error'
  488. ssh.c:(.text+0x3556): undefined reference to `libssh2_session_last_errno'
  489. ssh.c:(.text+0x356b): undefined reference to `libssh2_sftp_last_error'
  490. ssh.c:(.text+0x35d9): undefined reference to `libssh2_session_last_errno'
  491. ssh.c:(.text+0x3635): undefined reference to `libssh2_sftp_last_error'
  492. ssh.c:(.text+0x37bb): undefined reference to `libssh2_sftp_stat_ex'
  493. ssh.c:(.text+0x39f1): undefined reference to `libssh2_sftp_last_error'
  494. ssh.c:(.text+0x3b9f): undefined reference to `libssh2_session_last_errno'
  495. ssh.c:(.text+0x3bb4): undefined reference to `libssh2_sftp_last_error'
  496. ssh.c:(.text+0x3be2): undefined reference to `libssh2_session_last_errno'
  497. ssh.c:(.text+0x3c00): undefined reference to `libssh2_session_last_error'
  498. ssh.c:(.text+0x3c55): undefined reference to `libssh2_session_last_errno'
  499. ssh.c:(.text+0x3e4f): undefined reference to `libssh2_agent_init'
  500. ssh.c:(.text+0x407d): undefined reference to `libssh2_sftp_last_error'
  501. /usr/local/lib/libcurl.a(libcurl_la-ssh.o): In function `ssh_easy_statemach':
  502. ssh.c:(.text+0x4335): undefined reference to `libssh2_session_block_directions'
  503. /usr/local/lib/libcurl.a(libcurl_la-ssh.o): In function `ssh_connect':
  504. ssh.c:(.text+0x472f): undefined reference to `libssh2_session_init_ex'
  505. ssh.c:(.text+0x4751): undefined reference to `libssh2_knownhost_init'
  506. ssh.c:(.text+0x4771): undefined reference to `libssh2_knownhost_readfile'
  507. /usr/local/lib/libcurl.a(libcurl_la-curl_rtmp.o): In function `rtmp_disconnect':
  508. curl_rtmp.c:(.text+0x2c): undefined reference to `RTMP_Close'
  509. curl_rtmp.c:(.text+0x34): undefined reference to `RTMP_Free'
  510. /usr/local/lib/libcurl.a(libcurl_la-curl_rtmp.o): In function `rtmp_connect':
  511. curl_rtmp.c:(.text+0xc4): undefined reference to `RTMP_Connect1'
  512. /usr/local/lib/libcurl.a(libcurl_la-curl_rtmp.o): In function `rtmp_send':
  513. curl_rtmp.c:(.text+0x152): undefined reference to `RTMP_Write'
  514. /usr/local/lib/libcurl.a(libcurl_la-curl_rtmp.o): In function `rtmp_recv':
  515. curl_rtmp.c:(.text+0x19b): undefined reference to `RTMP_Read'
  516. /usr/local/lib/libcurl.a(libcurl_la-curl_rtmp.o): In function `rtmp_setup':
  517. curl_rtmp.c:(.text+0x20a): undefined reference to `RTMP_Alloc'
  518. curl_rtmp.c:(.text+0x21f): undefined reference to `RTMP_Init'
  519. curl_rtmp.c:(.text+0x22c): undefined reference to `RTMP_SetBufferMS'
  520. curl_rtmp.c:(.text+0x23f): undefined reference to `RTMP_SetupURL'
  521. curl_rtmp.c:(.text+0x264): undefined reference to `RTMP_Free'
  522. /usr/local/lib/libcurl.a(libcurl_la-curl_rtmp.o): In function `rtmp_do':
  523. curl_rtmp.c:(.text+0x296): undefined reference to `RTMP_ConnectStream'
  524. /usr/local/lib/libcurl.a(libcurl_la-curl_ntlm_core.o): In function `setup_des_key':
  525. curl_ntlm_core.c:(.text+0x84): undefined reference to `DES_set_odd_parity'
  526. curl_ntlm_core.c:(.text+0x8f): undefined reference to `DES_set_key'
  527. /usr/local/lib/libcurl.a(libcurl_la-curl_ntlm_core.o): In function `Curl_ntlm_core_lm_resp':
  528. curl_ntlm_core.c:(.text+0xcd): undefined reference to `DES_ecb_encrypt'
  529. curl_ntlm_core.c:(.text+0xee): undefined reference to `DES_ecb_encrypt'
  530. curl_ntlm_core.c:(.text+0x10f): undefined reference to `DES_ecb_encrypt'
  531. /usr/local/lib/libcurl.a(libcurl_la-curl_ntlm_core.o): In function `Curl_ntlm_core_mk_lm_hash':
  532. curl_ntlm_core.c:(.text+0x1a2): undefined reference to `DES_ecb_encrypt'
  533. curl_ntlm_core.c:(.text+0x1c7): undefined reference to `DES_ecb_encrypt'
  534. /usr/local/lib/libcurl.a(libcurl_la-curl_ntlm_core.o): In function `Curl_ntlm_core_mk_nt_hash':
  535. curl_ntlm_core.c:(.text+0x263): undefined reference to `MD4_Init'
  536. curl_ntlm_core.c:(.text+0x271): undefined reference to `MD4_Update'
  537. curl_ntlm_core.c:(.text+0x27c): undefined reference to `MD4_Final'
  538. collect2: error: ld returned 1 exit status
  539. grive/CMakeFiles/grive_executable.dir/build.make:105: recipe for target 'grive/grive' failed
  540. make[2]: *** [grive/grive] Error 1
  541. CMakeFiles/Makefile2:165: recipe for target 'grive/CMakeFiles/grive_executable.dir/all' failed
  542. make[1]: *** [grive/CMakeFiles/grive_executable.dir/all] Error 2
  543. Makefile:116: recipe for target 'all' failed
  544. make: *** [all] Error 2
  545. ==> ERROR: A failure occurred in build().
  546.     Aborting...