SHARE
TWEET

Untitled

a guest Oct 20th, 2010 172 Never
  1. In file included from /Users/rmenes/rockbox/apps/bookmark.c:43:
  2. /Users/rmenes/rockbox/apps/plugin.h:44: error: expected declaration specifiers or ‘...’ before numeric constant
  3. /Users/rmenes/rockbox/apps/plugin.h:44: error: expected ‘)’ before ‘!=’ token
  4. /Users/rmenes/rockbox/apps/plugin.h:44: error: expected ‘)’ before ‘?’ token
  5. make: *** [/Users/rmenes/rockbox/hdd6330-sim/apps/bookmark.o] Error 1
RAW Paste Data
Top