Pastebin launched a little side project called VERYVIRAL.com, check it out ;-) Want more features on Pastebin? Sign Up, it's FREE!
Guest

Untitled

By: a guest on Oct 12th, 2010  |  syntax: Bash  |  size: 3.79 KB  |  views: 105  |  expires: Never
download  |  raw  |  embed  |  report abuse  |  print
Text below is selected. Please press Ctrl+C to copy to your clipboard. (⌘+C on Mac)
  1. make[3]: Leaving directory `/tmp/rbdev-build/build-binutils/binutils/doc'
  2. Making info in po
  3. make[3]: Entering directory `/tmp/rbdev-build/build-binutils/binutils/po'
  4. make[3]: Nothing to be done for `info'.
  5. make[3]: Leaving directory `/tmp/rbdev-build/build-binutils/binutils/po'
  6. make[3]: Entering directory `/tmp/rbdev-build/build-binutils/binutils'
  7. make[3]: Nothing to be done for `info-am'.
  8. make[3]: Leaving directory `/tmp/rbdev-build/build-binutils/binutils'
  9. make  all-recursive
  10. make[3]: Entering directory `/tmp/rbdev-build/build-binutils/binutils'
  11. Making all in doc
  12. make[4]: Entering directory `/tmp/rbdev-build/build-binutils/binutils/doc'
  13. make[4]: Nothing to be done for `all'.
  14. make[4]: Leaving directory `/tmp/rbdev-build/build-binutils/binutils/doc'
  15. Making all in po
  16. make[4]: Entering directory `/tmp/rbdev-build/build-binutils/binutils/po'
  17. make[4]: Nothing to be done for `all'.
  18. make[4]: Leaving directory `/tmp/rbdev-build/build-binutils/binutils/po'
  19. make[4]: Entering directory `/tmp/rbdev-build/build-binutils/binutils'
  20. gcc -DHAVE_CONFIG_H -I. -I../../binutils-2.20.1/binutils  -I. -I../../binutils-2
  21. .20.1/binutils -I../bfd -I../../binutils-2.20.1/binutils/../bfd -I../../binutils
  22. -2.20.1/binutils/../include -DLOCALEDIR="\"/usr/local/share/locale\"" -Dbin_dumm
  23. y_emulation=bin_vanilla_emulation  -W -Wall -Wstrict-prototypes -Wmissing-protot
  24. ypes -Werror -U_FORTIFY_SOURCE -MT size.o -MD -MP -MF .deps/size.Tpo -c -o size.
  25. o ../../binutils-2.20.1/binutils/size.c
  26. mv -f .deps/size.Tpo .deps/size.Po
  27. gcc -DHAVE_CONFIG_H -I. -I../../binutils-2.20.1/binutils  -I. -I../../binutils-2
  28. .20.1/binutils -I../bfd -I../../binutils-2.20.1/binutils/../bfd -I../../binutils
  29. -2.20.1/binutils/../include -DLOCALEDIR="\"/usr/local/share/locale\"" -Dbin_dumm
  30. y_emulation=bin_vanilla_emulation  -W -Wall -Wstrict-prototypes -Wmissing-protot
  31. ypes -Werror -U_FORTIFY_SOURCE -MT bucomm.o -MD -MP -MF .deps/bucomm.Tpo -c -o b
  32. ucomm.o ../../binutils-2.20.1/binutils/bucomm.c
  33. mv -f .deps/bucomm.Tpo .deps/bucomm.Po
  34. gcc -DHAVE_CONFIG_H -I. -I../../binutils-2.20.1/binutils  -I. -I../../binutils-2
  35. .20.1/binutils -I../bfd -I../../binutils-2.20.1/binutils/../bfd -I../../binutils
  36. -2.20.1/binutils/../include -DLOCALEDIR="\"/usr/local/share/locale\"" -Dbin_dumm
  37. y_emulation=bin_vanilla_emulation  -W -Wall -Wstrict-prototypes -Wmissing-protot
  38. ypes -Werror -U_FORTIFY_SOURCE -MT version.o -MD -MP -MF .deps/version.Tpo -c -o
  39. version.o ../../binutils-2.20.1/binutils/version.c
  40. mv -f .deps/version.Tpo .deps/version.Po
  41. gcc -DHAVE_CONFIG_H -I. -I../../binutils-2.20.1/binutils  -I. -I../../binutils-2
  42. .20.1/binutils -I../bfd -I../../binutils-2.20.1/binutils/../bfd -I../../binutils
  43. -2.20.1/binutils/../include -DLOCALEDIR="\"/usr/local/share/locale\"" -Dbin_dumm
  44. y_emulation=bin_vanilla_emulation  -W -Wall -Wstrict-prototypes -Wmissing-protot
  45. ypes -Werror -U_FORTIFY_SOURCE -MT filemode.o -MD -MP -MF .deps/filemode.Tpo -c
  46. -o filemode.o ../../binutils-2.20.1/binutils/filemode.c
  47. mv -f .deps/filemode.Tpo .deps/filemode.Po
  48. /bin/sh ./libtool --tag=CC   --mode=link gcc -W -Wall -Wstrict-prototypes -Wmiss
  49. ing-prototypes -Werror -U_FORTIFY_SOURCE  -Wl,--stack,8388608 -o size.exe size.o
  50. bucomm.o version.o filemode.o ../bfd/libbfd.la ../libiberty/libiberty.a -lintl
  51. -lz
  52. libtool: link: cannot find the library `/usr/lib/libiconv.la' or unhandled argum
  53. ent `/usr/lib/libiconv.la'
  54. make[4]: *** [size.exe] Error 1
  55. make[4]: Leaving directory `/tmp/rbdev-build/build-binutils/binutils'
  56. make[3]: *** [all-recursive] Error 1
  57. make[3]: Leaving directory `/tmp/rbdev-build/build-binutils/binutils'
  58. make[2]: *** [all] Error 2
  59. make[2]: Leaving directory `/tmp/rbdev-build/build-binutils/binutils'
  60. make[1]: *** [all-binutils] Error 2
  61. make[1]: Leaving directory `/tmp/rbdev-build/build-binutils'
  62. make: *** [all] Error 2
  63.  
  64. Hilton@SLIMBLACK ~/code/rockbox
  65. $