Pastebin launched a little side project called VERYVIRAL.com, check it out ;-) Want more features on Pastebin? Sign Up, it's FREE!
Guest

error gcli.jsm

By: a guest on Aug 12th, 2013  |  syntax: None  |  size: 13.05 KB  |  views: 87  |  expires: Never
download  |  raw  |  embed  |  report abuse  |  print
Text below is selected. Please press Ctrl+C to copy to your clipboard. (⌘+C on Mac)
  1. resource://gre/modules/devtools/gcli.jsm
  2. console.error:
  3.   Failed to lookup
  4.   hideIntroDesc
  5.   Message: [Exception... "Component returned failure code: 0x80040111 (NS_ERROR_NOT_AVAILABLE) [nsIStringBundle.GetStringFromName]"  nsresult: "0x80040111 (NS_ERROR_NOT_AVAILABLE)"  location: "JS frame :: resource://gre/modules/devtools/gcli.jsm :: exports.lookup :: line 1535"  data: no]
  6. console.error:
  7.   Failed to lookup
  8.   eagerHelperDesc
  9.   Message: [Exception... "Component returned failure code: 0x8000ffff (NS_ERROR_UNEXPECTED) [nsIStringBundle.GetStringFromName]"  nsresult: "0x8000ffff (NS_ERROR_UNEXPECTED)"  location: "JS frame :: resource://gre/modules/devtools/gcli.jsm :: exports.lookup :: line 1535"  data: no]
  10. console.error:
  11.   Failed to lookup
  12.   connectDesc
  13.   Message: [Exception... "Component returned failure code: 0x8000ffff (NS_ERROR_UNEXPECTED) [nsIStringBundle.GetStringFromName]"  nsresult: "0x8000ffff (NS_ERROR_UNEXPECTED)"  location: "JS frame :: resource://gre/modules/devtools/gcli.jsm :: exports.lookup :: line 1535"  data: no]
  14. console.error:
  15.   Failed to lookup
  16.   connectManual
  17.   Message: [Exception... "Component returned failure code: 0x8000ffff (NS_ERROR_UNEXPECTED) [nsIStringBundle.GetStringFromName]"  nsresult: "0x8000ffff (NS_ERROR_UNEXPECTED)"  location: "JS frame :: resource://gre/modules/devtools/gcli.jsm :: exports.lookup :: line 1535"  data: no]
  18. console.error:
  19.   Failed to lookup
  20.   connectPrefixDesc
  21.   Message: [Exception... "Component returned failure code: 0x8000ffff (NS_ERROR_UNEXPECTED) [nsIStringBundle.GetStringFromName]"  nsresult: "0x8000ffff (NS_ERROR_UNEXPECTED)"  location: "JS frame :: resource://gre/modules/devtools/gcli.jsm :: exports.lookup :: line 1535"  data: no]
  22. console.error:
  23.   Failed to lookup
  24.   connectHostDesc
  25.   Message: [Exception... "Component returned failure code: 0x8000ffff (NS_ERROR_UNEXPECTED) [nsIStringBundle.GetStringFromName]"  nsresult: "0x8000ffff (NS_ERROR_UNEXPECTED)"  location: "JS frame :: resource://gre/modules/devtools/gcli.jsm :: exports.lookup :: line 1535"  data: no]
  26. console.error:
  27.   Failed to lookup
  28.   connectPortDesc
  29.   Message: [Exception... "Component returned failure code: 0x8000ffff (NS_ERROR_UNEXPECTED) [nsIStringBundle.GetStringFromName]"  nsresult: "0x8000ffff (NS_ERROR_UNEXPECTED)"  location: "JS frame :: resource://gre/modules/devtools/gcli.jsm :: exports.lookup :: line 1535"  data: no]
  30. console.error:
  31.   Can't use default port from prefs. Using 9999
  32. console.error:
  33.   Failed to lookup
  34.   disconnectDesc
  35.   Message: [Exception... "Component returned failure code: 0x8000ffff (NS_ERROR_UNEXPECTED) [nsIStringBundle.GetStringFromName]"  nsresult: "0x8000ffff (NS_ERROR_UNEXPECTED)"  location: "JS frame :: resource://gre/modules/devtools/gcli.jsm :: exports.lookup :: line 1535"  data: no]
  36. console.error:
  37.   Failed to lookup
  38.   disconnectManual
  39.   Message: [Exception... "Component returned failure code: 0x8000ffff (NS_ERROR_UNEXPECTED) [nsIStringBundle.GetStringFromName]"  nsresult: "0x8000ffff (NS_ERROR_UNEXPECTED)"  location: "JS frame :: resource://gre/modules/devtools/gcli.jsm :: exports.lookup :: line 1535"  data: no]
  40. console.error:
  41.   Failed to lookup
  42.   disconnectPrefixDesc
  43.   Message: [Exception... "Component returned failure code: 0x8000ffff (NS_ERROR_UNEXPECTED) [nsIStringBundle.GetStringFromName]"  nsresult: "0x8000ffff (NS_ERROR_UNEXPECTED)"  location: "JS frame :: resource://gre/modules/devtools/gcli.jsm :: exports.lookup :: line 1535"  data: no]
  44. console.error:
  45.   Failed to lookup
  46.   contextDesc
  47.   Message: [Exception... "Component returned failure code: 0x8000ffff (NS_ERROR_UNEXPECTED) [nsIStringBundle.GetStringFromName]"  nsresult: "0x8000ffff (NS_ERROR_UNEXPECTED)"  location: "JS frame :: resource://gre/modules/devtools/gcli.jsm :: exports.lookup :: line 1535"  data: no]
  48. console.error:
  49.   Failed to lookup
  50.   contextManual
  51.   Message: [Exception... "Component returned failure code: 0x8000ffff (NS_ERROR_UNEXPECTED) [nsIStringBundle.GetStringFromName]"  nsresult: "0x8000ffff (NS_ERROR_UNEXPECTED)"  location: "JS frame :: resource://gre/modules/devtools/gcli.jsm :: exports.lookup :: line 1535"  data: no]
  52. console.error:
  53.   Failed to lookup
  54.   contextPrefixDesc
  55.   Message: [Exception... "Component returned failure code: 0x8000ffff (NS_ERROR_UNEXPECTED) [nsIStringBundle.GetStringFromName]"  nsresult: "0x8000ffff (NS_ERROR_UNEXPECTED)"  location: "JS frame :: resource://gre/modules/devtools/gcli.jsm :: exports.lookup :: line 1535"  data: no]
  56. console.error:
  57.   Failed to lookup
  58.   helpDesc
  59.   Message: [Exception... "Component returned failure code: 0x8000ffff (NS_ERROR_UNEXPECTED) [nsIStringBundle.GetStringFromName]"  nsresult: "0x8000ffff (NS_ERROR_UNEXPECTED)"  location: "JS frame :: resource://gre/modules/devtools/gcli.jsm :: exports.lookup :: line 1535"  data: no]
  60. console.error:
  61.   Failed to lookup
  62.   helpManual
  63.   Message: [Exception... "Component returned failure code: 0x8000ffff (NS_ERROR_UNEXPECTED) [nsIStringBundle.GetStringFromName]"  nsresult: "0x8000ffff (NS_ERROR_UNEXPECTED)"  location: "JS frame :: resource://gre/modules/devtools/gcli.jsm :: exports.lookup :: line 1535"  data: no]
  64. console.error:
  65.   Failed to lookup
  66.   helpSearchDesc
  67.   Message: [Exception... "Component returned failure code: 0x8000ffff (NS_ERROR_UNEXPECTED) [nsIStringBundle.GetStringFromName]"  nsresult: "0x8000ffff (NS_ERROR_UNEXPECTED)"  location: "JS frame :: resource://gre/modules/devtools/gcli.jsm :: exports.lookup :: line 1535"  data: no]
  68. console.error:
  69.   Failed to lookup
  70.   helpSearchManual3
  71.   Message: [Exception... "Component returned failure code: 0x8000ffff (NS_ERROR_UNEXPECTED) [nsIStringBundle.GetStringFromName]"  nsresult: "0x8000ffff (NS_ERROR_UNEXPECTED)"  location: "JS frame :: resource://gre/modules/devtools/gcli.jsm :: exports.lookup :: line 1535"  data: no]
  72. console.error:
  73.   Failed to lookup
  74.   allowSetDesc
  75.   Message: [Exception... "Component returned failure code: 0x8000ffff (NS_ERROR_UNEXPECTED) [nsIStringBundle.GetStringFromName]"  nsresult: "0x8000ffff (NS_ERROR_UNEXPECTED)"  location: "JS frame :: resource://gre/modules/devtools/gcli.jsm :: exports.lookup :: line 1535"  data: no]
  76. console.error:
  77.   Failed to lookup
  78.   prefDesc
  79.   Message: [Exception... "Component returned failure code: 0x8000ffff (NS_ERROR_UNEXPECTED) [nsIStringBundle.GetStringFromName]"  nsresult: "0x8000ffff (NS_ERROR_UNEXPECTED)"  location: "JS frame :: resource://gre/modules/devtools/gcli.jsm :: exports.lookup :: line 1535"  data: no]
  80. console.error:
  81.   Failed to lookup
  82.   prefManual
  83.   Message: [Exception... "Component returned failure code: 0x8000ffff (NS_ERROR_UNEXPECTED) [nsIStringBundle.GetStringFromName]"  nsresult: "0x8000ffff (NS_ERROR_UNEXPECTED)"  location: "JS frame :: resource://gre/modules/devtools/gcli.jsm :: exports.lookup :: line 1535"  data: no]
  84. console.error:
  85.   Failed to lookup
  86.   prefShowDesc
  87.   Message: [Exception... "Component returned failure code: 0x8000ffff (NS_ERROR_UNEXPECTED) [nsIStringBundle.GetStringFromName]"  nsresult: "0x8000ffff (NS_ERROR_UNEXPECTED)"  location: "JS frame :: resource://gre/modules/devtools/gcli.jsm :: exports.lookup :: line 1535"  data: no]
  88. console.error:
  89.   Failed to lookup
  90.   prefShowManual
  91.   Message: [Exception... "Component returned failure code: 0x8000ffff (NS_ERROR_UNEXPECTED) [nsIStringBundle.GetStringFromName]"  nsresult: "0x8000ffff (NS_ERROR_UNEXPECTED)"  location: "JS frame :: resource://gre/modules/devtools/gcli.jsm :: exports.lookup :: line 1535"  data: no]
  92. console.error:
  93.   Failed to lookup
  94.   prefShowSettingDesc
  95.   Message: [Exception... "Component returned failure code: 0x8000ffff (NS_ERROR_UNEXPECTED) [nsIStringBundle.GetStringFromName]"  nsresult: "0x8000ffff (NS_ERROR_UNEXPECTED)"  location: "JS frame :: resource://gre/modules/devtools/gcli.jsm :: exports.lookup :: line 1535"  data: no]
  96. console.error:
  97.   Failed to lookup
  98.   prefShowSettingManual
  99.   Message: [Exception... "Component returned failure code: 0x8000ffff (NS_ERROR_UNEXPECTED) [nsIStringBundle.GetStringFromName]"  nsresult: "0x8000ffff (NS_ERROR_UNEXPECTED)"  location: "JS frame :: resource://gre/modules/devtools/gcli.jsm :: exports.lookup :: line 1535"  data: no]
  100. console.error:
  101.   Failed to lookup
  102.   prefSetDesc
  103.   Message: [Exception... "Component returned failure code: 0x8000ffff (NS_ERROR_UNEXPECTED) [nsIStringBundle.GetStringFromName]"  nsresult: "0x8000ffff (NS_ERROR_UNEXPECTED)"  location: "JS frame :: resource://gre/modules/devtools/gcli.jsm :: exports.lookup :: line 1535"  data: no]
  104. console.error:
  105.   Failed to lookup
  106.   prefSetManual
  107.   Message: [Exception... "Component returned failure code: 0x8000ffff (NS_ERROR_UNEXPECTED) [nsIStringBundle.GetStringFromName]"  nsresult: "0x8000ffff (NS_ERROR_UNEXPECTED)"  location: "JS frame :: resource://gre/modules/devtools/gcli.jsm :: exports.lookup :: line 1535"  data: no]
  108. console.error:
  109.   Failed to lookup
  110.   prefSetSettingDesc
  111.   Message: [Exception... "Component returned failure code: 0x8000ffff (NS_ERROR_UNEXPECTED) [nsIStringBundle.GetStringFromName]"  nsresult: "0x8000ffff (NS_ERROR_UNEXPECTED)"  location: "JS frame :: resource://gre/modules/devtools/gcli.jsm :: exports.lookup :: line 1535"  data: no]
  112. console.error:
  113.   Failed to lookup
  114.   prefSetSettingManual
  115.   Message: [Exception... "Component returned failure code: 0x8000ffff (NS_ERROR_UNEXPECTED) [nsIStringBundle.GetStringFromName]"  nsresult: "0x8000ffff (NS_ERROR_UNEXPECTED)"  location: "JS frame :: resource://gre/modules/devtools/gcli.jsm :: exports.lookup :: line 1535"  data: no]
  116. console.error:
  117.   Failed to lookup
  118.   prefSetValueDesc
  119.   Message: [Exception... "Component returned failure code: 0x8000ffff (NS_ERROR_UNEXPECTED) [nsIStringBundle.GetStringFromName]"  nsresult: "0x8000ffff (NS_ERROR_UNEXPECTED)"  location: "JS frame :: resource://gre/modules/devtools/gcli.jsm :: exports.lookup :: line 1535"  data: no]
  120. console.error:
  121.   Failed to lookup
  122.   prefSetValueManual
  123.   Message: [Exception... "Component returned failure code: 0x8000ffff (NS_ERROR_UNEXPECTED) [nsIStringBundle.GetStringFromName]"  nsresult: "0x8000ffff (NS_ERROR_UNEXPECTED)"  location: "JS frame :: resource://gre/modules/devtools/gcli.jsm :: exports.lookup :: line 1535"  data: no]
  124. console.error:
  125.   Failed to lookup
  126.   prefResetDesc
  127.   Message: [Exception... "Component returned failure code: 0x8000ffff (NS_ERROR_UNEXPECTED) [nsIStringBundle.GetStringFromName]"  nsresult: "0x8000ffff (NS_ERROR_UNEXPECTED)"  location: "JS frame :: resource://gre/modules/devtools/gcli.jsm :: exports.lookup :: line 1535"  data: no]
  128. console.error:
  129.   Failed to lookup
  130.   prefResetManual
  131.   Message: [Exception... "Component returned failure code: 0x8000ffff (NS_ERROR_UNEXPECTED) [nsIStringBundle.GetStringFromName]"  nsresult: "0x8000ffff (NS_ERROR_UNEXPECTED)"  location: "JS frame :: resource://gre/modules/devtools/gcli.jsm :: exports.lookup :: line 1535"  data: no]
  132. console.error:
  133.   Failed to lookup
  134.   prefResetSettingDesc
  135.   Message: [Exception... "Component returned failure code: 0x8000ffff (NS_ERROR_UNEXPECTED) [nsIStringBundle.GetStringFromName]"  nsresult: "0x8000ffff (NS_ERROR_UNEXPECTED)"  location: "JS frame :: resource://gre/modules/devtools/gcli.jsm :: exports.lookup :: line 1535"  data: no]
  136. console.error:
  137.   Failed to lookup
  138.   prefResetSettingManual
  139.   Message: [Exception... "Component returned failure code: 0x8000ffff (NS_ERROR_UNEXPECTED) [nsIStringBundle.GetStringFromName]"  nsresult: "0x8000ffff (NS_ERROR_UNEXPECTED)"  location: "JS frame :: resource://gre/modules/devtools/gcli.jsm :: exports.lookup :: line 1535"  data: no]
  140. Error using module 'gcli/index' - Error: Unknown type for devtools.gcli.hideIntro
  141. resource://gre/modules/devtools/dbg-server.jsm
  142. Traceback (most recent call last):
  143.   File "/home/akumahikki/ramtemp/yaourt-tmp-akumahikki/aur-firefox-kde-opensuse/src/mozilla-release/toolkit/mozapps/installer/packager.py", line 374, in <module>
  144.     main()
  145.   File "/home/akumahikki/ramtemp/yaourt-tmp-akumahikki/aur-firefox-kde-opensuse/src/mozilla-release/toolkit/mozapps/installer/packager.py", line 366, in main
  146.     args.source, gre_path, base)
  147.   File "/home/akumahikki/ramtemp/yaourt-tmp-akumahikki/aur-firefox-kde-opensuse/src/mozilla-release/toolkit/mozapps/installer/packager.py", line 147, in precompile_cache
  148.     errors.fatal('Error while running startup cache precompilation')
  149.   File "/home/akumahikki/ramtemp/yaourt-tmp-akumahikki/aur-firefox-kde-opensuse/src/mozilla-release/python/mozbuild/mozpack/errors.py", line 101, in fatal
  150.     self._handle(self.FATAL, msg)
  151.   File "/home/akumahikki/ramtemp/yaourt-tmp-akumahikki/aur-firefox-kde-opensuse/src/mozilla-release/python/mozbuild/mozpack/errors.py", line 96, in _handle
  152.     raise ErrorMessage(msg)
  153. mozpack.errors.ErrorMessage: Error: Error while running startup cache precompilation
  154. make[2]: *** [stage-package] Error 1
  155. make[2]: se sale del directorio `/home/akumahikki/ramtemp/yaourt-tmp-akumahikki/aur-firefox-kde-opensuse/src/mozilla-release/obj-x86_64-unknown-linux-gnu/browser/installer'
  156. make[1]: *** [install] Error 2
  157. make[1]: se sale del directorio `/home/akumahikki/ramtemp/yaourt-tmp-akumahikki/aur-firefox-kde-opensuse/src/mozilla-release/obj-x86_64-unknown-linux-gnu'
  158. make: *** [install] Error 2