Guest User

Gradle Build Failure - jME

a guest
Sep 13th, 2014
375
0
Never
Not a member of Pastebin yet? Sign Up, it unlocks many cool features!
text 122.49 KB | None | 0 0
  1. Executing: gradle clean build
  2.  
  3. jME3.1.0_snapshot-github_2014-09-14.zip
  4. :clean UP-TO-DATE
  5. :jme3-android:clean
  6. :jme3-android-native:clean
  7. :jme3-blender:clean
  8. :jme3-bullet:clean
  9. :jme3-core:clean
  10. :jme3-desktop:clean
  11. :jme3-effects:clean
  12. :jme3-examples:clean
  13. :jme3-ios:clean
  14. :jme3-jbullet:clean
  15. :jme3-jogg:clean
  16. :jme3-jogl:clean
  17. :jme3-lwjgl:clean
  18. :jme3-networking:clean
  19. :jme3-niftygui:clean
  20. :jme3-plugins:clean
  21. :jme3-terrain:clean
  22. :jme3-testdata:clean
  23. :sdk:cleanSdk
  24. Trying to override old definition of task updatesdkdeps
  25. Trying to override old definition of task fixwikilinks
  26. Trying to override old definition of task loadwikiimages
  27. Trying to override old definition of task updatenbdeps
  28. :sdk:clean UP-TO-DATE
  29. :jme3-core:updateVersion
  30. warning: [options] bootstrap class path not set in conjunction with -source 1.5
  31. Note: Some input files use or override a deprecated API.
  32. Note: Recompile with -Xlint:deprecation for details.
  33. Note: Some input files use unchecked or unsafe operations.
  34. Note: Recompile with -Xlint:unchecked for details.
  35. 1 warning
  36. :jme3-core:compileJava
  37. :jme3-core:processResources
  38. :jme3-core:classes
  39. :jme3-core:jar
  40. warning: [options] bootstrap class path not set in conjunction with -source 1.5
  41. Note: Some input files use unchecked or unsafe operations.
  42. Note: Recompile with -Xlint:unchecked for details.
  43. 1 warning
  44. :jme3-plugins:compileJava
  45. :jme3-plugins:processResources UP-TO-DATE
  46. :jme3-plugins:classes
  47. :jme3-plugins:jar
  48. warning: [options] bootstrap class path not set in conjunction with -source 1.5
  49. Note: Some input files use or override a deprecated API.
  50. Note: Recompile with -Xlint:deprecation for details.
  51. Note: C:\Daniel\Programme\jmonkeyengine-master\jmonkeyengine\jme3-android\src\main\java\com\jme3\asset\AndroidAssetManager.java uses unchecked or unsafe operations.
  52. Note: Recompile with -Xlint:unchecked for details.
  53. 1 warning
  54. :jme3-android:compileJava
  55. :jme3-android:processResources
  56. :jme3-android:classes
  57. :jme3-android:jar
  58. :jme3-android:sourcesJar
  59. :jme3-android:assemble
  60. :jme3-android:compileTestJava UP-TO-DATE
  61. :jme3-android:processTestResources UP-TO-DATE
  62. :jme3-android:testClasses UP-TO-DATE
  63. :jme3-android:test UP-TO-DATE
  64. :jme3-android:check UP-TO-DATE
  65. :jme3-android:build
  66. :jme3-android-native:copyPreCompiledOpenAlSoftLibs
  67. :jme3-android-native:copyPreCompiledStbiLibs
  68. :jme3-android-native:compileJava UP-TO-DATE
  69. :jme3-android-native:processResources UP-TO-DATE
  70. :jme3-android-native:classes UP-TO-DATE
  71. :jme3-android-native:jar
  72. :jme3-android-native:sourcesJar
  73. :jme3-android-native:assemble
  74. :jme3-android-native:compileTestJava UP-TO-DATE
  75. :jme3-android-native:processTestResources UP-TO-DATE
  76. :jme3-android-native:testClasses UP-TO-DATE
  77. :jme3-android-native:test UP-TO-DATE
  78. :jme3-android-native:check UP-TO-DATE
  79. :jme3-android-native:build
  80. warning: [options] bootstrap class path not set in conjunction with -source 1.5
  81. Note: Some input files use unchecked or unsafe operations.
  82. Note: Recompile with -Xlint:unchecked for details.
  83. 1 warning
  84. :jme3-desktop:compileJava
  85. :jme3-desktop:processResources
  86. :jme3-desktop:classes
  87. :jme3-desktop:jar
  88. warning: [options] bootstrap class path not set in conjunction with -source 1.5
  89. 1 warning
  90. :jme3-effects:compileJava
  91. :jme3-effects:processResources
  92. :jme3-effects:classes
  93. :jme3-effects:jar
  94. warning: [options] bootstrap class path not set in conjunction with -source 1.5
  95. Note: Some input files use or override a deprecated API.
  96. Note: Recompile with -Xlint:deprecation for details.
  97. 1 warning
  98. :jme3-blender:compileJava
  99. :jme3-blender:processResources
  100. :jme3-blender:classes
  101. :jme3-blender:jar
  102. :jme3-blender:sourcesJar
  103. :jme3-blender:assemble
  104. :jme3-blender:compileTestJava UP-TO-DATE
  105. :jme3-blender:processTestResources UP-TO-DATE
  106. :jme3-blender:testClasses UP-TO-DATE
  107. :jme3-blender:test UP-TO-DATE
  108. :jme3-blender:check UP-TO-DATE
  109. :jme3-blender:build
  110. warning: [options] bootstrap class path not set in conjunction with -source 1.5
  111. Note: Some input files use or override a deprecated API.
  112. Note: Recompile with -Xlint:deprecation for details.
  113. Note: Some input files use unchecked or unsafe operations.
  114. Note: Recompile with -Xlint:unchecked for details.
  115. 1 warning
  116. :jme3-terrain:compileJava
  117. :jme3-terrain:processResources
  118. :jme3-terrain:classes
  119. :jme3-terrain:jar
  120. warning: [options] bootstrap class path not set in conjunction with -source 1.5
  121. Note: C:\Daniel\Programme\jmonkeyengine-master\jmonkeyengine\jme3-bullet\src\common\java\com\jme3\bullet\BulletAppState.java uses or overrides a deprecated API.
  122. Note: Recompile with -Xlint:deprecation for details.
  123. Note: Some input files use unchecked or unsafe operations.
  124. Note: Recompile with -Xlint:unchecked for details.
  125. 1 warning
  126. :jme3-bullet:compileJava
  127. :jme3-bullet:processResources UP-TO-DATE
  128. :jme3-bullet:classes
  129. :jme3-bullet:jar
  130. :jme3-bullet:sourcesJar
  131. :jme3-bullet:assemble
  132. :jme3-bullet:compileTestJava UP-TO-DATE
  133. :jme3-bullet:processTestResources UP-TO-DATE
  134. :jme3-bullet:testClasses UP-TO-DATE
  135. :jme3-bullet:test UP-TO-DATE
  136. :jme3-bullet:check UP-TO-DATE
  137. :jme3-bullet:build
  138. :jme3-core:sourcesJar
  139. :jme3-core:assemble
  140. :jme3-core:compileTestJava UP-TO-DATE
  141. :jme3-core:processTestResources UP-TO-DATE
  142. :jme3-core:testClasses UP-TO-DATE
  143. :jme3-core:test UP-TO-DATE
  144. :jme3-core:check UP-TO-DATE
  145. :jme3-core:build
  146. :jme3-desktop:sourcesJar
  147. :jme3-desktop:assemble
  148. :jme3-desktop:compileTestJava UP-TO-DATE
  149. :jme3-desktop:processTestResources UP-TO-DATE
  150. :jme3-desktop:testClasses UP-TO-DATE
  151. :jme3-desktop:test UP-TO-DATE
  152. :jme3-desktop:check UP-TO-DATE
  153. :jme3-desktop:build
  154. :jme3-effects:sourcesJar
  155. :jme3-effects:assemble
  156. :jme3-effects:compileTestJava UP-TO-DATE
  157. :jme3-effects:processTestResources UP-TO-DATE
  158. :jme3-effects:testClasses UP-TO-DATE
  159. :jme3-effects:test UP-TO-DATE
  160. :jme3-effects:check UP-TO-DATE
  161. :jme3-effects:build
  162. warning: [options] bootstrap class path not set in conjunction with -source 1.5
  163. Note: C:\Daniel\Programme\jmonkeyengine-master\jmonkeyengine\jme3-bullet\src\common\java\com\jme3\bullet\BulletAppState.java uses or overrides a deprecated API.
  164. Note: Recompile with -Xlint:deprecation for details.
  165. Note: Some input files use unchecked or unsafe operations.
  166. Note: Recompile with -Xlint:unchecked for details.
  167. 1 warning
  168. :jme3-jbullet:compileJava
  169. :jme3-jbullet:processResources UP-TO-DATE
  170. :jme3-jbullet:classes
  171. :jme3-jbullet:jar
  172. warning: [options] bootstrap class path not set in conjunction with -source 1.5
  173. Note: C:\Daniel\Programme\jmonkeyengine-master\jmonkeyengine\jme3-jogg\src\main\java\com\jme3\audio\plugins\OGGLoader.java uses unchecked or unsafe operations.
  174. Note: Recompile with -Xlint:unchecked for details.
  175. 1 warning
  176. :jme3-jogg:compileJava
  177. :jme3-jogg:processResources UP-TO-DATE
  178. :jme3-jogg:classes
  179. :jme3-jogg:jar
  180. warning: [options] bootstrap class path not set in conjunction with -source 1.5
  181. Note: Some input files use or override a deprecated API.
  182. Note: Recompile with -Xlint:deprecation for details.
  183. 1 warning
  184. :jme3-lwjgl:compileJava
  185. :jme3-lwjgl:processResources UP-TO-DATE
  186. :jme3-lwjgl:classes
  187. :jme3-lwjgl:jar
  188. warning: [options] bootstrap class path not set in conjunction with -source 1.5
  189. Note: Some input files use unchecked or unsafe operations.
  190. Note: Recompile with -Xlint:unchecked for details.
  191. 1 warning
  192. :jme3-networking:compileJava
  193. :jme3-networking:processResources UP-TO-DATE
  194. :jme3-networking:classes
  195. :jme3-networking:jar
  196. warning: [options] bootstrap class path not set in conjunction with -source 1.5
  197. Note: Some input files use or override a deprecated API.
  198. Note: Recompile with -Xlint:deprecation for details.
  199. 1 warning
  200. :jme3-niftygui:compileJava
  201. :jme3-niftygui:processResources
  202. :jme3-niftygui:classes
  203. :jme3-niftygui:jar
  204. :jme3-testdata:compileJava UP-TO-DATE
  205. :jme3-testdata:processResources
  206. :jme3-testdata:classes
  207. :jme3-testdata:jar
  208. warning: [options] bootstrap class path not set in conjunction with -source 1.5
  209. Note: Some input files use or override a deprecated API.
  210. Note: Recompile with -Xlint:deprecation for details.
  211. Note: Some input files use unchecked or unsafe operations.
  212. Note: Recompile with -Xlint:unchecked for details.
  213. 1 warning
  214. :jme3-examples:compileJava
  215. :jme3-examples:processResources
  216. :jme3-examples:classes
  217. :jme3-examples:jar
  218. :jme3-examples:sourcesJar
  219. :jme3-examples:assemble
  220. :jme3-examples:compileTestJava UP-TO-DATE
  221. :jme3-examples:processTestResources UP-TO-DATE
  222. :jme3-examples:testClasses UP-TO-DATE
  223. :jme3-examples:test UP-TO-DATE
  224. :jme3-examples:check UP-TO-DATE
  225. :jme3-examples:build
  226. warning: [options] bootstrap class path not set in conjunction with -source 1.5
  227. Note: C:\Daniel\Programme\jmonkeyengine-master\jmonkeyengine\jme3-ios\src\main\java\com\jme3\input\ios\IosInputHandler.java uses or overrides a deprecated API.
  228. Note: Recompile with -Xlint:deprecation for details.
  229. Note: C:\Daniel\Programme\jmonkeyengine-master\jmonkeyengine\jme3-ios\src\main\java\com\jme3\system\ios\IosAssetManager.java uses unchecked or unsafe operations.
  230. Note: Recompile with -Xlint:unchecked for details.
  231. 1 warning
  232. :jme3-ios:compileJava
  233. :jme3-ios:processResources UP-TO-DATE
  234. :jme3-ios:classes
  235. :jme3-ios:jar
  236. :jme3-ios:sourcesJar
  237. :jme3-ios:assemble
  238. :jme3-ios:compileTestJava UP-TO-DATE
  239. :jme3-ios:processTestResources UP-TO-DATE
  240. :jme3-ios:testClasses UP-TO-DATE
  241. :jme3-ios:test UP-TO-DATE
  242. :jme3-ios:check UP-TO-DATE
  243. :jme3-ios:build
  244. :jme3-jbullet:sourcesJar
  245. :jme3-jbullet:assemble
  246. :jme3-jbullet:compileTestJava UP-TO-DATE
  247. :jme3-jbullet:processTestResources UP-TO-DATE
  248. :jme3-jbullet:testClasses UP-TO-DATE
  249. :jme3-jbullet:test UP-TO-DATE
  250. :jme3-jbullet:check UP-TO-DATE
  251. :jme3-jbullet:build
  252. :jme3-jogg:sourcesJar
  253. :jme3-jogg:assemble
  254. :jme3-jogg:compileTestJava UP-TO-DATE
  255. :jme3-jogg:processTestResources UP-TO-DATE
  256. :jme3-jogg:testClasses UP-TO-DATE
  257. :jme3-jogg:test UP-TO-DATE
  258. :jme3-jogg:check UP-TO-DATE
  259. :jme3-jogg:build
  260. warning: [options] bootstrap class path not set in conjunction with -source 1.5
  261. Note: C:\Daniel\Programme\jmonkeyengine-master\jmonkeyengine\jme3-jogl\src\main\java\com\jme3\renderer\jogl\TextureUtil.java uses or overrides a deprecated API.
  262. Note: Recompile with -Xlint:deprecation for details.
  263. 1 warning
  264. :jme3-jogl:compileJava
  265. :jme3-jogl:processResources UP-TO-DATE
  266. :jme3-jogl:classes
  267. :jme3-jogl:jar
  268. :jme3-jogl:sourcesJar
  269. :jme3-jogl:assemble
  270. :jme3-jogl:compileTestJava UP-TO-DATE
  271. :jme3-jogl:processTestResources UP-TO-DATE
  272. :jme3-jogl:testClasses UP-TO-DATE
  273. :jme3-jogl:test UP-TO-DATE
  274. :jme3-jogl:check UP-TO-DATE
  275. :jme3-jogl:build
  276. :jme3-lwjgl:sourcesJar
  277. :jme3-lwjgl:assemble
  278. :jme3-lwjgl:compileTestJava UP-TO-DATE
  279. :jme3-lwjgl:processTestResources UP-TO-DATE
  280. :jme3-lwjgl:testClasses UP-TO-DATE
  281. :jme3-lwjgl:test UP-TO-DATE
  282. :jme3-lwjgl:check UP-TO-DATE
  283. :jme3-lwjgl:build
  284. :jme3-networking:sourcesJar
  285. :jme3-networking:assemble
  286. :jme3-networking:compileTestJava UP-TO-DATE
  287. :jme3-networking:processTestResources UP-TO-DATE
  288. :jme3-networking:testClasses UP-TO-DATE
  289. :jme3-networking:test UP-TO-DATE
  290. :jme3-networking:check UP-TO-DATE
  291. :jme3-networking:build
  292. :jme3-niftygui:sourcesJar
  293. :jme3-niftygui:assemble
  294. :jme3-niftygui:compileTestJava UP-TO-DATE
  295. :jme3-niftygui:processTestResources UP-TO-DATE
  296. :jme3-niftygui:testClasses UP-TO-DATE
  297. :jme3-niftygui:test UP-TO-DATE
  298. :jme3-niftygui:check UP-TO-DATE
  299. :jme3-niftygui:build
  300. :jme3-plugins:sourcesJar
  301. :jme3-plugins:assemble
  302. :jme3-plugins:compileTestJava UP-TO-DATE
  303. :jme3-plugins:processTestResources UP-TO-DATE
  304. :jme3-plugins:testClasses UP-TO-DATE
  305. :jme3-plugins:test UP-TO-DATE
  306. :jme3-plugins:check UP-TO-DATE
  307. :jme3-plugins:build
  308. :jme3-terrain:sourcesJar
  309. :jme3-terrain:assemble
  310. :jme3-terrain:compileTestJava UP-TO-DATE
  311. :jme3-terrain:processTestResources UP-TO-DATE
  312. :jme3-terrain:testClasses UP-TO-DATE
  313. :jme3-terrain:test UP-TO-DATE
  314. :jme3-terrain:check UP-TO-DATE
  315. :jme3-terrain:build
  316. :jme3-testdata:sourcesJar
  317. :jme3-testdata:assemble
  318. :jme3-testdata:compileTestJava UP-TO-DATE
  319. :jme3-testdata:processTestResources UP-TO-DATE
  320. :jme3-testdata:testClasses UP-TO-DATE
  321. :jme3-testdata:test UP-TO-DATE
  322. :jme3-testdata:check UP-TO-DATE
  323. :jme3-testdata:build
  324. :sdk:copyBaseLibs
  325. :sdk:copyProjectLibs
  326. :sdk:copyTestSources
  327. :sdk:createBaseXml
  328. :sdk:createProjectXml
  329. :sdk:buildSdk
  330. [ant:nb-javac] warning: [options] bootstrap class path not set in conjunction with -source 1.5
  331. [ant:nb-javac] 1 warning
  332. [ant:parseprojectxml] The module org.netbeans.modules.java.hints.legacy.spi has been deprecated
  333. [ant:parseprojectxml] The module org.netbeans.modules.java.hints.legacy.spi has been deprecated
  334. [ant:nb-javac] warning: [options] bootstrap class path not set in conjunction with -source 1.6
  335. [ant:nb-javac] C:\Daniel\Programme\jmonkeyengine-master\jmonkeyengine\sdk\jme3-code-check\src\com\jme3\gde\codecheck\hints\InternalMethodHint.java:18: warning: [deprecation] AbstractHint in org.netbeans.modules.java.hints.spi has been deprecated
  336. [ant:nb-javac] import org.netbeans.modules.java.hints.spi.AbstractHint;
  337. [ant:nb-javac] ^
  338. [ant:nb-javac] C:\Daniel\Programme\jmonkeyengine-master\jmonkeyengine\sdk\jme3-code-check\src\com\jme3\gde\codecheck\hints\InternalMethodHint.java:26: warning: [deprecation] AbstractHint in org.netbeans.modules.java.hints.spi has been deprecated
  339. [ant:nb-javac] public class InternalMethodHint extends AbstractHint {
  340. [ant:nb-javac] ^
  341. [ant:nb-javac] C:\Daniel\Programme\jmonkeyengine-master\jmonkeyengine\sdk\jme3-code-check\src\com\jme3\gde\codecheck\hints\ReadOnlyPrimitiveHint.java:17: warning: [deprecation] AbstractHint in org.netbeans.modules.java.hints.spi has been deprecated
  342. [ant:nb-javac] import org.netbeans.modules.java.hints.spi.AbstractHint;
  343. [ant:nb-javac] ^
  344. [ant:nb-javac] C:\Daniel\Programme\jmonkeyengine-master\jmonkeyengine\sdk\jme3-code-check\src\com\jme3\gde\codecheck\hints\ReadOnlyPrimitiveHint.java:25: warning: [deprecation] AbstractHint in org.netbeans.modules.java.hints.spi has been deprecated
  345. [ant:nb-javac] public class ReadOnlyPrimitiveHint extends AbstractHint {
  346. [ant:nb-javac] ^
  347. [ant:nb-javac] C:\Daniel\Programme\jmonkeyengine-master\jmonkeyengine\sdk\jme3-code-check\src\com\jme3\gde\codecheck\hints\TempVarsHint.java:20: warning: [deprecation] AbstractHint in org.netbeans.modules.java.hints.spi has been deprecated
  348. [ant:nb-javac] import org.netbeans.modules.java.hints.spi.AbstractHint;
  349. [ant:nb-javac] ^
  350. [ant:nb-javac] C:\Daniel\Programme\jmonkeyengine-master\jmonkeyengine\sdk\jme3-code-check\src\com\jme3\gde\codecheck\hints\TempVarsHint.java:28: warning: [deprecation] AbstractHint in org.netbeans.modules.java.hints.spi has been deprecated
  351. [ant:nb-javac] public class TempVarsHint extends AbstractHint {
  352. [ant:nb-javac] ^
  353. [ant:nb-javac] C:\Daniel\Programme\jmonkeyengine-master\jmonkeyengine\sdk\jme3-code-check\src\com\jme3\gde\codecheck\hints\UpdateHint.java:17: warning: [deprecation] AbstractHint in org.netbeans.modules.java.hints.spi has been deprecated
  354. [ant:nb-javac] import org.netbeans.modules.java.hints.spi.AbstractHint;
  355. [ant:nb-javac] ^
  356. [ant:nb-javac] C:\Daniel\Programme\jmonkeyengine-master\jmonkeyengine\sdk\jme3-code-check\src\com\jme3\gde\codecheck\hints\UpdateHint.java:25: warning: [deprecation] AbstractHint in org.netbeans.modules.java.hints.spi has been deprecated
  357. [ant:nb-javac] public class UpdateHint extends AbstractHint {
  358. [ant:nb-javac] ^
  359. [ant:nb-javac] C:\Daniel\Programme\jmonkeyengine-master\jmonkeyengine\sdk\jme3-code-check\src\com\jme3\gde\codecheck\hints\InternalMethodHint.java:18: warning: [deprecation] AbstractHint in org.netbeans.modules.java.hints.spi has been deprecated
  360. [ant:nb-javac] import org.netbeans.modules.java.hints.spi.AbstractHint;
  361. [ant:nb-javac] ^
  362. [ant:nb-javac] C:\Daniel\Programme\jmonkeyengine-master\jmonkeyengine\sdk\jme3-code-check\src\com\jme3\gde\codecheck\hints\InternalMethodHint.java:26: warning: [deprecation] AbstractHint in org.netbeans.modules.java.hints.spi has been deprecated
  363. [ant:nb-javac] public class InternalMethodHint extends AbstractHint {
  364. [ant:nb-javac] ^
  365. [ant:nb-javac] C:\Daniel\Programme\jmonkeyengine-master\jmonkeyengine\sdk\jme3-code-check\src\com\jme3\gde\codecheck\hints\ReadOnlyPrimitiveHint.java:17: warning: [deprecation] AbstractHint in org.netbeans.modules.java.hints.spi has been deprecated
  366. [ant:nb-javac] import org.netbeans.modules.java.hints.spi.AbstractHint;
  367. [ant:nb-javac] ^
  368. [ant:nb-javac] C:\Daniel\Programme\jmonkeyengine-master\jmonkeyengine\sdk\jme3-code-check\src\com\jme3\gde\codecheck\hints\ReadOnlyPrimitiveHint.java:25: warning: [deprecation] AbstractHint in org.netbeans.modules.java.hints.spi has been deprecated
  369. [ant:nb-javac] public class ReadOnlyPrimitiveHint extends AbstractHint {
  370. [ant:nb-javac] ^
  371. [ant:nb-javac] C:\Daniel\Programme\jmonkeyengine-master\jmonkeyengine\sdk\jme3-code-check\src\com\jme3\gde\codecheck\hints\TempVarsHint.java:20: warning: [deprecation] AbstractHint in org.netbeans.modules.java.hints.spi has been deprecated
  372. [ant:nb-javac] import org.netbeans.modules.java.hints.spi.AbstractHint;
  373. [ant:nb-javac] ^
  374. [ant:nb-javac] C:\Daniel\Programme\jmonkeyengine-master\jmonkeyengine\sdk\jme3-code-check\src\com\jme3\gde\codecheck\hints\TempVarsHint.java:28: warning: [deprecation] AbstractHint in org.netbeans.modules.java.hints.spi has been deprecated
  375. [ant:nb-javac] public class TempVarsHint extends AbstractHint {
  376. [ant:nb-javac] ^
  377. [ant:nb-javac] C:\Daniel\Programme\jmonkeyengine-master\jmonkeyengine\sdk\jme3-code-check\src\com\jme3\gde\codecheck\hints\UpdateHint.java:17: warning: [deprecation] AbstractHint in org.netbeans.modules.java.hints.spi has been deprecated
  378. [ant:nb-javac] import org.netbeans.modules.java.hints.spi.AbstractHint;
  379. [ant:nb-javac] ^
  380. [ant:nb-javac] C:\Daniel\Programme\jmonkeyengine-master\jmonkeyengine\sdk\jme3-code-check\src\com\jme3\gde\codecheck\hints\UpdateHint.java:25: warning: [deprecation] AbstractHint in org.netbeans.modules.java.hints.spi has been deprecated
  381. [ant:nb-javac] public class UpdateHint extends AbstractHint {
  382. [ant:nb-javac] ^
  383. [ant:nb-javac] C:\Daniel\Programme\jmonkeyengine-master\jmonkeyengine\sdk\jme3-code-check\src\com\jme3\gde\codecheck\hints\InternalMethodHint.java:18: warning: [deprecation] AbstractHint in org.netbeans.modules.java.hints.spi has been deprecated
  384. [ant:nb-javac] import org.netbeans.modules.java.hints.spi.AbstractHint;
  385. [ant:nb-javac] ^
  386. [ant:nb-javac] C:\Daniel\Programme\jmonkeyengine-master\jmonkeyengine\sdk\jme3-code-check\src\com\jme3\gde\codecheck\hints\InternalMethodHint.java:26: warning: [deprecation] AbstractHint in org.netbeans.modules.java.hints.spi has been deprecated
  387. [ant:nb-javac] public class InternalMethodHint extends AbstractHint {
  388. [ant:nb-javac] ^
  389. [ant:nb-javac] C:\Daniel\Programme\jmonkeyengine-master\jmonkeyengine\sdk\jme3-code-check\src\com\jme3\gde\codecheck\hints\ReadOnlyPrimitiveHint.java:17: warning: [deprecation] AbstractHint in org.netbeans.modules.java.hints.spi has been deprecated
  390. [ant:nb-javac] import org.netbeans.modules.java.hints.spi.AbstractHint;
  391. [ant:nb-javac] ^
  392. [ant:nb-javac] C:\Daniel\Programme\jmonkeyengine-master\jmonkeyengine\sdk\jme3-code-check\src\com\jme3\gde\codecheck\hints\ReadOnlyPrimitiveHint.java:25: warning: [deprecation] AbstractHint in org.netbeans.modules.java.hints.spi has been deprecated
  393. [ant:nb-javac] public class ReadOnlyPrimitiveHint extends AbstractHint {
  394. [ant:nb-javac] ^
  395. [ant:nb-javac] C:\Daniel\Programme\jmonkeyengine-master\jmonkeyengine\sdk\jme3-code-check\src\com\jme3\gde\codecheck\hints\TempVarsHint.java:20: warning: [deprecation] AbstractHint in org.netbeans.modules.java.hints.spi has been deprecated
  396. [ant:nb-javac] import org.netbeans.modules.java.hints.spi.AbstractHint;
  397. [ant:nb-javac] ^
  398. [ant:nb-javac] C:\Daniel\Programme\jmonkeyengine-master\jmonkeyengine\sdk\jme3-code-check\src\com\jme3\gde\codecheck\hints\TempVarsHint.java:28: warning: [deprecation] AbstractHint in org.netbeans.modules.java.hints.spi has been deprecated
  399. [ant:nb-javac] public class TempVarsHint extends AbstractHint {
  400. [ant:nb-javac] ^
  401. [ant:nb-javac] C:\Daniel\Programme\jmonkeyengine-master\jmonkeyengine\sdk\jme3-code-check\src\com\jme3\gde\codecheck\hints\UpdateHint.java:17: warning: [deprecation] AbstractHint in org.netbeans.modules.java.hints.spi has been deprecated
  402. [ant:nb-javac] import org.netbeans.modules.java.hints.spi.AbstractHint;
  403. [ant:nb-javac] ^
  404. [ant:nb-javac] C:\Daniel\Programme\jmonkeyengine-master\jmonkeyengine\sdk\jme3-code-check\src\com\jme3\gde\codecheck\hints\UpdateHint.java:25: warning: [deprecation] AbstractHint in org.netbeans.modules.java.hints.spi has been deprecated
  405. [ant:nb-javac] public class UpdateHint extends AbstractHint {
  406. [ant:nb-javac] ^
  407. [ant:nb-javac] C:\Daniel\Programme\jmonkeyengine-master\jmonkeyengine\sdk\jme3-code-check\src\com\jme3\gde\codecheck\hints\InternalMethodHint.java:35: warning: [deprecation] AbstractHint in org.netbeans.modules.java.hints.spi has been deprecated
  408. [ant:nb-javac] super(true, true, AbstractHint.HintSeverity.WARNING);
  409. [ant:nb-javac] ^
  410. [ant:nb-javac] C:\Daniel\Programme\jmonkeyengine-master\jmonkeyengine\sdk\jme3-code-check\src\com\jme3\gde\codecheck\hints\ReadOnlyPrimitiveHint.java:34: warning: [deprecation] AbstractHint in org.netbeans.modules.java.hints.spi has been deprecated
  411. [ant:nb-javac] super(true, true, AbstractHint.HintSeverity.WARNING);
  412. [ant:nb-javac] ^
  413. [ant:nb-javac] C:\Daniel\Programme\jmonkeyengine-master\jmonkeyengine\sdk\jme3-code-check\src\com\jme3\gde\codecheck\hints\TempVarsHint.java:38: warning: [deprecation] AbstractHint in org.netbeans.modules.java.hints.spi has been deprecated
  414. [ant:nb-javac] super(true, true, AbstractHint.HintSeverity.WARNING);
  415. [ant:nb-javac] ^
  416. [ant:nb-javac] C:\Daniel\Programme\jmonkeyengine-master\jmonkeyengine\sdk\jme3-code-check\src\com\jme3\gde\codecheck\hints\UpdateHint.java:34: warning: [deprecation] AbstractHint in org.netbeans.modules.java.hints.spi has been deprecated
  417. [ant:nb-javac] super(true, true, AbstractHint.HintSeverity.WARNING);
  418. [ant:nb-javac] ^
  419. [ant:nb-javac] 29 warnings
  420. [ant:nb-javac] warning: [options] bootstrap class path not set in conjunction with -source 1.5
  421. [ant:nb-javac] 1 warning
  422. Trying to override old definition of task updatesdkdeps
  423. Trying to override old definition of task fixwikilinks
  424. Trying to override old definition of task loadwikiimages
  425. Trying to override old definition of task updatenbdeps
  426. [ant:nb-javac] warning: [options] bootstrap class path not set in conjunction with -source 1.6
  427. [ant:nb-javac] Note: Indexing 134 HTML files in C:\Daniel\Programme\jmonkeyengine-master\jmonkeyengine\sdk\jme3-documentation\src\com\jme3\gde\docs into com/jme3/gde/docs/JavaHelpSearch/
  428. [ant:nb-javac] 1 warning
  429. [ant:nb-javac] warning: [options] bootstrap class path not set in conjunction with -source 1.5
  430. [ant:nb-javac] C:\Daniel\Programme\jmonkeyengine-master\jmonkeyengine\sdk\jme3-templates\src\com\jme3\gde\templates\basic\BasicGamePanelVisual.java:113: warning: [deprecation] preventFileChooserSymlinkTraversal(JFileChooser,File) in FileUtil has been deprecated
  431. [ant:nb-javac] FileUtil.preventFileChooserSymlinkTraversal(chooser, null);
  432. [ant:nb-javac] ^
  433. [ant:nb-javac] C:\Daniel\Programme\jmonkeyengine-master\jmonkeyengine\sdk\jme3-templates\src\com\jme3\gde\templates\basic\BasicGameWizardPanel.java:47: warning: [rawtypes] found raw type: Panel
  434. [ant:nb-javac] public class BasicGameWizardPanel implements WizardDescriptor.Panel,
  435. [ant:nb-javac] ^
  436. [ant:nb-javac] missing type arguments for generic class Panel<Data>
  437. [ant:nb-javac] where Data is a type-variable:
  438. [ant:nb-javac] Data extends Object declared in interface Panel
  439. [ant:nb-javac] C:\Daniel\Programme\jmonkeyengine-master\jmonkeyengine\sdk\jme3-templates\src\com\jme3\gde\templates\basic\BasicGameWizardPanel.java:48: warning: [rawtypes] found raw type: ValidatingPanel
  440. [ant:nb-javac] WizardDescriptor.ValidatingPanel, WizardDescriptor.FinishablePanel {
  441. [ant:nb-javac] ^
  442. [ant:nb-javac] missing type arguments for generic class ValidatingPanel<Data>
  443. [ant:nb-javac] where Data is a type-variable:
  444. [ant:nb-javac] Data extends Object declared in interface ValidatingPanel
  445. [ant:nb-javac] C:\Daniel\Programme\jmonkeyengine-master\jmonkeyengine\sdk\jme3-templates\src\com\jme3\gde\templates\basic\BasicGameWizardPanel.java:48: warning: [rawtypes] found raw type: FinishablePanel
  446. [ant:nb-javac] WizardDescriptor.ValidatingPanel, WizardDescriptor.FinishablePanel {
  447. [ant:nb-javac] ^
  448. [ant:nb-javac] missing type arguments for generic class FinishablePanel<Data>
  449. [ant:nb-javac] where Data is a type-variable:
  450. [ant:nb-javac] Data extends Object declared in interface FinishablePanel
  451. [ant:nb-javac] C:\Daniel\Programme\jmonkeyengine-master\jmonkeyengine\sdk\jme3-templates\src\com\jme3\gde\templates\basic\BasicGameWizardIterator.java:64: warning: [rawtypes] found raw type: InstantiatingIterator
  452. [ant:nb-javac] public class BasicGameWizardIterator implements WizardDescriptor./*Progress*/InstantiatingIterator {
  453. [ant:nb-javac] ^
  454. [ant:nb-javac] missing type arguments for generic class InstantiatingIterator<Data>
  455. [ant:nb-javac] where Data is a type-variable:
  456. [ant:nb-javac] Data extends Object declared in interface InstantiatingIterator
  457. [ant:nb-javac] C:\Daniel\Programme\jmonkeyengine-master\jmonkeyengine\sdk\jme3-templates\src\com\jme3\gde\templates\basic\BasicGameWizardIterator.java:78: warning: [rawtypes] found raw type: Panel
  458. [ant:nb-javac] return new WizardDescriptor.Panel[]{
  459. [ant:nb-javac] ^
  460. [ant:nb-javac] missing type arguments for generic class Panel<Data>
  461. [ant:nb-javac] where Data is a type-variable:
  462. [ant:nb-javac] Data extends Object declared in interface Panel
  463. [ant:nb-javac] C:\Daniel\Programme\jmonkeyengine-master\jmonkeyengine\sdk\jme3-templates\src\com\jme3\gde\templates\basic\BasicGameWizardIterator.java:88: warning: [rawtypes] found raw type: Set
  464. [ant:nb-javac] public Set/*<FileObject>*/ instantiate(/*ProgressHandle handle*/) throws IOException {
  465. [ant:nb-javac] ^
  466. [ant:nb-javac] missing type arguments for generic class Set<E>
  467. [ant:nb-javac] where E is a type-variable:
  468. [ant:nb-javac] E extends Object declared in interface Set
  469. [ant:nb-javac] C:\Daniel\Programme\jmonkeyengine-master\jmonkeyengine\sdk\jme3-templates\src\com\jme3\gde\templates\basic\BasicGameWizardIterator.java:175: warning: [rawtypes] found raw type: Panel
  470. [ant:nb-javac] public WizardDescriptor.Panel current() {
  471. [ant:nb-javac] ^
  472. [ant:nb-javac] missing type arguments for generic class Panel<Data>
  473. [ant:nb-javac] where Data is a type-variable:
  474. [ant:nb-javac] Data extends Object declared in interface Panel
  475. [ant:nb-javac] 9 warnings
  476. [ant:nb-javac] warning: [options] bootstrap class path not set in conjunction with -source 1.5
  477. [ant:nb-javac] C:\Daniel\Programme\jmonkeyengine-master\jmonkeyengine\sdk\jme3-tests-template\src\com\jme3\gde\templates\tests\testsandroid\JME3TestsAndroidPanelVisual.java:113: warning: [deprecation] preventFileChooserSymlinkTraversal(JFileChooser,File) in FileUtil has been deprecated
  478. [ant:nb-javac] FileUtil.preventFileChooserSymlinkTraversal(chooser, null);
  479. [ant:nb-javac] ^
  480. [ant:nb-javac] C:\Daniel\Programme\jmonkeyengine-master\jmonkeyengine\sdk\jme3-tests-template\src\com\jme3\gde\templates\tests\testsandroid\JME3TestsAndroidWizardPanel.java:47: warning: [rawtypes] found raw type: Panel
  481. [ant:nb-javac] public class JME3TestsAndroidWizardPanel implements WizardDescriptor.Panel,
  482. [ant:nb-javac] ^
  483. [ant:nb-javac] missing type arguments for generic class Panel<Data>
  484. [ant:nb-javac] where Data is a type-variable:
  485. [ant:nb-javac] Data extends Object declared in interface Panel
  486. [ant:nb-javac] C:\Daniel\Programme\jmonkeyengine-master\jmonkeyengine\sdk\jme3-tests-template\src\com\jme3\gde\templates\tests\testsandroid\JME3TestsAndroidWizardPanel.java:48: warning: [rawtypes] found raw type: ValidatingPanel
  487. [ant:nb-javac] WizardDescriptor.ValidatingPanel, WizardDescriptor.FinishablePanel {
  488. [ant:nb-javac] ^
  489. [ant:nb-javac] missing type arguments for generic class ValidatingPanel<Data>
  490. [ant:nb-javac] where Data is a type-variable:
  491. [ant:nb-javac] Data extends Object declared in interface ValidatingPanel
  492. [ant:nb-javac] C:\Daniel\Programme\jmonkeyengine-master\jmonkeyengine\sdk\jme3-tests-template\src\com\jme3\gde\templates\tests\testsandroid\JME3TestsAndroidWizardPanel.java:48: warning: [rawtypes] found raw type: FinishablePanel
  493. [ant:nb-javac] WizardDescriptor.ValidatingPanel, WizardDescriptor.FinishablePanel {
  494. [ant:nb-javac] ^
  495. [ant:nb-javac] missing type arguments for generic class FinishablePanel<Data>
  496. [ant:nb-javac] where Data is a type-variable:
  497. [ant:nb-javac] Data extends Object declared in interface FinishablePanel
  498. [ant:nb-javac] C:\Daniel\Programme\jmonkeyengine-master\jmonkeyengine\sdk\jme3-tests-template\src\com\jme3\gde\templates\tests\testsandroid\JME3TestsAndroidWizardIterator.java:64: warning: [rawtypes] found raw type: InstantiatingIterator
  499. [ant:nb-javac] public class JME3TestsAndroidWizardIterator implements WizardDescriptor./*Progress*/InstantiatingIterator {
  500. [ant:nb-javac] ^
  501. [ant:nb-javac] missing type arguments for generic class InstantiatingIterator<Data>
  502. [ant:nb-javac] where Data is a type-variable:
  503. [ant:nb-javac] Data extends Object declared in interface InstantiatingIterator
  504. [ant:nb-javac] C:\Daniel\Programme\jmonkeyengine-master\jmonkeyengine\sdk\jme3-tests-template\src\com\jme3\gde\templates\tests\testsandroid\JME3TestsAndroidWizardIterator.java:78: warning: [rawtypes] found raw type: Panel
  505. [ant:nb-javac] return new WizardDescriptor.Panel[]{
  506. [ant:nb-javac] ^
  507. [ant:nb-javac] missing type arguments for generic class Panel<Data>
  508. [ant:nb-javac] where Data is a type-variable:
  509. [ant:nb-javac] Data extends Object declared in interface Panel
  510. [ant:nb-javac] C:\Daniel\Programme\jmonkeyengine-master\jmonkeyengine\sdk\jme3-tests-template\src\com\jme3\gde\templates\tests\testsandroid\JME3TestsAndroidWizardIterator.java:88: warning: [rawtypes] found raw type: Set
  511. [ant:nb-javac] public Set/*<FileObject>*/ instantiate(/*ProgressHandle handle*/) throws IOException {
  512. [ant:nb-javac] ^
  513. [ant:nb-javac] missing type arguments for generic class Set<E>
  514. [ant:nb-javac] where E is a type-variable:
  515. [ant:nb-javac] E extends Object declared in interface Set
  516. [ant:nb-javac] C:\Daniel\Programme\jmonkeyengine-master\jmonkeyengine\sdk\jme3-tests-template\src\com\jme3\gde\templates\tests\testsandroid\JME3TestsAndroidWizardIterator.java:175: warning: [rawtypes] found raw type: Panel
  517. [ant:nb-javac] public WizardDescriptor.Panel current() {
  518. [ant:nb-javac] ^
  519. [ant:nb-javac] missing type arguments for generic class Panel<Data>
  520. [ant:nb-javac] where Data is a type-variable:
  521. [ant:nb-javac] Data extends Object declared in interface Panel
  522. [ant:nb-javac] C:\Daniel\Programme\jmonkeyengine-master\jmonkeyengine\sdk\jme3-tests-template\src\com\jme3\gde\templates\tests\testsdesktop\JmeTestsPanelVisual.java:113: warning: [deprecation] preventFileChooserSymlinkTraversal(JFileChooser,File) in FileUtil has been deprecated
  523. [ant:nb-javac] FileUtil.preventFileChooserSymlinkTraversal(chooser, null);
  524. [ant:nb-javac] ^
  525. [ant:nb-javac] C:\Daniel\Programme\jmonkeyengine-master\jmonkeyengine\sdk\jme3-tests-template\src\com\jme3\gde\templates\tests\testsdesktop\JmeTestsWizardPanel.java:20: warning: [rawtypes] found raw type: Panel
  526. [ant:nb-javac] public class JmeTestsWizardPanel implements WizardDescriptor.Panel,
  527. [ant:nb-javac] ^
  528. [ant:nb-javac] missing type arguments for generic class Panel<Data>
  529. [ant:nb-javac] where Data is a type-variable:
  530. [ant:nb-javac] Data extends Object declared in interface Panel
  531. [ant:nb-javac] C:\Daniel\Programme\jmonkeyengine-master\jmonkeyengine\sdk\jme3-tests-template\src\com\jme3\gde\templates\tests\testsdesktop\JmeTestsWizardPanel.java:21: warning: [rawtypes] found raw type: ValidatingPanel
  532. [ant:nb-javac] WizardDescriptor.ValidatingPanel, WizardDescriptor.FinishablePanel {
  533. [ant:nb-javac] ^
  534. [ant:nb-javac] missing type arguments for generic class ValidatingPanel<Data>
  535. [ant:nb-javac] where Data is a type-variable:
  536. [ant:nb-javac] Data extends Object declared in interface ValidatingPanel
  537. [ant:nb-javac] C:\Daniel\Programme\jmonkeyengine-master\jmonkeyengine\sdk\jme3-tests-template\src\com\jme3\gde\templates\tests\testsdesktop\JmeTestsWizardPanel.java:21: warning: [rawtypes] found raw type: FinishablePanel
  538. [ant:nb-javac] WizardDescriptor.ValidatingPanel, WizardDescriptor.FinishablePanel {
  539. [ant:nb-javac] ^
  540. [ant:nb-javac] missing type arguments for generic class FinishablePanel<Data>
  541. [ant:nb-javac] where Data is a type-variable:
  542. [ant:nb-javac] Data extends Object declared in interface FinishablePanel
  543. [ant:nb-javac] C:\Daniel\Programme\jmonkeyengine-master\jmonkeyengine\sdk\jme3-tests-template\src\com\jme3\gde\templates\tests\testsdesktop\JmeTestsWizardIterator.java:37: warning: [rawtypes] found raw type: InstantiatingIterator
  544. [ant:nb-javac] public class JmeTestsWizardIterator implements WizardDescriptor./*Progress*/InstantiatingIterator {
  545. [ant:nb-javac] ^
  546. [ant:nb-javac] missing type arguments for generic class InstantiatingIterator<Data>
  547. [ant:nb-javac] where Data is a type-variable:
  548. [ant:nb-javac] Data extends Object declared in interface InstantiatingIterator
  549. [ant:nb-javac] C:\Daniel\Programme\jmonkeyengine-master\jmonkeyengine\sdk\jme3-tests-template\src\com\jme3\gde\templates\tests\testsdesktop\JmeTestsWizardIterator.java:51: warning: [rawtypes] found raw type: Panel
  550. [ant:nb-javac] return new WizardDescriptor.Panel[]{
  551. [ant:nb-javac] ^
  552. [ant:nb-javac] missing type arguments for generic class Panel<Data>
  553. [ant:nb-javac] where Data is a type-variable:
  554. [ant:nb-javac] Data extends Object declared in interface Panel
  555. [ant:nb-javac] C:\Daniel\Programme\jmonkeyengine-master\jmonkeyengine\sdk\jme3-tests-template\src\com\jme3\gde\templates\tests\testsdesktop\JmeTestsWizardIterator.java:61: warning: [rawtypes] found raw type: Set
  556. [ant:nb-javac] public Set/*<FileObject>*/ instantiate(/*ProgressHandle handle*/) throws IOException {
  557. [ant:nb-javac] ^
  558. [ant:nb-javac] missing type arguments for generic class Set<E>
  559. [ant:nb-javac] where E is a type-variable:
  560. [ant:nb-javac] E extends Object declared in interface Set
  561. [ant:nb-javac] C:\Daniel\Programme\jmonkeyengine-master\jmonkeyengine\sdk\jme3-tests-template\src\com\jme3\gde\templates\tests\testsdesktop\JmeTestsWizardIterator.java:148: warning: [rawtypes] found raw type: Panel
  562. [ant:nb-javac] public WizardDescriptor.Panel current() {
  563. [ant:nb-javac] ^
  564. [ant:nb-javac] missing type arguments for generic class Panel<Data>
  565. [ant:nb-javac] where Data is a type-variable:
  566. [ant:nb-javac] Data extends Object declared in interface Panel
  567. [ant:nb-javac] 17 warnings
  568. [ant:nb-javac] warning: [options] bootstrap class path not set in conjunction with -source 1.5
  569. [ant:nb-javac] C:\Daniel\Programme\jmonkeyengine-master\jmonkeyengine\sdk\jme3-texture-editor\src\com\jme3\gde\textureeditor\IOModule.java:39: warning: [deprecation] getURL() in FileObject has been deprecated
  570. [ant:nb-javac] ImageInputStream in = new FileImageInputStream(new File(file.getURL().toURI()));
  571. [ant:nb-javac] ^
  572. [ant:nb-javac] C:\Daniel\Programme\jmonkeyengine-master\jmonkeyengine\sdk\jme3-texture-editor\src\com\jme3\gde\textureeditor\ImageEditorComponent.java:263: warning: [deprecation] getURL() in FileObject has been deprecated
  573. [ant:nb-javac] IOModule.create().store(editedImage, name, new File(editedFile.getURL().toURI()));
  574. [ant:nb-javac] ^
  575. [ant:nb-javac] 3 warnings
  576. [ant:nb-javac] warning: [options] bootstrap class path not set in conjunction with -source 1.6
  577. [ant:nb-javac] C:\Daniel\Programme\jmonkeyengine-master\jmonkeyengine\sdk\jme3-upgrader\src\org\netbeans\upgrade\XMLStorage.java:116: warning: [cast] redundant cast to String
  578. [ant:nb-javac] return (String) colorToName.get (color);
  579. [ant:nb-javac] ^
  580. [ant:nb-javac] C:\Daniel\Programme\jmonkeyengine-master\jmonkeyengine\sdk\jme3-upgrader\src\org\netbeans\upgrade\XMLStorage.java:124: warning: [cast] redundant cast to Color
  581. [ant:nb-javac] return (Color) nameToColor.get (color);
  582. [ant:nb-javac] ^
  583. [ant:nb-javac] C:\Daniel\Programme\jmonkeyengine-master\jmonkeyengine\sdk\jme3-upgrader\src\org\netbeans\upgrade\ColoringStorage.java:78: warning: [rawtypes] found raw type: Map
  584. [ant:nb-javac] static Map loadColorings (
  585. [ant:nb-javac] ^
  586. [ant:nb-javac] missing type arguments for generic class Map<K,V>
  587. [ant:nb-javac] where K,V are type-variables:
  588. [ant:nb-javac] K extends Object declared in interface Map
  589. [ant:nb-javac] V extends Object declared in interface Map
  590. [ant:nb-javac] C:\Daniel\Programme\jmonkeyengine-master\jmonkeyengine\sdk\jme3-upgrader\src\org\netbeans\upgrade\ColoringStorage.java:191: warning: [rawtypes] found raw type: Collection
  591. [ant:nb-javac] static void saveColorings (FileObject fo, Collection colorings) {
  592. [ant:nb-javac] ^
  593. [ant:nb-javac] missing type arguments for generic class Collection<E>
  594. [ant:nb-javac] where E is a type-variable:
  595. [ant:nb-javac] E extends Object declared in interface Collection
  596. [ant:nb-javac] C:\Daniel\Programme\jmonkeyengine-master\jmonkeyengine\sdk\jme3-upgrader\src\org\netbeans\upgrade\ColoringStorage.java:194: warning: [rawtypes] found raw type: Iterator
  597. [ant:nb-javac] Iterator it = colorings.iterator ();
  598. [ant:nb-javac] ^
  599. [ant:nb-javac] missing type arguments for generic class Iterator<E>
  600. [ant:nb-javac] where E is a type-variable:
  601. [ant:nb-javac] E extends Object declared in interface Iterator
  602. [ant:nb-javac] C:\Daniel\Programme\jmonkeyengine-master\jmonkeyengine\sdk\jme3-upgrader\src\org\netbeans\upgrade\ColoringStorage.java:103: warning: [cast] redundant cast to String
  603. [ant:nb-javac] String n = (String) attributes.getValue ("syntaxName");
  604. [ant:nb-javac] ^
  605. [ant:nb-javac] C:\Daniel\Programme\jmonkeyengine-master\jmonkeyengine\sdk\jme3-upgrader\src\org\netbeans\upgrade\ColoringStorage.java:105: warning: [cast] redundant cast to String
  606. [ant:nb-javac] n = (String) attributes.getValue ("name");
  607. [ant:nb-javac] ^
  608. [ant:nb-javac] C:\Daniel\Programme\jmonkeyengine-master\jmonkeyengine\sdk\jme3-upgrader\src\org\netbeans\upgrade\ColoringStorage.java:143: warning: [cast] redundant cast to String
  609. [ant:nb-javac] (String) attributes.getValue ("default")
  610. [ant:nb-javac] ^
  611. [ant:nb-javac] C:\Daniel\Programme\jmonkeyengine-master\jmonkeyengine\sdk\jme3-upgrader\src\org\netbeans\upgrade\Copy.java:61: warning: [rawtypes] found raw type: Set
  612. [ant:nb-javac] private Set thoseToCopy;
  613. [ant:nb-javac] ^
  614. [ant:nb-javac] missing type arguments for generic class Set<E>
  615. [ant:nb-javac] where E is a type-variable:
  616. [ant:nb-javac] E extends Object declared in interface Set
  617. [ant:nb-javac] C:\Daniel\Programme\jmonkeyengine-master\jmonkeyengine\sdk\jme3-upgrader\src\org\netbeans\upgrade\Copy.java:64: warning: [rawtypes] found raw type: Set
  618. [ant:nb-javac] private Copy(FileObject source, FileObject target, Set thoseToCopy, PathTransformation transformation) {
  619. [ant:nb-javac] ^
  620. [ant:nb-javac] missing type arguments for generic class Set<E>
  621. [ant:nb-javac] where E is a type-variable:
  622. [ant:nb-javac] E extends Object declared in interface Set
  623. [ant:nb-javac] C:\Daniel\Programme\jmonkeyengine-master\jmonkeyengine\sdk\jme3-upgrader\src\org\netbeans\upgrade\Copy.java:78: warning: [rawtypes] found raw type: Set
  624. [ant:nb-javac] public static void copyDeep (FileObject source, FileObject target, Set thoseToCopy)
  625. [ant:nb-javac] ^
  626. [ant:nb-javac] missing type arguments for generic class Set<E>
  627. [ant:nb-javac] where E is a type-variable:
  628. [ant:nb-javac] E extends Object declared in interface Set
  629. [ant:nb-javac] C:\Daniel\Programme\jmonkeyengine-master\jmonkeyengine\sdk\jme3-upgrader\src\org\netbeans\upgrade\Copy.java:83: warning: [rawtypes] found raw type: Set
  630. [ant:nb-javac] public static void copyDeep (FileObject source, FileObject target, Set thoseToCopy, PathTransformation transformation)
  631. [ant:nb-javac] ^
  632. [ant:nb-javac] missing type arguments for generic class Set<E>
  633. [ant:nb-javac] where E is a type-variable:
  634. [ant:nb-javac] E extends Object declared in interface Set
  635. [ant:nb-javac] C:\Daniel\Programme\jmonkeyengine-master\jmonkeyengine\sdk\jme3-upgrader\src\org\netbeans\upgrade\IncludeExclude.java:58: warning: [rawtypes] found raw type: AbstractSet
  636. [ant:nb-javac] final class IncludeExclude extends AbstractSet {
  637. [ant:nb-javac] ^
  638. [ant:nb-javac] missing type arguments for generic class AbstractSet<E>
  639. [ant:nb-javac] where E is a type-variable:
  640. [ant:nb-javac] E extends Object declared in class AbstractSet
  641. [ant:nb-javac] C:\Daniel\Programme\jmonkeyengine-master\jmonkeyengine\sdk\jme3-upgrader\src\org\netbeans\upgrade\IncludeExclude.java:106: warning: [rawtypes] found raw type: Iterator
  642. [ant:nb-javac] public Iterator iterator () {
  643. [ant:nb-javac] ^
  644. [ant:nb-javac] missing type arguments for generic class Iterator<E>
  645. [ant:nb-javac] where E is a type-variable:
  646. [ant:nb-javac] E extends Object declared in interface Iterator
  647. [ant:nb-javac] C:\Daniel\Programme\jmonkeyengine-master\jmonkeyengine\sdk\jme3-upgrader\src\org\netbeans\upgrade\systemoptions\ColorProcessor.java:71: warning: [rawtypes] found raw type: Iterator
  648. [ant:nb-javac] for (Iterator it = ((SerParser.ObjectWrapper)value).data.iterator(); it.hasNext();) {
  649. [ant:nb-javac] ^
  650. [ant:nb-javac] missing type arguments for generic class Iterator<E>
  651. [ant:nb-javac] where E is a type-variable:
  652. [ant:nb-javac] E extends Object declared in interface Iterator
  653. [ant:nb-javac] C:\Daniel\Programme\jmonkeyengine-master\jmonkeyengine\sdk\jme3-upgrader\src\org\netbeans\upgrade\systemoptions\PropertyProcessor.java:129: warning: [cast] redundant cast to PropertyProcessor
  654. [ant:nb-javac] return (PropertyProcessor)clsname2Delegate.get(clsName);
  655. [ant:nb-javac] ^
  656. [ant:nb-javac] C:\Daniel\Programme\jmonkeyengine-master\jmonkeyengine\sdk\jme3-upgrader\src\org\netbeans\upgrade\systemoptions\CvsSettingsProcessor.java:63: warning: [rawtypes] found raw type: List
  657. [ant:nb-javac] List mapData = ((SerParser.ObjectWrapper) value).data;
  658. [ant:nb-javac] ^
  659. [ant:nb-javac] missing type arguments for generic class List<E>
  660. [ant:nb-javac] where E is a type-variable:
  661. [ant:nb-javac] E extends Object declared in interface List
  662. [ant:nb-javac] C:\Daniel\Programme\jmonkeyengine-master\jmonkeyengine\sdk\jme3-upgrader\src\org\netbeans\upgrade\systemoptions\CvsSettingsProcessor.java:70: warning: [rawtypes] found raw type: List
  663. [ant:nb-javac] List rootData = ((SerParser.ObjectWrapper) mapData.get(idx + 1)).data;
  664. [ant:nb-javac] ^
  665. [ant:nb-javac] missing type arguments for generic class List<E>
  666. [ant:nb-javac] where E is a type-variable:
  667. [ant:nb-javac] E extends Object declared in interface List
  668. [ant:nb-javac] C:\Daniel\Programme\jmonkeyengine-master\jmonkeyengine\sdk\jme3-upgrader\src\org\netbeans\upgrade\systemoptions\CvsSettingsProcessor.java:72: warning: [rawtypes] found raw type: List
  669. [ant:nb-javac] List extSettingsData = ((SerParser.ObjectWrapper) ((SerParser.NameValue) rootData.get(0)).value).data;
  670. [ant:nb-javac] ^
  671. [ant:nb-javac] missing type arguments for generic class List<E>
  672. [ant:nb-javac] where E is a type-variable:
  673. [ant:nb-javac] E extends Object declared in interface List
  674. [ant:nb-javac] C:\Daniel\Programme\jmonkeyengine-master\jmonkeyengine\sdk\jme3-upgrader\src\org\netbeans\upgrade\systemoptions\FileProcessor.java:61: warning: [rawtypes] found raw type: List
  675. [ant:nb-javac] List l = ((SerParser.ObjectWrapper)value).data;
  676. [ant:nb-javac] ^
  677. [ant:nb-javac] missing type arguments for generic class List<E>
  678. [ant:nb-javac] where E is a type-variable:
  679. [ant:nb-javac] E extends Object declared in interface List
  680. [ant:nb-javac] C:\Daniel\Programme\jmonkeyengine-master\jmonkeyengine\sdk\jme3-upgrader\src\org\netbeans\upgrade\systemoptions\FileProcessor.java:62: warning: [rawtypes] found raw type: Iterator
  681. [ant:nb-javac] for (Iterator it = l.iterator(); it.hasNext();) {
  682. [ant:nb-javac] ^
  683. [ant:nb-javac] missing type arguments for generic class Iterator<E>
  684. [ant:nb-javac] where E is a type-variable:
  685. [ant:nb-javac] E extends Object declared in interface Iterator
  686. [ant:nb-javac] C:\Daniel\Programme\jmonkeyengine-master\jmonkeyengine\sdk\jme3-upgrader\src\org\netbeans\upgrade\systemoptions\FileProcessor.java:63: warning: [cast] redundant cast to Object
  687. [ant:nb-javac] Object elem = (Object) it.next();
  688. [ant:nb-javac] ^
  689. [ant:nb-javac] C:\Daniel\Programme\jmonkeyengine-master\jmonkeyengine\sdk\jme3-upgrader\src\org\netbeans\upgrade\systemoptions\HashMapProcessor.java:62: warning: [rawtypes] found raw type: List
  690. [ant:nb-javac] List l = ((SerParser.ObjectWrapper)value).data;
  691. [ant:nb-javac] ^
  692. [ant:nb-javac] missing type arguments for generic class List<E>
  693. [ant:nb-javac] where E is a type-variable:
  694. [ant:nb-javac] E extends Object declared in interface List
  695. [ant:nb-javac] C:\Daniel\Programme\jmonkeyengine-master\jmonkeyengine\sdk\jme3-upgrader\src\org\netbeans\upgrade\systemoptions\HashMapProcessor.java:63: warning: [rawtypes] found raw type: Iterator
  696. [ant:nb-javac] for (Iterator it = l.iterator(); it.hasNext();) {
  697. [ant:nb-javac] ^
  698. [ant:nb-javac] missing type arguments for generic class Iterator<E>
  699. [ant:nb-javac] where E is a type-variable:
  700. [ant:nb-javac] E extends Object declared in interface Iterator
  701. [ant:nb-javac] C:\Daniel\Programme\jmonkeyengine-master\jmonkeyengine\sdk\jme3-upgrader\src\org\netbeans\upgrade\systemoptions\HashMapProcessor.java:64: warning: [cast] redundant cast to Object
  702. [ant:nb-javac] Object elem = (Object) it.next();
  703. [ant:nb-javac] ^
  704. [ant:nb-javac] C:\Daniel\Programme\jmonkeyengine-master\jmonkeyengine\sdk\jme3-upgrader\src\org\netbeans\upgrade\systemoptions\HashMapProcessor.java:70: warning: [fallthrough] possible fall-through into case
  705. [ant:nb-javac] case 0:
  706. [ant:nb-javac] ^
  707. [ant:nb-javac] C:\Daniel\Programme\jmonkeyengine-master\jmonkeyengine\sdk\jme3-upgrader\src\org\netbeans\upgrade\systemoptions\HashSetProcessor.java:51: warning: [rawtypes] found raw type: List
  708. [ant:nb-javac] List l = ((SerParser.ObjectWrapper) value).data;
  709. [ant:nb-javac] ^
  710. [ant:nb-javac] missing type arguments for generic class List<E>
  711. [ant:nb-javac] where E is a type-variable:
  712. [ant:nb-javac] E extends Object declared in interface List
  713. [ant:nb-javac] C:\Daniel\Programme\jmonkeyengine-master\jmonkeyengine\sdk\jme3-upgrader\src\org\netbeans\upgrade\systemoptions\HashSetProcessor.java:53: warning: [rawtypes] found raw type: Iterator
  714. [ant:nb-javac] for (Iterator it = l.iterator(); it.hasNext();) {
  715. [ant:nb-javac] ^
  716. [ant:nb-javac] missing type arguments for generic class Iterator<E>
  717. [ant:nb-javac] where E is a type-variable:
  718. [ant:nb-javac] E extends Object declared in interface Iterator
  719. [ant:nb-javac] C:\Daniel\Programme\jmonkeyengine-master\jmonkeyengine\sdk\jme3-upgrader\src\org\netbeans\upgrade\systemoptions\HostPropertyProcessor.java:64: warning: [rawtypes] found raw type: List
  720. [ant:nb-javac] List l = ((SerParser.ObjectWrapper)value).data;
  721. [ant:nb-javac] ^
  722. [ant:nb-javac] missing type arguments for generic class List<E>
  723. [ant:nb-javac] where E is a type-variable:
  724. [ant:nb-javac] E extends Object declared in interface List
  725. [ant:nb-javac] C:\Daniel\Programme\jmonkeyengine-master\jmonkeyengine\sdk\jme3-upgrader\src\org\netbeans\upgrade\systemoptions\HostPropertyProcessor.java:65: warning: [rawtypes] found raw type: Iterator
  726. [ant:nb-javac] for (Iterator it = l.iterator(); it.hasNext();) {
  727. [ant:nb-javac] ^
  728. [ant:nb-javac] missing type arguments for generic class Iterator<E>
  729. [ant:nb-javac] where E is a type-variable:
  730. [ant:nb-javac] E extends Object declared in interface Iterator
  731. [ant:nb-javac] C:\Daniel\Programme\jmonkeyengine-master\jmonkeyengine\sdk\jme3-upgrader\src\org\netbeans\upgrade\systemoptions\HostPropertyProcessor.java:66: warning: [cast] redundant cast to Object
  732. [ant:nb-javac] Object elem = (Object) it.next();
  733. [ant:nb-javac] ^
  734. [ant:nb-javac] C:\Daniel\Programme\jmonkeyengine-master\jmonkeyengine\sdk\jme3-upgrader\src\org\netbeans\upgrade\systemoptions\Importer.java:65: warning: [rawtypes] found raw type: Iterator
  735. [ant:nb-javac] for (Iterator it = files.iterator(); it.hasNext();) {
  736. [ant:nb-javac] ^
  737. [ant:nb-javac] missing type arguments for generic class Iterator<E>
  738. [ant:nb-javac] where E is a type-variable:
  739. [ant:nb-javac] E extends Object declared in interface Iterator
  740. [ant:nb-javac] C:\Daniel\Programme\jmonkeyengine-master\jmonkeyengine\sdk\jme3-upgrader\src\org\netbeans\upgrade\systemoptions\Importer.java:123: warning: [rawtypes] found raw type: Iterator
  741. [ant:nb-javac] for (Iterator it = props.keySet().iterator(); it.hasNext();) {
  742. [ant:nb-javac] ^
  743. [ant:nb-javac] missing type arguments for generic class Iterator<E>
  744. [ant:nb-javac] where E is a type-variable:
  745. [ant:nb-javac] E extends Object declared in interface Iterator
  746. [ant:nb-javac] C:\Daniel\Programme\jmonkeyengine-master\jmonkeyengine\sdk\jme3-upgrader\src\org\netbeans\upgrade\systemoptions\ListProcessor.java:65: warning: [rawtypes] found raw type: List
  747. [ant:nb-javac] List l = ((SerParser.ObjectWrapper)value).data;
  748. [ant:nb-javac] ^
  749. [ant:nb-javac] missing type arguments for generic class List<E>
  750. [ant:nb-javac] where E is a type-variable:
  751. [ant:nb-javac] E extends Object declared in interface List
  752. [ant:nb-javac] C:\Daniel\Programme\jmonkeyengine-master\jmonkeyengine\sdk\jme3-upgrader\src\org\netbeans\upgrade\systemoptions\ListProcessor.java:66: warning: [rawtypes] found raw type: Iterator
  753. [ant:nb-javac] for (Iterator it = l.iterator(); it.hasNext();) {
  754. [ant:nb-javac] ^
  755. [ant:nb-javac] missing type arguments for generic class Iterator<E>
  756. [ant:nb-javac] where E is a type-variable:
  757. [ant:nb-javac] E extends Object declared in interface Iterator
  758. [ant:nb-javac] C:\Daniel\Programme\jmonkeyengine-master\jmonkeyengine\sdk\jme3-upgrader\src\org\netbeans\upgrade\systemoptions\ListProcessor.java:70: warning: [rawtypes] found raw type: List
  759. [ant:nb-javac] List list2 = ((SerParser.ObjectWrapper)elem).data;
  760. [ant:nb-javac] ^
  761. [ant:nb-javac] missing type arguments for generic class List<E>
  762. [ant:nb-javac] where E is a type-variable:
  763. [ant:nb-javac] E extends Object declared in interface List
  764. [ant:nb-javac] C:\Daniel\Programme\jmonkeyengine-master\jmonkeyengine\sdk\jme3-upgrader\src\org\netbeans\upgrade\systemoptions\ListProcessor.java:68: warning: [cast] redundant cast to Object
  765. [ant:nb-javac] Object elem = (Object) it.next();
  766. [ant:nb-javac] ^
  767. [ant:nb-javac] C:\Daniel\Programme\jmonkeyengine-master\jmonkeyengine\sdk\jme3-upgrader\src\org\netbeans\upgrade\systemoptions\NbClassPathProcessor.java:60: warning: [rawtypes] found raw type: List
  768. [ant:nb-javac] List l = ((SerParser.ObjectWrapper)value).data;
  769. [ant:nb-javac] ^
  770. [ant:nb-javac] missing type arguments for generic class List<E>
  771. [ant:nb-javac] where E is a type-variable:
  772. [ant:nb-javac] E extends Object declared in interface List
  773. [ant:nb-javac] C:\Daniel\Programme\jmonkeyengine-master\jmonkeyengine\sdk\jme3-upgrader\src\org\netbeans\upgrade\systemoptions\NbClassPathProcessor.java:61: warning: [rawtypes] found raw type: Iterator
  774. [ant:nb-javac] for (Iterator it = l.iterator(); it.hasNext();) {
  775. [ant:nb-javac] ^
  776. [ant:nb-javac] missing type arguments for generic class Iterator<E>
  777. [ant:nb-javac] where E is a type-variable:
  778. [ant:nb-javac] E extends Object declared in interface Iterator
  779. [ant:nb-javac] C:\Daniel\Programme\jmonkeyengine-master\jmonkeyengine\sdk\jme3-upgrader\src\org\netbeans\upgrade\systemoptions\NbClassPathProcessor.java:62: warning: [cast] redundant cast to Object
  780. [ant:nb-javac] Object elem = (Object) it.next();
  781. [ant:nb-javac] ^
  782. [ant:nb-javac] C:\Daniel\Programme\jmonkeyengine-master\jmonkeyengine\sdk\jme3-upgrader\src\org\netbeans\upgrade\systemoptions\SerParser.java:356: warning: [rawtypes] found raw type: List
  783. [ant:nb-javac] public List annotation; // List<Object>
  784. [ant:nb-javac] ^
  785. [ant:nb-javac] missing type arguments for generic class List<E>
  786. [ant:nb-javac] where E is a type-variable:
  787. [ant:nb-javac] E extends Object declared in interface List
  788. [ant:nb-javac] C:\Daniel\Programme\jmonkeyengine-master\jmonkeyengine\sdk\jme3-upgrader\src\org\netbeans\upgrade\systemoptions\SerParser.java:583: warning: [cast] redundant cast to FieldDesc
  789. [ant:nb-javac] FieldDesc fd = (FieldDesc)fields.get(i);
  790. [ant:nb-javac] ^
  791. [ant:nb-javac] C:\Daniel\Programme\jmonkeyengine-master\jmonkeyengine\sdk\jme3-upgrader\src\org\netbeans\upgrade\systemoptions\SettingsRecognizer.java:162: warning: [rawtypes] found raw type: Set
  792. [ant:nb-javac] public Set getInstanceOf() {
  793. [ant:nb-javac] ^
  794. [ant:nb-javac] missing type arguments for generic class Set<E>
  795. [ant:nb-javac] where E is a type-variable:
  796. [ant:nb-javac] E extends Object declared in interface Set
  797. [ant:nb-javac] C:\Daniel\Programme\jmonkeyengine-master\jmonkeyengine\sdk\jme3-upgrader\src\org\netbeans\upgrade\systemoptions\SettingsRecognizer.java:328: warning: [rawtypes] found raw type: Class
  798. [ant:nb-javac] Method method = SharedClassObject.class.getDeclaredMethod("reset", new Class[0]); // NOI18N
  799. [ant:nb-javac] ^
  800. [ant:nb-javac] missing type arguments for generic class Class<T>
  801. [ant:nb-javac] where T is a type-variable:
  802. [ant:nb-javac] T extends Object declared in class Class
  803. [ant:nb-javac] C:\Daniel\Programme\jmonkeyengine-master\jmonkeyengine\sdk\jme3-upgrader\src\org\netbeans\upgrade\systemoptions\SettingsRecognizer.java:398: warning: [rawtypes] found raw type: Class
  804. [ant:nb-javac] Method method = clazz.getMethod(targetMethod, new Class[]{FileObject.class});
  805. [ant:nb-javac] ^
  806. [ant:nb-javac] missing type arguments for generic class Class<T>
  807. [ant:nb-javac] where T is a type-variable:
  808. [ant:nb-javac] T extends Object declared in class Class
  809. [ant:nb-javac] C:\Daniel\Programme\jmonkeyengine-master\jmonkeyengine\sdk\jme3-upgrader\src\org\netbeans\upgrade\systemoptions\SettingsRecognizer.java:430: warning: [rawtypes] found raw type: Class
  810. [ant:nb-javac] public Class instanceClass() throws java.io.IOException, ClassNotFoundException {
  811. [ant:nb-javac] ^
  812. [ant:nb-javac] missing type arguments for generic class Class<T>
  813. [ant:nb-javac] where T is a type-variable:
  814. [ant:nb-javac] T extends Object declared in class Class
  815. [ant:nb-javac] C:\Daniel\Programme\jmonkeyengine-master\jmonkeyengine\sdk\jme3-upgrader\src\org\netbeans\upgrade\systemoptions\SettingsRecognizer.java:440: warning: [rawtypes] found raw type: Class
  816. [ant:nb-javac] private Class loadClass(String clazz) throws ClassNotFoundException {
  817. [ant:nb-javac] ^
  818. [ant:nb-javac] missing type arguments for generic class Class<T>
  819. [ant:nb-javac] where T is a type-variable:
  820. [ant:nb-javac] T extends Object declared in class Class
  821. [ant:nb-javac] C:\Daniel\Programme\jmonkeyengine-master\jmonkeyengine\sdk\jme3-upgrader\src\org\netbeans\upgrade\systemoptions\SettingsRecognizer.java:490: warning: [static] static variable should be qualified by type name, ErrorManager, instead of by an expression
  822. [ant:nb-javac] if (err.isLoggable(err.INFORMATIONAL) && source.getSize() < 12000) {
  823. [ant:nb-javac] ^
  824. [ant:nb-javac] C:\Daniel\Programme\jmonkeyengine-master\jmonkeyengine\sdk\jme3-upgrader\src\org\netbeans\upgrade\systemoptions\SettingsRecognizer.java:441: warning: [cast] redundant cast to ClassLoader
  825. [ant:nb-javac] return ((ClassLoader)Lookup.getDefault().lookup(ClassLoader.class)).loadClass(clazz);
  826. [ant:nb-javac] ^
  827. [ant:nb-javac] C:\Daniel\Programme\jmonkeyengine-master\jmonkeyengine\sdk\jme3-upgrader\src\org\netbeans\upgrade\systemoptions\SystemOptionsParser.java:108: warning: [rawtypes] found raw type: Set
  828. [ant:nb-javac] Set instances = recognizer.getInstanceOf();
  829. [ant:nb-javac] ^
  830. [ant:nb-javac] missing type arguments for generic class Set<E>
  831. [ant:nb-javac] where E is a type-variable:
  832. [ant:nb-javac] E extends Object declared in interface Set
  833. [ant:nb-javac] C:\Daniel\Programme\jmonkeyengine-master\jmonkeyengine\sdk\jme3-upgrader\src\org\netbeans\upgrade\systemoptions\TaskTagsProcessor.java:66: warning: [rawtypes] found raw type: List
  834. [ant:nb-javac] List l = ((SerParser.ObjectWrapper)value).data;
  835. [ant:nb-javac] ^
  836. [ant:nb-javac] missing type arguments for generic class List<E>
  837. [ant:nb-javac] where E is a type-variable:
  838. [ant:nb-javac] E extends Object declared in interface List
  839. [ant:nb-javac] C:\Daniel\Programme\jmonkeyengine-master\jmonkeyengine\sdk\jme3-upgrader\src\org\netbeans\upgrade\systemoptions\TaskTagsProcessor.java:67: warning: [rawtypes] found raw type: Iterator
  840. [ant:nb-javac] for (Iterator it = l.iterator(); it.hasNext();) {
  841. [ant:nb-javac] ^
  842. [ant:nb-javac] missing type arguments for generic class Iterator<E>
  843. [ant:nb-javac] where E is a type-variable:
  844. [ant:nb-javac] E extends Object declared in interface Iterator
  845. [ant:nb-javac] C:\Daniel\Programme\jmonkeyengine-master\jmonkeyengine\sdk\jme3-upgrader\src\org\netbeans\upgrade\systemoptions\TaskTagsProcessor.java:83: warning: [rawtypes] found raw type: List
  846. [ant:nb-javac] List l = ((SerParser.ObjectWrapper)value).data;
  847. [ant:nb-javac] ^
  848. [ant:nb-javac] missing type arguments for generic class List<E>
  849. [ant:nb-javac] where E is a type-variable:
  850. [ant:nb-javac] E extends Object declared in interface List
  851. [ant:nb-javac] C:\Daniel\Programme\jmonkeyengine-master\jmonkeyengine\sdk\jme3-upgrader\src\org\netbeans\upgrade\systemoptions\TaskTagsProcessor.java:84: warning: [rawtypes] found raw type: Iterator
  852. [ant:nb-javac] for (Iterator it = l.iterator(); it.hasNext();) {
  853. [ant:nb-javac] ^
  854. [ant:nb-javac] missing type arguments for generic class Iterator<E>
  855. [ant:nb-javac] where E is a type-variable:
  856. [ant:nb-javac] E extends Object declared in interface Iterator
  857. [ant:nb-javac] C:\Daniel\Programme\jmonkeyengine-master\jmonkeyengine\sdk\jme3-upgrader\src\org\netbeans\upgrade\systemoptions\TaskTagsProcessor.java:68: warning: [cast] redundant cast to Object
  858. [ant:nb-javac] Object elem = (Object) it.next();
  859. [ant:nb-javac] ^
  860. [ant:nb-javac] C:\Daniel\Programme\jmonkeyengine-master\jmonkeyengine\sdk\jme3-upgrader\src\org\netbeans\upgrade\systemoptions\TaskTagsProcessor.java:85: warning: [cast] redundant cast to Object
  861. [ant:nb-javac] Object elem = (Object) it.next();
  862. [ant:nb-javac] ^
  863. [ant:nb-javac] C:\Daniel\Programme\jmonkeyengine-master\jmonkeyengine\sdk\jme3-upgrader\src\org\netbeans\upgrade\systemoptions\URLProcessor.java:63: warning: [rawtypes] found raw type: List
  864. [ant:nb-javac] List l = ((SerParser.ObjectWrapper)value).data;
  865. [ant:nb-javac] ^
  866. [ant:nb-javac] missing type arguments for generic class List<E>
  867. [ant:nb-javac] where E is a type-variable:
  868. [ant:nb-javac] E extends Object declared in interface List
  869. [ant:nb-javac] C:\Daniel\Programme\jmonkeyengine-master\jmonkeyengine\sdk\jme3-upgrader\src\org\netbeans\upgrade\systemoptions\URLProcessor.java:75: warning: [rawtypes] found raw type: List
  870. [ant:nb-javac] public static URL createURL(List l) throws MalformedURLException {
  871. [ant:nb-javac] ^
  872. [ant:nb-javac] missing type arguments for generic class List<E>
  873. [ant:nb-javac] where E is a type-variable:
  874. [ant:nb-javac] E extends Object declared in interface List
  875. [ant:nb-javac] C:\Daniel\Programme\jmonkeyengine-master\jmonkeyengine\sdk\jme3-upgrader\src\org\netbeans\upgrade\systemoptions\URLProcessor.java:82: warning: [rawtypes] found raw type: Iterator
  876. [ant:nb-javac] for (Iterator it = l.iterator(); it.hasNext();) {
  877. [ant:nb-javac] ^
  878. [ant:nb-javac] missing type arguments for generic class Iterator<E>
  879. [ant:nb-javac] where E is a type-variable:
  880. [ant:nb-javac] E extends Object declared in interface Iterator
  881. [ant:nb-javac] C:\Daniel\Programme\jmonkeyengine-master\jmonkeyengine\sdk\jme3-upgrader\src\org\netbeans\upgrade\systemoptions\URLProcessor.java:83: warning: [cast] redundant cast to Object
  882. [ant:nb-javac] Object elem = (Object) it.next();
  883. [ant:nb-javac] ^
  884. [ant:nb-javac] C:\Daniel\Programme\jmonkeyengine-master\jmonkeyengine\sdk\jme3-upgrader\src\org\netbeans\upgrade\systemoptions\Utils.java:66: warning: [rawtypes] found raw type: List
  885. [ant:nb-javac] List l = ((SerParser.ObjectWrapper)value).data;
  886. [ant:nb-javac] ^
  887. [ant:nb-javac] missing type arguments for generic class List<E>
  888. [ant:nb-javac] where E is a type-variable:
  889. [ant:nb-javac] E extends Object declared in interface List
  890. [ant:nb-javac] C:\Daniel\Programme\jmonkeyengine-master\jmonkeyengine\sdk\jme3-upgrader\src\org\netbeans\upgrade\systemoptions\Utils.java:82: warning: [rawtypes] found raw type: List
  891. [ant:nb-javac] List es = ((SerParser.ArrayWrapper)value).values;
  892. [ant:nb-javac] ^
  893. [ant:nb-javac] missing type arguments for generic class List<E>
  894. [ant:nb-javac] where E is a type-variable:
  895. [ant:nb-javac] E extends Object declared in interface List
  896. [ant:nb-javac] C:\Daniel\Programme\jmonkeyengine-master\jmonkeyengine\sdk\jme3-upgrader\src\org\netbeans\upgrade\systemoptions\Utils.java:83: warning: [rawtypes] found raw type: Iterator
  897. [ant:nb-javac] for (Iterator it = es.iterator(); it.hasNext();) {
  898. [ant:nb-javac] ^
  899. [ant:nb-javac] missing type arguments for generic class Iterator<E>
  900. [ant:nb-javac] where E is a type-variable:
  901. [ant:nb-javac] E extends Object declared in interface Iterator
  902. [ant:nb-javac] C:\Daniel\Programme\jmonkeyengine-master\jmonkeyengine\sdk\jme3-upgrader\src\org\netbeans\upgrade\systemoptions\Utils.java:92: warning: [rawtypes] found raw type: List
  903. [ant:nb-javac] List awl = ((SerParser.ArrayWrapper)value).values;
  904. [ant:nb-javac] ^
  905. [ant:nb-javac] missing type arguments for generic class List<E>
  906. [ant:nb-javac] where E is a type-variable:
  907. [ant:nb-javac] E extends Object declared in interface List
  908. [ant:nb-javac] C:\Daniel\Programme\jmonkeyengine-master\jmonkeyengine\sdk\jme3-upgrader\src\org\netbeans\upgrade\systemoptions\Utils.java:93: warning: [rawtypes] found raw type: Iterator
  909. [ant:nb-javac] for (Iterator it = awl.iterator(); it.hasNext();) {
  910. [ant:nb-javac] ^
  911. [ant:nb-javac] missing type arguments for generic class Iterator<E>
  912. [ant:nb-javac] where E is a type-variable:
  913. [ant:nb-javac] E extends Object declared in interface Iterator
  914. [ant:nb-javac] 66 warnings
  915. [ant:parseprojectxml] The module org.jdesktop.layout has been deprecated
  916. [ant:parseprojectxml] The module org.jdesktop.layout has been deprecated
  917. [ant:nb-javac] warning: [options] bootstrap class path not set in conjunction with -source 1.5
  918. [ant:nb-javac] C:\Daniel\Programme\jmonkeyengine-master\jmonkeyengine\sdk\jme3-core\src\com\jme3\gde\core\scene\controller\SceneToolController.java:14: warning: [deprecation] CharacterControl in com.jme3.bullet.control has been deprecated
  919. [ant:nb-javac] import com.jme3.bullet.control.CharacterControl;
  920. [ant:nb-javac] ^
  921. [ant:nb-javac] C:\Daniel\Programme\jmonkeyengine-master\jmonkeyengine\sdk\jme3-core\src\com\jme3\gde\core\sceneexplorer\nodes\JmeCharacterControl.java:35: warning: [deprecation] CharacterControl in com.jme3.bullet.control has been deprecated
  922. [ant:nb-javac] import com.jme3.bullet.control.CharacterControl;
  923. [ant:nb-javac] ^
  924. [ant:nb-javac] C:\Daniel\Programme\jmonkeyengine-master\jmonkeyengine\sdk\jme3-core\src\com\jme3\gde\core\sceneexplorer\nodes\actions\impl\NewCharacterAction.java:35: warning: [deprecation] CharacterControl in com.jme3.bullet.control has been deprecated
  925. [ant:nb-javac] import com.jme3.bullet.control.CharacterControl;
  926. [ant:nb-javac] ^
  927. [ant:nb-javac] C:\Daniel\Programme\jmonkeyengine-master\jmonkeyengine\sdk\build\public-package-jars\org-netbeans-modules-java-source.jar(org/netbeans/api/java/source/ClassIndex.class): warning: Cannot find annotation method 'value()' in type 'SuppressWarnings': class file for org.netbeans.api.annotations.common.SuppressWarnings not found
  928. [ant:nb-javac] C:\Daniel\Programme\jmonkeyengine-master\jmonkeyengine\sdk\build\public-package-jars\org-netbeans-modules-java-source.jar(org/netbeans/api/java/source/ClassIndex.class): warning: Cannot find annotation method 'justification()' in type 'SuppressWarnings'
  929. [ant:nb-javac] C:\Daniel\Programme\jmonkeyengine-master\jmonkeyengine\sdk\build\public-package-jars\org-netbeans-modules-java-source.jar(org/netbeans/api/java/source/ClassIndex.class): warning: Cannot find annotation method 'value()' in type 'SuppressWarnings'
  930. [ant:nb-javac] C:\Daniel\Programme\jmonkeyengine-master\jmonkeyengine\sdk\build\public-package-jars\org-netbeans-modules-java-source.jar(org/netbeans/api/java/source/ClassIndex.class): warning: Cannot find annotation method 'justification()' in type 'SuppressWarnings'
  931. [ant:nb-javac] C:\Daniel\Programme\jmonkeyengine-master\jmonkeyengine\sdk\build\public-package-jars\org-netbeans-modules-java-source.jar(org/netbeans/api/java/source/ClassIndex.class): warning: Cannot find annotation method 'value()' in type 'SuppressWarnings'
  932. [ant:nb-javac] C:\Daniel\Programme\jmonkeyengine-master\jmonkeyengine\sdk\build\public-package-jars\org-netbeans-modules-java-source.jar(org/netbeans/api/java/source/ClassIndex.class): warning: Cannot find annotation method 'justification()' in type 'SuppressWarnings'
  933. [ant:nb-javac] C:\Daniel\Programme\jmonkeyengine-master\jmonkeyengine\sdk\build\public-package-jars\org-netbeans-modules-java-source.jar(org/netbeans/api/java/source/SourceUtils.class): warning: Cannot find annotation method 'value()' in type 'SuppressWarnings'
  934. [ant:nb-javac] C:\Daniel\Programme\jmonkeyengine-master\jmonkeyengine\sdk\build\public-package-jars\org-netbeans-modules-java-source.jar(org/netbeans/api/java/source/SourceUtils.class): warning: Cannot find annotation method 'justification()' in type 'SuppressWarnings'
  935. [ant:nb-javac] C:\Daniel\Programme\jmonkeyengine-master\jmonkeyengine\sdk\build\public-package-jars\org-netbeans-modules-java-source.jar(org/netbeans/api/java/source/SourceUtils.class): warning: Cannot find annotation method 'value()' in type 'SuppressWarnings'
  936. [ant:nb-javac] C:\Daniel\Programme\jmonkeyengine-master\jmonkeyengine\sdk\build\public-package-jars\org-netbeans-modules-java-source.jar(org/netbeans/api/java/source/SourceUtils.class): warning: Cannot find annotation method 'justification()' in type 'SuppressWarnings'
  937. [ant:nb-javac] C:\Daniel\Programme\jmonkeyengine-master\jmonkeyengine\sdk\jme3-core\src\com\jme3\gde\core\appstates\RunAppStateAction.java:81: warning: Should explicitly specify lazy attribute
  938. [ant:nb-javac] public class RunAppStateAction implements ContextAwareAction {
  939. [ant:nb-javac] ^
  940. [ant:nb-javac] C:\Daniel\Programme\jmonkeyengine-master\jmonkeyengine\sdk\jme3-core\src\com\jme3\gde\core\scene\controller\SceneToolController.java:14: warning: [deprecation] CharacterControl in com.jme3.bullet.control has been deprecated
  941. [ant:nb-javac] import com.jme3.bullet.control.CharacterControl;
  942. [ant:nb-javac] ^
  943. [ant:nb-javac] C:\Daniel\Programme\jmonkeyengine-master\jmonkeyengine\sdk\jme3-core\src\com\jme3\gde\core\sceneexplorer\nodes\JmeCharacterControl.java:35: warning: [deprecation] CharacterControl in com.jme3.bullet.control has been deprecated
  944. [ant:nb-javac] import com.jme3.bullet.control.CharacterControl;
  945. [ant:nb-javac] ^
  946. [ant:nb-javac] C:\Daniel\Programme\jmonkeyengine-master\jmonkeyengine\sdk\jme3-core\src\com\jme3\gde\core\sceneexplorer\nodes\actions\impl\NewCharacterAction.java:35: warning: [deprecation] CharacterControl in com.jme3.bullet.control has been deprecated
  947. [ant:nb-javac] import com.jme3.bullet.control.CharacterControl;
  948. [ant:nb-javac] ^
  949. [ant:nb-javac] C:\Daniel\Programme\jmonkeyengine-master\jmonkeyengine\sdk\build\public-package-jars\org-netbeans-modules-java-source.jar(org/netbeans/api/java/source/ClassIndex.class): warning: Cannot find annotation method 'value()' in type 'SuppressWarnings': class file for org.netbeans.api.annotations.common.SuppressWarnings not found
  950. [ant:nb-javac] C:\Daniel\Programme\jmonkeyengine-master\jmonkeyengine\sdk\build\public-package-jars\org-netbeans-modules-java-source.jar(org/netbeans/api/java/source/ClassIndex.class): warning: Cannot find annotation method 'justification()' in type 'SuppressWarnings'
  951. [ant:nb-javac] C:\Daniel\Programme\jmonkeyengine-master\jmonkeyengine\sdk\build\public-package-jars\org-netbeans-modules-java-source.jar(org/netbeans/api/java/source/ClassIndex.class): warning: Cannot find annotation method 'value()' in type 'SuppressWarnings'
  952. [ant:nb-javac] C:\Daniel\Programme\jmonkeyengine-master\jmonkeyengine\sdk\build\public-package-jars\org-netbeans-modules-java-source.jar(org/netbeans/api/java/source/ClassIndex.class): warning: Cannot find annotation method 'justification()' in type 'SuppressWarnings'
  953. [ant:nb-javac] C:\Daniel\Programme\jmonkeyengine-master\jmonkeyengine\sdk\build\public-package-jars\org-netbeans-modules-java-source.jar(org/netbeans/api/java/source/ClassIndex.class): warning: Cannot find annotation method 'value()' in type 'SuppressWarnings'
  954. [ant:nb-javac] C:\Daniel\Programme\jmonkeyengine-master\jmonkeyengine\sdk\build\public-package-jars\org-netbeans-modules-java-source.jar(org/netbeans/api/java/source/ClassIndex.class): warning: Cannot find annotation method 'justification()' in type 'SuppressWarnings'
  955. [ant:nb-javac] C:\Daniel\Programme\jmonkeyengine-master\jmonkeyengine\sdk\build\public-package-jars\org-netbeans-modules-java-source.jar(org/netbeans/api/java/source/SourceUtils.class): warning: Cannot find annotation method 'value()' in type 'SuppressWarnings'
  956. [ant:nb-javac] C:\Daniel\Programme\jmonkeyengine-master\jmonkeyengine\sdk\build\public-package-jars\org-netbeans-modules-java-source.jar(org/netbeans/api/java/source/SourceUtils.class): warning: Cannot find annotation method 'justification()' in type 'SuppressWarnings'
  957. [ant:nb-javac] C:\Daniel\Programme\jmonkeyengine-master\jmonkeyengine\sdk\build\public-package-jars\org-netbeans-modules-java-source.jar(org/netbeans/api/java/source/SourceUtils.class): warning: Cannot find annotation method 'value()' in type 'SuppressWarnings'
  958. [ant:nb-javac] C:\Daniel\Programme\jmonkeyengine-master\jmonkeyengine\sdk\build\public-package-jars\org-netbeans-modules-java-source.jar(org/netbeans/api/java/source/SourceUtils.class): warning: Cannot find annotation method 'justification()' in type 'SuppressWarnings'
  959. [ant:nb-javac] warning: No processor claimed any of these annotations: javax.annotation.Generated
  960. [ant:nb-javac] C:\Daniel\Programme\jmonkeyengine-master\jmonkeyengine\sdk\jme3-core\src\com\jme3\gde\core\scene\controller\SceneToolController.java:14: warning: [deprecation] CharacterControl in com.jme3.bullet.control has been deprecated
  961. [ant:nb-javac] import com.jme3.bullet.control.CharacterControl;
  962. [ant:nb-javac] ^
  963. [ant:nb-javac] C:\Daniel\Programme\jmonkeyengine-master\jmonkeyengine\sdk\jme3-core\src\com\jme3\gde\core\sceneexplorer\nodes\JmeCharacterControl.java:35: warning: [deprecation] CharacterControl in com.jme3.bullet.control has been deprecated
  964. [ant:nb-javac] import com.jme3.bullet.control.CharacterControl;
  965. [ant:nb-javac] ^
  966. [ant:nb-javac] C:\Daniel\Programme\jmonkeyengine-master\jmonkeyengine\sdk\jme3-core\src\com\jme3\gde\core\sceneexplorer\nodes\actions\impl\NewCharacterAction.java:35: warning: [deprecation] CharacterControl in com.jme3.bullet.control has been deprecated
  967. [ant:nb-javac] import com.jme3.bullet.control.CharacterControl;
  968. [ant:nb-javac] ^
  969. [ant:nb-javac] C:\Daniel\Programme\jmonkeyengine-master\jmonkeyengine\sdk\build\public-package-jars\org-netbeans-modules-java-source.jar(org/netbeans/api/java/source/ClassIndex.class): warning: Cannot find annotation method 'value()' in type 'SuppressWarnings': class file for org.netbeans.api.annotations.common.SuppressWarnings not found
  970. [ant:nb-javac] C:\Daniel\Programme\jmonkeyengine-master\jmonkeyengine\sdk\build\public-package-jars\org-netbeans-modules-java-source.jar(org/netbeans/api/java/source/ClassIndex.class): warning: Cannot find annotation method 'justification()' in type 'SuppressWarnings'
  971. [ant:nb-javac] C:\Daniel\Programme\jmonkeyengine-master\jmonkeyengine\sdk\build\public-package-jars\org-netbeans-modules-java-source.jar(org/netbeans/api/java/source/ClassIndex.class): warning: Cannot find annotation method 'value()' in type 'SuppressWarnings'
  972. [ant:nb-javac] C:\Daniel\Programme\jmonkeyengine-master\jmonkeyengine\sdk\build\public-package-jars\org-netbeans-modules-java-source.jar(org/netbeans/api/java/source/ClassIndex.class): warning: Cannot find annotation method 'justification()' in type 'SuppressWarnings'
  973. [ant:nb-javac] C:\Daniel\Programme\jmonkeyengine-master\jmonkeyengine\sdk\build\public-package-jars\org-netbeans-modules-java-source.jar(org/netbeans/api/java/source/ClassIndex.class): warning: Cannot find annotation method 'value()' in type 'SuppressWarnings'
  974. [ant:nb-javac] C:\Daniel\Programme\jmonkeyengine-master\jmonkeyengine\sdk\build\public-package-jars\org-netbeans-modules-java-source.jar(org/netbeans/api/java/source/ClassIndex.class): warning: Cannot find annotation method 'justification()' in type 'SuppressWarnings'
  975. [ant:nb-javac] C:\Daniel\Programme\jmonkeyengine-master\jmonkeyengine\sdk\build\public-package-jars\org-netbeans-modules-java-source.jar(org/netbeans/api/java/source/SourceUtils.class): warning: Cannot find annotation method 'value()' in type 'SuppressWarnings'
  976. [ant:nb-javac] C:\Daniel\Programme\jmonkeyengine-master\jmonkeyengine\sdk\build\public-package-jars\org-netbeans-modules-java-source.jar(org/netbeans/api/java/source/SourceUtils.class): warning: Cannot find annotation method 'justification()' in type 'SuppressWarnings'
  977. [ant:nb-javac] C:\Daniel\Programme\jmonkeyengine-master\jmonkeyengine\sdk\build\public-package-jars\org-netbeans-modules-java-source.jar(org/netbeans/api/java/source/SourceUtils.class): warning: Cannot find annotation method 'value()' in type 'SuppressWarnings'
  978. [ant:nb-javac] C:\Daniel\Programme\jmonkeyengine-master\jmonkeyengine\sdk\build\public-package-jars\org-netbeans-modules-java-source.jar(org/netbeans/api/java/source/SourceUtils.class): warning: Cannot find annotation method 'justification()' in type 'SuppressWarnings'
  979. [ant:nb-javac] C:\Daniel\Programme\jmonkeyengine-master\jmonkeyengine\sdk\jme3-core\src\com\jme3\gde\core\scene\controller\SceneToolController.java:14: warning: [deprecation] CharacterControl in com.jme3.bullet.control has been deprecated
  980. [ant:nb-javac] import com.jme3.bullet.control.CharacterControl;
  981. [ant:nb-javac] ^
  982. [ant:nb-javac] C:\Daniel\Programme\jmonkeyengine-master\jmonkeyengine\sdk\jme3-core\src\com\jme3\gde\core\sceneexplorer\nodes\JmeCharacterControl.java:35: warning: [deprecation] CharacterControl in com.jme3.bullet.control has been deprecated
  983. [ant:nb-javac] import com.jme3.bullet.control.CharacterControl;
  984. [ant:nb-javac] ^
  985. [ant:nb-javac] C:\Daniel\Programme\jmonkeyengine-master\jmonkeyengine\sdk\jme3-core\src\com\jme3\gde\core\sceneexplorer\nodes\actions\impl\NewCharacterAction.java:35: warning: [deprecation] CharacterControl in com.jme3.bullet.control has been deprecated
  986. [ant:nb-javac] import com.jme3.bullet.control.CharacterControl;
  987. [ant:nb-javac] ^
  988. [ant:nb-javac] C:\Daniel\Programme\jmonkeyengine-master\jmonkeyengine\sdk\build\public-package-jars\org-netbeans-modules-java-source.jar(org/netbeans/api/java/source/ClassIndex.class): warning: Cannot find annotation method 'value()' in type 'SuppressWarnings': class file for org.netbeans.api.annotations.common.SuppressWarnings not found
  989. [ant:nb-javac] C:\Daniel\Programme\jmonkeyengine-master\jmonkeyengine\sdk\build\public-package-jars\org-netbeans-modules-java-source.jar(org/netbeans/api/java/source/ClassIndex.class): warning: Cannot find annotation method 'justification()' in type 'SuppressWarnings'
  990. [ant:nb-javac] C:\Daniel\Programme\jmonkeyengine-master\jmonkeyengine\sdk\build\public-package-jars\org-netbeans-modules-java-source.jar(org/netbeans/api/java/source/ClassIndex.class): warning: Cannot find annotation method 'value()' in type 'SuppressWarnings'
  991. [ant:nb-javac] C:\Daniel\Programme\jmonkeyengine-master\jmonkeyengine\sdk\build\public-package-jars\org-netbeans-modules-java-source.jar(org/netbeans/api/java/source/ClassIndex.class): warning: Cannot find annotation method 'justification()' in type 'SuppressWarnings'
  992. [ant:nb-javac] C:\Daniel\Programme\jmonkeyengine-master\jmonkeyengine\sdk\build\public-package-jars\org-netbeans-modules-java-source.jar(org/netbeans/api/java/source/ClassIndex.class): warning: Cannot find annotation method 'value()' in type 'SuppressWarnings'
  993. [ant:nb-javac] C:\Daniel\Programme\jmonkeyengine-master\jmonkeyengine\sdk\build\public-package-jars\org-netbeans-modules-java-source.jar(org/netbeans/api/java/source/ClassIndex.class): warning: Cannot find annotation method 'justification()' in type 'SuppressWarnings'
  994. [ant:nb-javac] C:\Daniel\Programme\jmonkeyengine-master\jmonkeyengine\sdk\build\public-package-jars\org-netbeans-modules-java-source.jar(org/netbeans/api/java/source/SourceUtils.class): warning: Cannot find annotation method 'value()' in type 'SuppressWarnings'
  995. [ant:nb-javac] C:\Daniel\Programme\jmonkeyengine-master\jmonkeyengine\sdk\build\public-package-jars\org-netbeans-modules-java-source.jar(org/netbeans/api/java/source/SourceUtils.class): warning: Cannot find annotation method 'justification()' in type 'SuppressWarnings'
  996. [ant:nb-javac] C:\Daniel\Programme\jmonkeyengine-master\jmonkeyengine\sdk\build\public-package-jars\org-netbeans-modules-java-source.jar(org/netbeans/api/java/source/SourceUtils.class): warning: Cannot find annotation method 'value()' in type 'SuppressWarnings'
  997. [ant:nb-javac] C:\Daniel\Programme\jmonkeyengine-master\jmonkeyengine\sdk\build\public-package-jars\org-netbeans-modules-java-source.jar(org/netbeans/api/java/source/SourceUtils.class): warning: Cannot find annotation method 'justification()' in type 'SuppressWarnings'
  998. [ant:nb-javac] C:\Daniel\Programme\jmonkeyengine-master\jmonkeyengine\sdk\jme3-core\src\com\jme3\gde\core\assets\ProjectAssetManager.java:93: warning: [deprecation] DesktopAssetManager(boolean) in DesktopAssetManager has been deprecated
  999. [ant:nb-javac] super(true);
  1000. [ant:nb-javac] ^
  1001. [ant:nb-javac] C:\Daniel\Programme\jmonkeyengine-master\jmonkeyengine\sdk\jme3-core\src\com\jme3\gde\core\assets\ProjectAssetManager.java:111: warning: [deprecation] DesktopAssetManager(boolean) in DesktopAssetManager has been deprecated
  1002. [ant:nb-javac] super(true);
  1003. [ant:nb-javac] ^
  1004. [ant:nb-javac] C:\Daniel\Programme\jmonkeyengine-master\jmonkeyengine\sdk\jme3-core\src\com\jme3\gde\core\sceneexplorer\nodes\AbstractSceneExplorerNode.java:138: warning: [rawtypes] found raw type: SceneExplorerProperty
  1005. [ant:nb-javac] prop = new SceneExplorerProperty(getExplorerObjectClass().cast(obj), returntype, method, null);
  1006. [ant:nb-javac] ^
  1007. [ant:nb-javac] missing type arguments for generic class SceneExplorerProperty<T>
  1008. [ant:nb-javac] where T is a type-variable:
  1009. [ant:nb-javac] T extends Object declared in class SceneExplorerProperty
  1010. [ant:nb-javac] C:\Daniel\Programme\jmonkeyengine-master\jmonkeyengine\sdk\jme3-core\src\com\jme3\gde\core\sceneexplorer\nodes\AbstractSceneExplorerNode.java:150: warning: [rawtypes] found raw type: SceneExplorerProperty
  1011. [ant:nb-javac] prop = new SceneExplorerProperty(getExplorerObjectClass().cast(obj), returntype, method, null);
  1012. [ant:nb-javac] ^
  1013. [ant:nb-javac] missing type arguments for generic class SceneExplorerProperty<T>
  1014. [ant:nb-javac] where T is a type-variable:
  1015. [ant:nb-javac] T extends Object declared in class SceneExplorerProperty
  1016. [ant:nb-javac] C:\Daniel\Programme\jmonkeyengine-master\jmonkeyengine\sdk\jme3-core\src\com\jme3\gde\core\sceneexplorer\nodes\AbstractSceneExplorerNode.java:152: warning: [rawtypes] found raw type: SceneExplorerProperty
  1017. [ant:nb-javac] prop = new SceneExplorerProperty(getExplorerObjectClass().cast(obj), returntype, method, setter, this);
  1018. [ant:nb-javac] ^
  1019. [ant:nb-javac] missing type arguments for generic class SceneExplorerProperty<T>
  1020. [ant:nb-javac] where T is a type-variable:
  1021. [ant:nb-javac] T extends Object declared in class SceneExplorerProperty
  1022. [ant:nb-javac] C:\Daniel\Programme\jmonkeyengine-master\jmonkeyengine\sdk\jme3-core\src\com\jme3\gde\core\sceneexplorer\nodes\AbstractSceneExplorerNode.java:162: warning: [rawtypes] found raw type: Class
  1023. [ant:nb-javac] protected Property<?> makeEmbedProperty(Object obj, Class objectClass, Class returntype, String method, String setter, String name) {
  1024. [ant:nb-javac] ^
  1025. [ant:nb-javac] missing type arguments for generic class Class<T>
  1026. [ant:nb-javac] where T is a type-variable:
  1027. [ant:nb-javac] T extends Object declared in class Class
  1028. [ant:nb-javac] C:\Daniel\Programme\jmonkeyengine-master\jmonkeyengine\sdk\jme3-core\src\com\jme3\gde\core\sceneexplorer\nodes\AbstractSceneExplorerNode.java:162: warning: [rawtypes] found raw type: Class
  1029. [ant:nb-javac] protected Property<?> makeEmbedProperty(Object obj, Class objectClass, Class returntype, String method, String setter, String name) {
  1030. [ant:nb-javac] ^
  1031. [ant:nb-javac] missing type arguments for generic class Class<T>
  1032. [ant:nb-javac] where T is a type-variable:
  1033. [ant:nb-javac] T extends Object declared in class Class
  1034. [ant:nb-javac] C:\Daniel\Programme\jmonkeyengine-master\jmonkeyengine\sdk\jme3-core\src\com\jme3\gde\core\sceneexplorer\nodes\AbstractSceneExplorerNode.java:166: warning: [rawtypes] found raw type: SceneExplorerProperty
  1035. [ant:nb-javac] prop = new SceneExplorerProperty(objectClass.cast(obj), returntype, method, null);
  1036. [ant:nb-javac] ^
  1037. [ant:nb-javac] missing type arguments for generic class SceneExplorerProperty<T>
  1038. [ant:nb-javac] where T is a type-variable:
  1039. [ant:nb-javac] T extends Object declared in class SceneExplorerProperty
  1040. [ant:nb-javac] C:\Daniel\Programme\jmonkeyengine-master\jmonkeyengine\sdk\jme3-core\src\com\jme3\gde\core\sceneexplorer\nodes\AbstractSceneExplorerNode.java:168: warning: [rawtypes] found raw type: SceneExplorerProperty
  1041. [ant:nb-javac] prop = new SceneExplorerProperty(objectClass.cast(obj), returntype, method, setter, this);
  1042. [ant:nb-javac] ^
  1043. [ant:nb-javac] missing type arguments for generic class SceneExplorerProperty<T>
  1044. [ant:nb-javac] where T is a type-variable:
  1045. [ant:nb-javac] T extends Object declared in class SceneExplorerProperty
  1046. [ant:nb-javac] C:\Daniel\Programme\jmonkeyengine-master\jmonkeyengine\sdk\jme3-core\src\com\jme3\gde\core\sceneexplorer\nodes\AbstractSceneExplorerNode.java:219: warning: [rawtypes] found raw type: Class
  1047. [ant:nb-javac] public abstract Class getExplorerObjectClass();
  1048. [ant:nb-javac] ^
  1049. [ant:nb-javac] missing type arguments for generic class Class<T>
  1050. [ant:nb-javac] where T is a type-variable:
  1051. [ant:nb-javac] T extends Object declared in class Class
  1052. [ant:nb-javac] C:\Daniel\Programme\jmonkeyengine-master\jmonkeyengine\sdk\jme3-core\src\com\jme3\gde\core\scene\FakeApplication.java:242: warning: [deprecation] setAssetManager(AssetManager) in Application has been deprecated
  1053. [ant:nb-javac] public void setAssetManager(AssetManager assetManager) {
  1054. [ant:nb-javac] ^
  1055. [ant:nb-javac] C:\Daniel\Programme\jmonkeyengine-master\jmonkeyengine\sdk\jme3-core\src\com\jme3\gde\core\appstates\AppStateNode.java:163: warning: [rawtypes] found raw type: SceneExplorerProperty
  1056. [ant:nb-javac] prop = new SceneExplorerProperty(appState.getClass().cast(obj), returntype, method, null, this);
  1057. [ant:nb-javac] ^
  1058. [ant:nb-javac] missing type arguments for generic class SceneExplorerProperty<T>
  1059. [ant:nb-javac] where T is a type-variable:
  1060. [ant:nb-javac] T extends Object declared in class SceneExplorerProperty
  1061. [ant:nb-javac] C:\Daniel\Programme\jmonkeyengine-master\jmonkeyengine\sdk\jme3-core\src\com\jme3\gde\core\appstates\AppStateNode.java:163: warning: [unchecked] unchecked call to SceneExplorerProperty(T,Class,String,String,ScenePropertyChangeListener) as a member of the raw type SceneExplorerProperty
  1062. [ant:nb-javac] prop = new SceneExplorerProperty(appState.getClass().cast(obj), returntype, method, null, this);
  1063. [ant:nb-javac] ^
  1064. [ant:nb-javac] where T is a type-variable:
  1065. [ant:nb-javac] T extends Object declared in class SceneExplorerProperty
  1066. [ant:nb-javac] C:\Daniel\Programme\jmonkeyengine-master\jmonkeyengine\sdk\jme3-core\src\com\jme3\gde\core\appstates\AppStateNode.java:171: warning: [rawtypes] found raw type: Class
  1067. [ant:nb-javac] protected Property<?> makeProperty(Object obj, Class returntype, String method, String setter, String name) {
  1068. [ant:nb-javac] ^
  1069. [ant:nb-javac] missing type arguments for generic class Class<T>
  1070. [ant:nb-javac] where T is a type-variable:
  1071. [ant:nb-javac] T extends Object declared in class Class
  1072. [ant:nb-javac] C:\Daniel\Programme\jmonkeyengine-master\jmonkeyengine\sdk\jme3-core\src\com\jme3\gde\core\appstates\AppStateNode.java:174: warning: [rawtypes] found raw type: SceneExplorerProperty
  1073. [ant:nb-javac] prop = new SceneExplorerProperty(appState.getClass().cast(obj), returntype, method, setter, this);
  1074. [ant:nb-javac] ^
  1075. [ant:nb-javac] missing type arguments for generic class SceneExplorerProperty<T>
  1076. [ant:nb-javac] where T is a type-variable:
  1077. [ant:nb-javac] T extends Object declared in class SceneExplorerProperty
  1078. [ant:nb-javac] C:\Daniel\Programme\jmonkeyengine-master\jmonkeyengine\sdk\jme3-core\src\com\jme3\gde\core\appstates\AppStateNode.java:174: warning: [unchecked] unchecked call to SceneExplorerProperty(T,Class,String,String,ScenePropertyChangeListener) as a member of the raw type SceneExplorerProperty
  1079. [ant:nb-javac] prop = new SceneExplorerProperty(appState.getClass().cast(obj), returntype, method, setter, this);
  1080. [ant:nb-javac] ^
  1081. [ant:nb-javac] where T is a type-variable:
  1082. [ant:nb-javac] T extends Object declared in class SceneExplorerProperty
  1083. [ant:nb-javac] C:\Daniel\Programme\jmonkeyengine-master\jmonkeyengine\sdk\jme3-core\src\com\jme3\gde\core\appstates\AppStateNode.java:182: warning: [rawtypes] found raw type: Class
  1084. [ant:nb-javac] protected void createMethods(Class c, Sheet.Set set, Object obj) throws SecurityException {
  1085. [ant:nb-javac] ^
  1086. [ant:nb-javac] missing type arguments for generic class Class<T>
  1087. [ant:nb-javac] where T is a type-variable:
  1088. [ant:nb-javac] T extends Object declared in class Class
  1089. [ant:nb-javac] C:\Daniel\Programme\jmonkeyengine-master\jmonkeyengine\sdk\jme3-core\src\com\jme3\gde\core\appstates\AppStateNode.java:191: warning: [rawtypes] found raw type: Class
  1090. [ant:nb-javac] protected void createFields(Class c, Sheet.Set set, Object obj) throws SecurityException {
  1091. [ant:nb-javac] ^
  1092. [ant:nb-javac] missing type arguments for generic class Class<T>
  1093. [ant:nb-javac] where T is a type-variable:
  1094. [ant:nb-javac] T extends Object declared in class Class
  1095. [ant:nb-javac] C:\Daniel\Programme\jmonkeyengine-master\jmonkeyengine\sdk\jme3-core\src\com\jme3\gde\core\appstates\NewAppStateVisualPanel1.java:80: warning: [unchecked] unchecked call to setListData(E[]) as a member of the raw type JList
  1096. [ant:nb-javac] jList1.setListData(sources.toArray());
  1097. [ant:nb-javac] ^
  1098. [ant:nb-javac] where E is a type-variable:
  1099. [ant:nb-javac] E extends Object declared in class JList
  1100. [ant:nb-javac] C:\Daniel\Programme\jmonkeyengine-master\jmonkeyengine\sdk\jme3-core\src\com\jme3\gde\core\appstates\NewAppStateVisualPanel1.java:150: warning: [rawtypes] found raw type: JList
  1101. [ant:nb-javac] jList1 = new javax.swing.JList();
  1102. [ant:nb-javac] ^
  1103. [ant:nb-javac] missing type arguments for generic class JList<E>
  1104. [ant:nb-javac] where E is a type-variable:
  1105. [ant:nb-javac] E extends Object declared in class JList
  1106. [ant:nb-javac] C:\Daniel\Programme\jmonkeyengine-master\jmonkeyengine\sdk\jme3-core\src\com\jme3\gde\core\appstates\NewAppStateVisualPanel1.java:154: warning: [rawtypes] found raw type: AbstractListModel
  1107. [ant:nb-javac] jList1.setModel(new javax.swing.AbstractListModel() {
  1108. [ant:nb-javac] ^
  1109. [ant:nb-javac] missing type arguments for generic class AbstractListModel<E>
  1110. [ant:nb-javac] where E is a type-variable:
  1111. [ant:nb-javac] E extends Object declared in class AbstractListModel
  1112. [ant:nb-javac] C:\Daniel\Programme\jmonkeyengine-master\jmonkeyengine\sdk\jme3-core\src\com\jme3\gde\core\appstates\NewAppStateVisualPanel1.java:154: warning: [unchecked] unchecked call to setModel(ListModel<E>) as a member of the raw type JList
  1113. [ant:nb-javac] jList1.setModel(new javax.swing.AbstractListModel() {
  1114. [ant:nb-javac] ^
  1115. [ant:nb-javac] where E is a type-variable:
  1116. [ant:nb-javac] E extends Object declared in class JList
  1117. [ant:nb-javac] C:\Daniel\Programme\jmonkeyengine-master\jmonkeyengine\sdk\jme3-core\src\com\jme3\gde\core\appstates\NewAppStateVisualPanel1.java:204: warning: [rawtypes] found raw type: JList
  1118. [ant:nb-javac] private javax.swing.JList jList1;
  1119. [ant:nb-javac] ^
  1120. [ant:nb-javac] missing type arguments for generic class JList<E>
  1121. [ant:nb-javac] where E is a type-variable:
  1122. [ant:nb-javac] E extends Object declared in class JList
  1123. [ant:nb-javac] C:\Daniel\Programme\jmonkeyengine-master\jmonkeyengine\sdk\jme3-core\src\com\jme3\gde\core\appstates\NewAppStateWizardAction.java:71: warning: [unchecked] unchecked conversion
  1124. [ant:nb-javac] WizardDescriptor wizardDescriptor = new WizardDescriptor(getPanels());
  1125. [ant:nb-javac] ^
  1126. [ant:nb-javac] required: Panel<WizardDescriptor>[]
  1127. [ant:nb-javac] found: Panel[]
  1128. [ant:nb-javac] C:\Daniel\Programme\jmonkeyengine-master\jmonkeyengine\sdk\jme3-core\src\com\jme3\gde\core\appstates\NewAppStateWizardAction.java:99: warning: [rawtypes] found raw type: Class
  1129. [ant:nb-javac] Class clazz = null;
  1130. [ant:nb-javac] ^
  1131. [ant:nb-javac] missing type arguments for generic class Class<T>
  1132. [ant:nb-javac] where T is a type-variable:
  1133. [ant:nb-javac] T extends Object declared in class Class
  1134. [ant:nb-javac] C:\Daniel\Programme\jmonkeyengine-master\jmonkeyengine\sdk\jme3-core\src\com\jme3\gde\core\appstates\NewAppStateWizardAction.java:140: warning: [rawtypes] found raw type: Panel
  1135. [ant:nb-javac] panels = new WizardDescriptor.Panel[]{
  1136. [ant:nb-javac] ^
  1137. [ant:nb-javac] missing type arguments for generic class Panel<Data>
  1138. [ant:nb-javac] where Data is a type-variable:
  1139. [ant:nb-javac] Data extends Object declared in interface Panel
  1140. [ant:nb-javac] C:\Daniel\Programme\jmonkeyengine-master\jmonkeyengine\sdk\jme3-core\src\com\jme3\gde\core\appstates\NewAppStateWizardAction.java:94: warning: [cast] redundant cast to WizardDescriptor
  1141. [ant:nb-javac] WizardDescriptor wizardDescriptor = (WizardDescriptor) configuration;
  1142. [ant:nb-javac] ^
  1143. [ant:nb-javac] C:\Daniel\Programme\jmonkeyengine-master\jmonkeyengine\sdk\jme3-core\src\com\jme3\gde\core\appstates\NewAppStateWizardPanel1.java:40: warning: [rawtypes] found raw type: Panel
  1144. [ant:nb-javac] public class NewAppStateWizardPanel1 implements WizardDescriptor.Panel {
  1145. [ant:nb-javac] ^
  1146. [ant:nb-javac] missing type arguments for generic class Panel<Data>
  1147. [ant:nb-javac] where Data is a type-variable:
  1148. [ant:nb-javac] Data extends Object declared in interface Panel
  1149. [ant:nb-javac] C:\Daniel\Programme\jmonkeyengine-master\jmonkeyengine\sdk\jme3-core\src\com\jme3\gde\core\appstates\RunAppStateAction.java:191: warning: [rawtypes] found raw type: CancellableTask
  1150. [ant:nb-javac] CancellableTask task = new CancellableTask<CompilationController>() {
  1151. [ant:nb-javac] ^
  1152. [ant:nb-javac] missing type arguments for generic class CancellableTask<P>
  1153. [ant:nb-javac] where P is a type-variable:
  1154. [ant:nb-javac] P extends Object declared in interface CancellableTask
  1155. [ant:nb-javac] C:\Daniel\Programme\jmonkeyengine-master\jmonkeyengine\sdk\jme3-core\src\com\jme3\gde\core\appstates\RunAppStateAction.java:225: warning: [unchecked] unchecked conversion
  1156. [ant:nb-javac] src.runUserActionTask(task, true);
  1157. [ant:nb-javac] ^
  1158. [ant:nb-javac] required: Task<CompilationController>
  1159. [ant:nb-javac] found: CancellableTask
  1160. [ant:nb-javac] C:\Daniel\Programme\jmonkeyengine-master\jmonkeyengine\sdk\jme3-core\src\com\jme3\gde\core\assets\AssetData.java:110: warning: [rawtypes] found raw type: AssetKey
  1161. [ant:nb-javac] public void setAssetKey(AssetKey key) {
  1162. [ant:nb-javac] ^
  1163. [ant:nb-javac] missing type arguments for generic class AssetKey<T>
  1164. [ant:nb-javac] where T is a type-variable:
  1165. [ant:nb-javac] T extends Object declared in class AssetKey
  1166. [ant:nb-javac] C:\Daniel\Programme\jmonkeyengine-master\jmonkeyengine\sdk\jme3-core\src\com\jme3\gde\core\assets\AssetData.java:151: warning: [rawtypes] found raw type: AssetKey
  1167. [ant:nb-javac] public List<AssetKey> getAssetKeyList() {
  1168. [ant:nb-javac] ^
  1169. [ant:nb-javac] missing type arguments for generic class AssetKey<T>
  1170. [ant:nb-javac] where T is a type-variable:
  1171. [ant:nb-javac] T extends Object declared in class AssetKey
  1172. [ant:nb-javac] C:\Daniel\Programme\jmonkeyengine-master\jmonkeyengine\sdk\jme3-core\src\com\jme3\gde\core\assets\AssetData.java:155: warning: [rawtypes] found raw type: AssetKey
  1173. [ant:nb-javac] public List<AssetKey> getFailedList() {
  1174. [ant:nb-javac] ^
  1175. [ant:nb-javac] missing type arguments for generic class AssetKey<T>
  1176. [ant:nb-javac] where T is a type-variable:
  1177. [ant:nb-javac] T extends Object declared in class AssetKey
  1178. [ant:nb-javac] C:\Daniel\Programme\jmonkeyengine-master\jmonkeyengine\sdk\jme3-core\src\com\jme3\gde\core\assets\AssetDataObject.java:86: warning: [rawtypes] found raw type: AssetKey
  1179. [ant:nb-javac] protected final List<AssetKey> assetKeyList = new LinkedList<AssetKey>();
  1180. [ant:nb-javac] ^
  1181. [ant:nb-javac] missing type arguments for generic class AssetKey<T>
  1182. [ant:nb-javac] where T is a type-variable:
  1183. [ant:nb-javac] T extends Object declared in class AssetKey
  1184. [ant:nb-javac] C:\Daniel\Programme\jmonkeyengine-master\jmonkeyengine\sdk\jme3-core\src\com\jme3\gde\core\assets\AssetDataObject.java:86: warning: [rawtypes] found raw type: AssetKey
  1185. [ant:nb-javac] protected final List<AssetKey> assetKeyList = new LinkedList<AssetKey>();
  1186. [ant:nb-javac] ^
  1187. [ant:nb-javac] missing type arguments for generic class AssetKey<T>
  1188. [ant:nb-javac] where T is a type-variable:
  1189. [ant:nb-javac] T extends Object declared in class AssetKey
  1190. [ant:nb-javac] C:\Daniel\Programme\jmonkeyengine-master\jmonkeyengine\sdk\jme3-core\src\com\jme3\gde\core\assets\AssetDataObject.java:87: warning: [rawtypes] found raw type: AssetKey
  1191. [ant:nb-javac] protected final List<AssetKey> failedList = new LinkedList<AssetKey>();
  1192. [ant:nb-javac] ^
  1193. [ant:nb-javac] missing type arguments for generic class AssetKey<T>
  1194. [ant:nb-javac] where T is a type-variable:
  1195. [ant:nb-javac] T extends Object declared in class AssetKey
  1196. [ant:nb-javac] C:\Daniel\Programme\jmonkeyengine-master\jmonkeyengine\sdk\jme3-core\src\com\jme3\gde\core\assets\AssetDataObject.java:87: warning: [rawtypes] found raw type: AssetKey
  1197. [ant:nb-javac] protected final List<AssetKey> failedList = new LinkedList<AssetKey>();
  1198. [ant:nb-javac] ^
  1199. [ant:nb-javac] missing type arguments for generic class AssetKey<T>
  1200. [ant:nb-javac] where T is a type-variable:
  1201. [ant:nb-javac] T extends Object declared in class AssetKey
  1202. [ant:nb-javac] C:\Daniel\Programme\jmonkeyengine-master\jmonkeyengine\sdk\jme3-core\src\com\jme3\gde\core\assets\AssetDataObject.java:100: warning: [rawtypes] found raw type: AssetKey
  1203. [ant:nb-javac] protected AssetKey assetKey;
  1204. [ant:nb-javac] ^
  1205. [ant:nb-javac] missing type arguments for generic class AssetKey<T>
  1206. [ant:nb-javac] where T is a type-variable:
  1207. [ant:nb-javac] T extends Object declared in class AssetKey
  1208. [ant:nb-javac] C:\Daniel\Programme\jmonkeyengine-master\jmonkeyengine\sdk\jme3-core\src\com\jme3\gde\core\assets\AssetDataObject.java:257: warning: [rawtypes] found raw type: AssetKey
  1209. [ant:nb-javac] for (Iterator<AssetKey> it = assetKeyList.iterator(); it.hasNext();) {
  1210. [ant:nb-javac] ^
  1211. [ant:nb-javac] missing type arguments for generic class AssetKey<T>
  1212. [ant:nb-javac] where T is a type-variable:
  1213. [ant:nb-javac] T extends Object declared in class AssetKey
  1214. [ant:nb-javac] C:\Daniel\Programme\jmonkeyengine-master\jmonkeyengine\sdk\jme3-core\src\com\jme3\gde\core\assets\AssetDataObject.java:258: warning: [rawtypes] found raw type: AssetKey
  1215. [ant:nb-javac] AssetKey assetKey1 = it.next();
  1216. [ant:nb-javac] ^
  1217. [ant:nb-javac] missing type arguments for generic class AssetKey<T>
  1218. [ant:nb-javac] where T is a type-variable:
  1219. [ant:nb-javac] T extends Object declared in class AssetKey
  1220. [ant:nb-javac] C:\Daniel\Programme\jmonkeyengine-master\jmonkeyengine\sdk\jme3-core\src\com\jme3\gde\core\assets\AssetDataObject.java:308: warning: [rawtypes] found raw type: AssetKey
  1221. [ant:nb-javac] public synchronized void setAssetKeyData(AssetKey key) {
  1222. [ant:nb-javac] ^
  1223. [ant:nb-javac] missing type arguments for generic class AssetKey<T>
  1224. [ant:nb-javac] where T is a type-variable:
  1225. [ant:nb-javac] T extends Object declared in class AssetKey
  1226. [ant:nb-javac] C:\Daniel\Programme\jmonkeyengine-master\jmonkeyengine\sdk\jme3-core\src\com\jme3\gde\core\assets\AssetDataObject.java:336: warning: [rawtypes] found raw type: AssetKey
  1227. [ant:nb-javac] public synchronized List<AssetKey> getAssetKeyList() {
  1228. [ant:nb-javac] ^
  1229. [ant:nb-javac] missing type arguments for generic class AssetKey<T>
  1230. [ant:nb-javac] where T is a type-variable:
  1231. [ant:nb-javac] T extends Object declared in class AssetKey
  1232. [ant:nb-javac] C:\Daniel\Programme\jmonkeyengine-master\jmonkeyengine\sdk\jme3-core\src\com\jme3\gde\core\assets\AssetDataObject.java:337: warning: [rawtypes] found raw type: AssetKey
  1233. [ant:nb-javac] return new LinkedList<AssetKey>(assetKeyList);
  1234. [ant:nb-javac] ^
  1235. [ant:nb-javac] missing type arguments for generic class AssetKey<T>
  1236. [ant:nb-javac] where T is a type-variable:
  1237. [ant:nb-javac] T extends Object declared in class AssetKey
  1238. [ant:nb-javac] C:\Daniel\Programme\jmonkeyengine-master\jmonkeyengine\sdk\jme3-core\src\com\jme3\gde\core\assets\AssetDataObject.java:347: warning: [rawtypes] found raw type: AssetKey
  1239. [ant:nb-javac] public synchronized List<AssetKey> getFailedList() {
  1240. [ant:nb-javac] ^
  1241. [ant:nb-javac] missing type arguments for generic class AssetKey<T>
  1242. [ant:nb-javac] where T is a type-variable:
  1243. [ant:nb-javac] T extends Object declared in class AssetKey
  1244. [ant:nb-javac] C:\Daniel\Programme\jmonkeyengine-master\jmonkeyengine\sdk\jme3-core\src\com\jme3\gde\core\assets\AssetDataObject.java:348: warning: [rawtypes] found raw type: AssetKey
  1245. [ant:nb-javac] return new LinkedList<AssetKey>(failedList);
  1246. [ant:nb-javac] ^
  1247. [ant:nb-javac] missing type arguments for generic class AssetKey<T>
  1248. [ant:nb-javac] where T is a type-variable:
  1249. [ant:nb-javac] T extends Object declared in class AssetKey
  1250. [ant:nb-javac] Note: Some input files additionally use or override a deprecated API.
  1251. [ant:nb-javac] Note: Some input files additionally use unchecked or unsafe operations.
  1252. [ant:nb-javac] 100 warnings
  1253. [ant:nb-javac] warning: [options] bootstrap class path not set in conjunction with -source 1.5
  1254. [ant:nb-javac] 1 warning
  1255. [ant:nb-javac] warning: [path] bad path element "C:\Daniel\Programme\jmonkeyengine-master\jmonkeyengine\sdk\jme3-gui\release\modules\ext\lib\eventbus.jar": no such file or directory
  1256. [ant:nb-javac] warning: [path] bad path element "C:\Daniel\Programme\jmonkeyengine-master\jmonkeyengine\sdk\jme3-gui\release\modules\ext\lib\nifty-default-controls-javadoc.jar": no such file or directory
  1257. [ant:nb-javac] warning: [path] bad path element "C:\Daniel\Programme\jmonkeyengine-master\jmonkeyengine\sdk\jme3-gui\release\modules\ext\lib\nifty-default-controls.jar": no such file or directory
  1258. [ant:nb-javac] warning: [path] bad path element "C:\Daniel\Programme\jmonkeyengine-master\jmonkeyengine\sdk\jme3-gui\release\modules\ext\lib\nifty-examples-javadoc.jar": no such file or directory
  1259. [ant:nb-javac] warning: [path] bad path element "C:\Daniel\Programme\jmonkeyengine-master\jmonkeyengine\sdk\jme3-gui\release\modules\ext\lib\nifty-examples.jar": no such file or directory
  1260. [ant:nb-javac] warning: [path] bad path element "C:\Daniel\Programme\jmonkeyengine-master\jmonkeyengine\sdk\jme3-gui\release\modules\ext\lib\nifty-javadoc.jar": no such file or directory
  1261. [ant:nb-javac] warning: [path] bad path element "C:\Daniel\Programme\jmonkeyengine-master\jmonkeyengine\sdk\jme3-gui\release\modules\ext\lib\nifty-style-black.jar": no such file or directory
  1262. [ant:nb-javac] warning: [path] bad path element "C:\Daniel\Programme\jmonkeyengine-master\jmonkeyengine\sdk\jme3-gui\release\modules\ext\lib\nifty.jar": no such file or directory
  1263. [ant:nb-javac] warning: [path] bad path element "C:\Daniel\Programme\jmonkeyengine-master\jmonkeyengine\sdk\jme3-gui\release\modules\ext\lib\xmlpull-xpp3.jar": no such file or directory
  1264. [ant:nb-javac] warning: [options] bootstrap class path not set in conjunction with -source 1.5
  1265. [ant:nb-javac] C:\Daniel\Programme\jmonkeyengine-master\jmonkeyengine\sdk\jme3-gui\src\com\jme3\gde\gui\nodes\GElementNode.java:25: warning: BoolEditor is internal proprietary API and may be removed in a future release
  1266. [ant:nb-javac] import sun.beans.editors.BoolEditor;
  1267. [ant:nb-javac] ^
  1268. [ant:nb-javac] C:\Daniel\Programme\jmonkeyengine-master\jmonkeyengine\sdk\jme3-gui\src\com\jme3\gde\gui\nodes\GElementNode.java:26: warning: BooleanEditor is internal proprietary API and may be removed in a future release
  1269. [ant:nb-javac] import sun.beans.editors.BooleanEditor;
  1270. [ant:nb-javac] ^
  1271. [ant:nb-javac] C:\Daniel\Programme\jmonkeyengine-master\jmonkeyengine\sdk\jme3-gui\src\com\jme3\gde\gui\view\NiftyGuiVisualElement.java:72: warning: Log is internal proprietary API and may be removed in a future release
  1272. [ant:nb-javac] import sun.rmi.runtime.Log;
  1273. [ant:nb-javac] ^
  1274. [ant:nb-javac]
  1275. [ant:nb-javac]
  1276. [ant:nb-javac] An annotation processor threw an uncaught exception.
  1277. [ant:nb-javac] Consult the following stack trace for details.
  1278. [ant:nb-javac] java.lang.NullPointerException
  1279. [ant:nb-javac] at org.netbeans.modules.openide.filesystems.declmime.MIMEResolverProcessor.handleProcess(MIMEResolverProcessor.java:92)
  1280. [ant:nb-javac] at org.openide.filesystems.annotations.LayerGeneratingProcessor.process(LayerGeneratingProcessor.java:121)
  1281. [ant:nb-javac] at com.sun.tools.javac.processing.JavacProcessingEnvironment.callProcessor(JavacProcessingEnvironment.java:793)
  1282. [ant:nb-javac] at com.sun.tools.javac.processing.JavacProcessingEnvironment.discoverAndRunProcs(JavacProcessingEnvironment.java:722)
  1283. [ant:nb-javac] at com.sun.tools.javac.processing.JavacProcessingEnvironment.access$1700(JavacProcessingEnvironment.java:97)
  1284. [ant:nb-javac] at com.sun.tools.javac.processing.JavacProcessingEnvironment$Round.run(JavacProcessingEnvironment.java:1029)
  1285. [ant:nb-javac] at com.sun.tools.javac.processing.JavacProcessingEnvironment.doProcessing(JavacProcessingEnvironment.java:1163)
  1286. [ant:nb-javac] at com.sun.tools.javac.main.JavaCompiler.processAnnotations(JavaCompiler.java:1108)
  1287. [ant:nb-javac] at com.sun.tools.javac.main.JavaCompiler.compile(JavaCompiler.java:824)
  1288. [ant:nb-javac] at com.sun.tools.javac.main.Main.compile(Main.java:439)
  1289. [ant:nb-javac] at com.sun.tools.javac.main.Main.compile(Main.java:353)
  1290. [ant:nb-javac] at com.sun.tools.javac.main.Main.compile(Main.java:342)
  1291. [ant:nb-javac] at com.sun.tools.javac.main.Main.compile(Main.java:333)
  1292. [ant:nb-javac] at com.sun.tools.javac.Main.compile(Main.java:76)
  1293. [ant:nb-javac] at sun.reflect.GeneratedMethodAccessor514.invoke(Unknown Source)
  1294. [ant:nb-javac] at sun.reflect.DelegatingMethodAccessorImpl.invoke(DelegatingMethodAccessorImpl.java:43)
  1295. [ant:nb-javac] at java.lang.reflect.Method.invoke(Method.java:606)
  1296. [ant:nb-javac] at org.apache.tools.ant.taskdefs.compilers.Javac13.execute(Javac13.java:56)
  1297. [ant:nb-javac] at org.apache.tools.ant.taskdefs.Javac.compile(Javac.java:1153)
  1298. [ant:nb-javac] at org.netbeans.nbbuild.CustomJavac.compile(CustomJavac.java:124)
  1299. [ant:nb-javac] at org.apache.tools.ant.taskdefs.Javac.execute(Javac.java:930)
  1300. [ant:nb-javac] at org.netbeans.nbbuild.CustomJavac.execute(CustomJavac.java:105)
  1301. [ant:nb-javac] at org.apache.tools.ant.UnknownElement.execute(UnknownElement.java:292)
  1302. [ant:nb-javac] at sun.reflect.GeneratedMethodAccessor216.invoke(Unknown Source)
  1303. [ant:nb-javac] at sun.reflect.DelegatingMethodAccessorImpl.invoke(DelegatingMethodAccessorImpl.java:43)
  1304. [ant:nb-javac] at java.lang.reflect.Method.invoke(Method.java:606)
  1305. [ant:nb-javac] at org.apache.tools.ant.dispatch.DispatchUtils.execute(DispatchUtils.java:106)
  1306. [ant:nb-javac] at org.apache.tools.ant.Task.perform(Task.java:348)
  1307. [ant:nb-javac] at org.apache.tools.ant.Target.execute(Target.java:435)
  1308. [ant:nb-javac] at org.apache.tools.ant.Target.performTasks(Target.java:456)
  1309. [ant:nb-javac] at org.apache.tools.ant.Project.executeSortedTargets(Project.java:1393)
  1310. [ant:nb-javac] at org.apache.tools.ant.helper.SingleCheckExecutor.executeTargets(SingleCheckExecutor.java:38)
  1311. [ant:nb-javac] at org.apache.tools.ant.Project.executeTargets(Project.java:1248)
  1312. [ant:nb-javac] at org.apache.tools.ant.taskdefs.Ant.execute(Ant.java:440)
  1313. [ant:nb-javac] at org.apache.tools.ant.taskdefs.SubAnt.execute(SubAnt.java:306)
  1314. [ant:nb-javac] at org.apache.tools.ant.taskdefs.SubAnt.execute(SubAnt.java:221)
  1315. [ant:nb-javac] at org.apache.tools.ant.UnknownElement.execute(UnknownElement.java:292)
  1316. [ant:nb-javac] at sun.reflect.GeneratedMethodAccessor216.invoke(Unknown Source)
  1317. [ant:nb-javac] at sun.reflect.DelegatingMethodAccessorImpl.invoke(DelegatingMethodAccessorImpl.java:43)
  1318. [ant:nb-javac] at java.lang.reflect.Method.invoke(Method.java:606)
  1319. [ant:nb-javac] at org.apache.tools.ant.dispatch.DispatchUtils.execute(DispatchUtils.java:106)
  1320. [ant:nb-javac] at org.apache.tools.ant.Task.perform(Task.java:348)
  1321. [ant:nb-javac] at org.apache.tools.ant.Target.execute(Target.java:435)
  1322. [ant:nb-javac] at org.apache.tools.ant.Target.performTasks(Target.java:456)
  1323. [ant:nb-javac] at org.apache.tools.ant.Project.executeSortedTargets(Project.java:1393)
  1324. [ant:nb-javac] at org.apache.tools.ant.helper.SingleCheckExecutor.executeTargets(SingleCheckExecutor.java:38)
  1325. [ant:nb-javac] at org.apache.tools.ant.Project.executeTargets(Project.java:1248)
  1326. [ant:nb-javac] at org.apache.tools.ant.taskdefs.Ant.execute(Ant.java:440)
  1327. [ant:nb-javac] at org.apache.tools.ant.UnknownElement.execute(UnknownElement.java:292)
  1328. [ant:nb-javac] at sun.reflect.GeneratedMethodAccessor216.invoke(Unknown Source)
  1329. [ant:nb-javac] at sun.reflect.DelegatingMethodAccessorImpl.invoke(DelegatingMethodAccessorImpl.java:43)
  1330. [ant:nb-javac] at java.lang.reflect.Method.invoke(Method.java:606)
  1331. [ant:nb-javac] at org.apache.tools.ant.dispatch.DispatchUtils.execute(DispatchUtils.java:106)
  1332. [ant:nb-javac] at groovy.util.AntBuilder.performTask(AntBuilder.java:260)
  1333. [ant:nb-javac] at groovy.util.AntBuilder.nodeCompleted(AntBuilder.java:220)
  1334. [ant:nb-javac] at org.gradle.api.internal.project.ant.BasicAntBuilder.nodeCompleted(BasicAntBuilder.java:71)
  1335. [ant:nb-javac] at groovy.util.BuilderSupport.doInvokeMethod(BuilderSupport.java:147)
  1336. [ant:nb-javac] at groovy.util.AntBuilder.doInvokeMethod(AntBuilder.java:170)
  1337. [ant:nb-javac] at org.gradle.api.internal.project.ant.BasicAntBuilder.doInvokeMethod(BasicAntBuilder.java:86)
  1338. [ant:nb-javac] at groovy.util.BuilderSupport.invokeMethod(BuilderSupport.java:64)
  1339. [ant:nb-javac] at org.codehaus.groovy.runtime.callsite.PogoMetaClassSite.call(PogoMetaClassSite.java:45)
  1340. [ant:nb-javac] at org.codehaus.groovy.runtime.callsite.CallSiteArray.defaultCall(CallSiteArray.java:42)
  1341. [ant:nb-javac] at org.codehaus.groovy.runtime.callsite.AbstractCallSite.call(AbstractCallSite.java:108)
  1342. [ant:nb-javac] at org.codehaus.groovy.runtime.callsite.AbstractCallSite.call(AbstractCallSite.java:116)
  1343. [ant:nb-javac] at build_6jl3dnudtmui1due76al4l6o3d$_run_closure10.doCall(C:\Daniel\Programme\jmonkeyengine-master\jmonkeyengine\sdk\build.gradle:399)
  1344. [ant:nb-javac] at sun.reflect.NativeMethodAccessorImpl.invoke0(Native Method)
  1345. [ant:nb-javac] at sun.reflect.NativeMethodAccessorImpl.invoke(NativeMethodAccessorImpl.java:57)
  1346. [ant:nb-javac] at sun.reflect.DelegatingMethodAccessorImpl.invoke(DelegatingMethodAccessorImpl.java:43)
  1347. [ant:nb-javac] at java.lang.reflect.Method.invoke(Method.java:606)
  1348. [ant:nb-javac] at org.codehaus.groovy.reflection.CachedMethod.invoke(CachedMethod.java:90)
  1349. [ant:nb-javac] at groovy.lang.MetaMethod.doMethodInvoke(MetaMethod.java:233)
  1350. [ant:nb-javac] at org.codehaus.groovy.runtime.metaclass.ClosureMetaClass.invokeMethod(ClosureMetaClass.java:272)
  1351. [ant:nb-javac] at groovy.lang.MetaClassImpl.invokeMethod(MetaClassImpl.java:877)
  1352. [ant:nb-javac] at groovy.lang.Closure.call(Closure.java:412)
  1353. [ant:nb-javac] at groovy.lang.Closure.call(Closure.java:425)
  1354. [ant:nb-javac] at org.gradle.api.internal.AbstractTask$ClosureTaskAction.execute(AbstractTask.java:502)
  1355. [ant:nb-javac] at org.gradle.api.internal.AbstractTask$ClosureTaskAction.execute(AbstractTask.java:483)
  1356. [ant:nb-javac] at org.gradle.api.internal.tasks.TaskStatusNagger$1.execute(TaskStatusNagger.java:77)
  1357. [ant:nb-javac] at org.gradle.api.internal.tasks.TaskStatusNagger$1.execute(TaskStatusNagger.java:73)
  1358. [ant:nb-javac] at org.gradle.api.internal.tasks.execution.ExecuteActionsTaskExecuter.executeAction(ExecuteActionsTaskExecuter.java:80)
  1359. [ant:nb-javac] at org.gradle.api.internal.tasks.execution.ExecuteActionsTaskExecuter.executeActions(ExecuteActionsTaskExecuter.java:61)
  1360. [ant:nb-javac] at org.gradle.api.internal.tasks.execution.ExecuteActionsTaskExecuter.execute(ExecuteActionsTaskExecuter.java:46)
  1361. [ant:nb-javac] at org.gradle.api.internal.tasks.execution.PostExecutionAnalysisTaskExecuter.execute(PostExecutionAnalysisTaskExecuter.java:35)
  1362. [ant:nb-javac] at org.gradle.api.internal.tasks.execution.SkipUpToDateTaskExecuter.execute(SkipUpToDateTaskExecuter.java:64)
  1363. [ant:nb-javac] at org.gradle.api.internal.tasks.execution.ValidatingTaskExecuter.execute(ValidatingTaskExecuter.java:58)
  1364. [ant:nb-javac] at org.gradle.api.internal.tasks.execution.SkipEmptySourceFilesTaskExecuter.execute(SkipEmptySourceFilesTaskExecuter.java:42)
  1365. [ant:nb-javac] at org.gradle.api.internal.tasks.execution.SkipTaskWithNoActionsExecuter.execute(SkipTaskWithNoActionsExecuter.java:52)
  1366. [ant:nb-javac] at org.gradle.api.internal.tasks.execution.SkipOnlyIfTaskExecuter.execute(SkipOnlyIfTaskExecuter.java:53)
  1367. [ant:nb-javac] at org.gradle.api.internal.tasks.execution.ExecuteAtMostOnceTaskExecuter.execute(ExecuteAtMostOnceTaskExecuter.java:43)
  1368. [ant:nb-javac] at org.gradle.api.internal.AbstractTask.executeWithoutThrowingTaskFailure(AbstractTask.java:289)
  1369. [ant:nb-javac] at org.gradle.execution.taskgraph.AbstractTaskPlanExecutor$TaskExecutorWorker.executeTask(AbstractTaskPlanExecutor.java:79)
  1370. [ant:nb-javac] at org.gradle.execution.taskgraph.AbstractTaskPlanExecutor$TaskExecutorWorker.processTask(AbstractTaskPlanExecutor.java:63)
  1371. [ant:nb-javac] at org.gradle.execution.taskgraph.AbstractTaskPlanExecutor$TaskExecutorWorker.run(AbstractTaskPlanExecutor.java:51)
  1372. [ant:nb-javac] at org.gradle.execution.taskgraph.DefaultTaskPlanExecutor.process(DefaultTaskPlanExecutor.java:23)
  1373. [ant:nb-javac] at org.gradle.execution.taskgraph.DefaultTaskGraphExecuter.execute(DefaultTaskGraphExecuter.java:86)
  1374. [ant:nb-javac] at org.gradle.execution.SelectedTaskExecutionAction.execute(SelectedTaskExecutionAction.java:29)
  1375. [ant:nb-javac] at org.gradle.execution.DefaultBuildExecuter.execute(DefaultBuildExecuter.java:61)
  1376. [ant:nb-javac] at org.gradle.execution.DefaultBuildExecuter.access$200(DefaultBuildExecuter.java:23)
  1377. [ant:nb-javac] at org.gradle.execution.DefaultBuildExecuter$2.proceed(DefaultBuildExecuter.java:67)
  1378. [ant:nb-javac] at org.gradle.execution.DryRunBuildExecutionAction.execute(DryRunBuildExecutionAction.java:32)
  1379. [ant:nb-javac] at org.gradle.execution.DefaultBuildExecuter.execute(DefaultBuildExecuter.java:61)
  1380. [ant:nb-javac] at org.gradle.execution.DefaultBuildExecuter.execute(DefaultBuildExecuter.java:54)
  1381. [ant:nb-javac] at org.gradle.initialization.DefaultGradleLauncher.doBuildStages(DefaultGradleLauncher.java:166)
  1382. [ant:nb-javac] at org.gradle.initialization.DefaultGradleLauncher.doBuild(DefaultGradleLauncher.java:113)
  1383. [ant:nb-javac] at org.gradle.initialization.DefaultGradleLauncher.run(DefaultGradleLauncher.java:81)
  1384. [ant:nb-javac] at org.gradle.launcher.exec.InProcessBuildActionExecuter$DefaultBuildController.run(InProcessBuildActionExecuter.java:64)
  1385. [ant:nb-javac] at org.gradle.tooling.internal.provider.BuildModelAction.run(BuildModelAction.java:76)
  1386. [ant:nb-javac] at org.gradle.tooling.internal.provider.BuildModelAction.run(BuildModelAction.java:31)
  1387. [ant:nb-javac] at org.gradle.tooling.internal.provider.ConfiguringBuildAction.run(ConfiguringBuildAction.java:150)
  1388. [ant:nb-javac] at org.gradle.launcher.exec.InProcessBuildActionExecuter.execute(InProcessBuildActionExecuter.java:35)
  1389. [ant:nb-javac] at org.gradle.launcher.daemon.server.exec.ExecuteBuild.doBuild(ExecuteBuild.java:45)
  1390. [ant:nb-javac] at org.gradle.launcher.daemon.server.exec.BuildCommandOnly.execute(BuildCommandOnly.java:34)
  1391. [ant:nb-javac] at org.gradle.launcher.daemon.server.exec.DaemonCommandExecution.proceed(DaemonCommandExecution.java:125)
  1392. [ant:nb-javac] at org.gradle.launcher.daemon.server.exec.WatchForDisconnection.execute(WatchForDisconnection.java:42)
  1393. [ant:nb-javac] at org.gradle.launcher.daemon.server.exec.DaemonCommandExecution.proceed(DaemonCommandExecution.java:125)
  1394. [ant:nb-javac] at org.gradle.launcher.daemon.server.exec.ResetDeprecationLogger.execute(ResetDeprecationLogger.java:24)
  1395. [ant:nb-javac] at org.gradle.launcher.daemon.server.exec.DaemonCommandExecution.proceed(DaemonCommandExecution.java:125)
  1396. [ant:nb-javac] at org.gradle.launcher.daemon.server.exec.StartStopIfBuildAndStop.execute(StartStopIfBuildAndStop.java:33)
  1397. [ant:nb-javac] at org.gradle.launcher.daemon.server.exec.DaemonCommandExecution.proceed(DaemonCommandExecution.java:125)
  1398. [ant:nb-javac] at org.gradle.launcher.daemon.server.exec.ReturnResult.execute(ReturnResult.java:34)
  1399. [ant:nb-javac] at org.gradle.launcher.daemon.server.exec.DaemonCommandExecution.proceed(DaemonCommandExecution.java:125)
  1400. [ant:nb-javac] at org.gradle.launcher.daemon.server.exec.ForwardClientInput$2.call(ForwardClientInput.java:71)
  1401. [ant:nb-javac] at org.gradle.launcher.daemon.server.exec.ForwardClientInput$2.call(ForwardClientInput.java:69)
  1402. [ant:nb-javac] at org.gradle.util.Swapper.swap(Swapper.java:38)
  1403. [ant:nb-javac] at org.gradle.launcher.daemon.server.exec.ForwardClientInput.execute(ForwardClientInput.java:69)
  1404. [ant:nb-javac] at org.gradle.launcher.daemon.server.exec.DaemonCommandExecution.proceed(DaemonCommandExecution.java:125)
  1405. [ant:nb-javac] at org.gradle.launcher.daemon.server.exec.LogToClient.doBuild(LogToClient.java:60)
  1406. [ant:nb-javac] at org.gradle.launcher.daemon.server.exec.BuildCommandOnly.execute(BuildCommandOnly.java:34)
  1407. [ant:nb-javac] at org.gradle.launcher.daemon.server.exec.DaemonCommandExecution.proceed(DaemonCommandExecution.java:125)
  1408. [ant:nb-javac] at org.gradle.launcher.daemon.server.exec.EstablishBuildEnvironment.doBuild(EstablishBuildEnvironment.java:60)
  1409. [ant:nb-javac] at org.gradle.launcher.daemon.server.exec.BuildCommandOnly.execute(BuildCommandOnly.java:34)
  1410. [ant:nb-javac] at org.gradle.launcher.daemon.server.exec.DaemonCommandExecution.proceed(DaemonCommandExecution.java:125)
  1411. [ant:nb-javac] at org.gradle.launcher.daemon.server.exec.StartBuildOrRespondWithBusy$1.run(StartBuildOrRespondWithBusy.java:45)
  1412. [ant:nb-javac] at org.gradle.launcher.daemon.server.DaemonStateCoordinator.runCommand(DaemonStateCoordinator.java:186)
  1413. [ant:nb-javac] at org.gradle.launcher.daemon.server.exec.StartBuildOrRespondWithBusy.doBuild(StartBuildOrRespondWithBusy.java:49)
  1414. [ant:nb-javac] at org.gradle.launcher.daemon.server.exec.BuildCommandOnly.execute(BuildCommandOnly.java:34)
  1415. [ant:nb-javac] at org.gradle.launcher.daemon.server.exec.DaemonCommandExecution.proceed(DaemonCommandExecution.java:125)
  1416. [ant:nb-javac] at org.gradle.launcher.daemon.server.exec.HandleStop.execute(HandleStop.java:36)
  1417. [ant:nb-javac] at org.gradle.launcher.daemon.server.exec.DaemonCommandExecution.proceed(DaemonCommandExecution.java:125)
  1418. [ant:nb-javac] at org.gradle.launcher.daemon.server.exec.DaemonHygieneAction.execute(DaemonHygieneAction.java:39)
  1419. [ant:nb-javac] at org.gradle.launcher.daemon.server.exec.DaemonCommandExecution.proceed(DaemonCommandExecution.java:125)
  1420. [ant:nb-javac] at org.gradle.launcher.daemon.server.exec.CatchAndForwardDaemonFailure.execute(CatchAndForwardDaemonFailure.java:32)
  1421. [ant:nb-javac] at org.gradle.launcher.daemon.server.exec.DaemonCommandExecution.proceed(DaemonCommandExecution.java:125)
  1422. [ant:nb-javac] at org.gradle.launcher.daemon.server.exec.DefaultDaemonCommandExecuter.executeCommand(DefaultDaemonCommandExecuter.java:51)
  1423. [ant:nb-javac] at org.gradle.launcher.daemon.server.DefaultIncomingConnectionHandler$ConnectionWorker.handleCommand(DefaultIncomingConnectionHandler.java:155)
  1424. [ant:nb-javac] at org.gradle.launcher.daemon.server.DefaultIncomingConnectionHandler$ConnectionWorker.receiveAndHandleCommand(DefaultIncomingConnectionHandler.java:128)
  1425. [ant:nb-javac] at org.gradle.launcher.daemon.server.DefaultIncomingConnectionHandler$ConnectionWorker.run(DefaultIncomingConnectionHandler.java:116)
  1426. [ant:nb-javac] at org.gradle.internal.concurrent.DefaultExecutorFactory$StoppableExecutorImpl$1.run(DefaultExecutorFactory.java:64)
  1427. [ant:nb-javac] at java.util.concurrent.ThreadPoolExecutor.runWorker(ThreadPoolExecutor.java:1145)
  1428. [ant:nb-javac] at java.util.concurrent.ThreadPoolExecutor$Worker.run(ThreadPoolExecutor.java:615)
  1429. [ant:nb-javac] at java.lang.Thread.run(Thread.java:745)
  1430. :sdk:buildSdk FAILED
  1431.  
  1432. FAILURE: Build failed with an exception.
  1433.  
  1434. * Where:
  1435. Build file 'C:\Daniel\Programme\jmonkeyengine-master\jmonkeyengine\sdk\build.gradle' line: 399
  1436.  
  1437. * What went wrong:
  1438. Execution failed for task ':sdk:buildSdk'.
  1439. > The following error occurred while executing this line:
  1440. C:\Daniel\Programme\jmonkeyengine-master\jmonkeyengine\netbeans\harness\suite.xml:187: The following error occurred while executing this line:
  1441. C:\Daniel\Programme\jmonkeyengine-master\jmonkeyengine\netbeans\harness\common.xml:217: Compile failed; see the compiler error output for details.
  1442.  
  1443. * Try:
  1444. Run with --stacktrace option to get the stack trace. Run with --info or --debug option to get more log output.
  1445.  
  1446. BUILD FAILED
  1447.  
  1448. Total time: 2 mins 25.575 secs
  1449.  
  1450.  
  1451.  
  1452. Build failure (see the Notifications window for stacktrace): gradle clean build
Advertisement
Add Comment
Please, Sign In to add comment