Guest User

lighterthief nattrace

a guest
Mar 14th, 2015
282
0
Never
Not a member of Pastebin yet? Sign Up, it unlocks many cool features!
text 2.08 KB | None | 0 0
  1. NATTrace report (v1.01)
  2.  
  3. Generated: 14/03/2015 20:31:39 (14/03/2015 20:31:39 UTC)
  4. Hostname: lighterthief-PC
  5. adapter: Realtek RTL8168D/8111D Family PCI-E GBE NIC #2
  6. addresses: fe80::848c:4cfa:b81:7644%9, 192.168.0.4
  7. gateway: 192.168.0.1
  8. adapter: Realtek RTL8168D/8111D Family PCI-E GBE NIC
  9. addresses: fe80::9bf:4f35:dd40:c1f1%8, 169.254.193.241
  10. gateway: 0.0.0.0
  11. adapter: Software Loopback Interface 1
  12. adapter: isatap.{D9557B9B-1CC4-4F85-8479-20A0A6851239}
  13. adapter: Teredo Tunneling Pseudo-Interface
  14. adapter: isatap.Home
  15.  
  16. Tests:
  17. Test 1: SUCCESS - Connect to fixed IP
  18. success
  19. Test 2: SUCCESS - Check NATTrace version
  20. success
  21. Test 3: SUCCESS - Perform DNS lookup
  22. success
  23. Test 4: SUCCESS - Connect to named host
  24. success
  25. Test 5: SUCCESS - Direct TCP to fixed IP
  26. success
  27. Test 6: SUCCESS - Direct TCP (web) to named host
  28. success
  29. Test 7: FAILED - Direct TCP (6112) to named host
  30. failed - exception caught (No connection could be made because the target machine actively refused it 202.27.187.2:6112)
  31. Test 8: FAILED - Direct UDP (6112) to fixed IP
  32. failed - exception caught (Array cannot be null.
  33. Parameter name: bytes)
  34. Test 9: FAILED - Direct UDP (6112) to named host
  35. failed - exception caught (Array cannot be null.
  36. Parameter name: bytes)
  37. Test 10: FAILED - NAT check, port 6112
  38. failed - exception caught (Array cannot be null.
  39. Parameter name: bytes)
  40. Test 11: FAILED - Direct UDP (port 9103)
  41. failed - exception caught (Array cannot be null.
  42. Parameter name: bytes)
  43. Test 12: FAILED - NAT check, port 9103
  44. failed - exception caught (Array cannot be null.
  45. Parameter name: bytes)
  46. Test 13: FAILED - Direct UDP (port 30350)
  47. failed - exception caught (Array cannot be null.
  48. Parameter name: bytes)
  49. Test 14: FAILED - NAT check, port 30350
  50. failed - exception caught (Array cannot be null.
  51. Parameter name: bytes)
  52. Test 15: FAILED - Direct UDP (port 30351)
  53. failed - exception caught (Array cannot be null.
  54. Parameter name: bytes)
  55. Test 16: FAILED - NAT check, port 30351
  56. failed - exception caught (Array cannot be null.
  57. Parameter name: bytes)
  58.  
  59. 10 tests failed
Advertisement
Add Comment
Please, Sign In to add comment