Pastebin launched a little side project called VERYVIRAL.com, check it out ;-) Want more features on Pastebin? Sign Up, it's FREE!

archlinux-zfs-linux3.5-error

By: schreiberstein on Jul 25th, 2012  |  syntax: Make  |  size: 1.11 KB  |  views: 48  |  expires: Never
download  |  raw  |  embed  |  report abuse  |  print
Text below is selected. Please press Ctrl+C to copy to your clipboard. (⌘+C on Mac)
  1. make[3]: Entering directory `/usr/src/linux-3.5.0-1-ARCH'
  2.  CC [M]  /home/alex/zfs/src/zfs-0.6.0-rc9/module/zfs/../../module/zfs/zpl_inode.o
  3. /home/alex/zfs/src/zfs-0.6.0-rc9/module/zfs/../../module/zfs/zpl_inode.c:383:2: error: unknown field 'truncate_range' specified in initializer
  4. /home/alex/zfs/src/zfs-0.6.0-rc9/module/zfs/../../module/zfs/zpl_inode.c:383:2: warning: initialization from incompatible pointer type [enabled by default]
  5. /home/alex/zfs/src/zfs-0.6.0-rc9/module/zfs/../../module/zfs/zpl_inode.c:383:2: warning: (near initialization for 'zpl_inode_operations.removexattr') [enabled by default]
  6. make[5]: *** [/home/alex/zfs/src/zfs-0.6.0-rc9/module/zfs/../../module/zfs/zpl_inode.o] Error 1
  7. make[4]: *** [/home/alex/zfs/src/zfs-0.6.0-rc9/module/zfs] Error 2
  8. make[3]: *** [_module_/home/alex/zfs/src/zfs-0.6.0-rc9/module] Error 2
  9. make[3]: Leaving directory `/usr/src/linux-3.5.0-1-ARCH'
  10. make[2]: *** [modules] Error 2
  11. make[2]: Leaving directory `/home/alex/zfs/src/zfs-0.6.0-rc9/module'
  12. make[1]: *** [all-recursive] Error 1
  13. make[1]: Leaving directory `/home/alex/zfs/src/zfs-0.6.0-rc9'
  14. make: *** [all] Error 2