Not a member of Pastebin yet?
Sign Up,
it unlocks many cool features!
- 11:22:52.196 [ERROR] [org.gradle.BuildExceptionReporter]
- 11:22:52.196 [ERROR] [org.gradle.BuildExceptionReporter] FAILURE: Build failed with an exception.
- 11:22:52.196 [ERROR] [org.gradle.BuildExceptionReporter]
- 11:22:52.196 [ERROR] [org.gradle.BuildExceptionReporter] * What went wrong:
- 11:22:52.196 [ERROR] [org.gradle.BuildExceptionReporter] Execution failed for task ':News2:compileRetrolambdaMamoDailyDebug'.
- 11:22:52.197 [ERROR] [org.gradle.BuildExceptionReporter] > A problem occurred starting process 'command 'C:\Program Files\Java\jdk1.8.0_60\bin\java.exe''
- 11:22:52.197 [ERROR] [org.gradle.BuildExceptionReporter]
- 11:22:52.197 [ERROR] [org.gradle.BuildExceptionReporter] * Exception is:
- 11:22:52.198 [ERROR] [org.gradle.BuildExceptionReporter] org.gradle.api.tasks.TaskExecutionException: Execution failed for task ':News2:compileRetrolambdaMamoDailyDebug'.
- 11:22:52.198 [ERROR] [org.gradle.BuildExceptionReporter] at org.gradle.api.internal.tasks.execution.ExecuteActionsTaskExecuter.executeActions(ExecuteActionsTaskExecuter.java:69)
- 11:22:52.198 [ERROR] [org.gradle.BuildExceptionReporter] at org.gradle.api.internal.tasks.execution.ExecuteActionsTaskExecuter.execute(ExecuteActionsTaskExecuter.java:46)
- 11:22:52.198 [ERROR] [org.gradle.BuildExceptionReporter] at org.gradle.api.internal.tasks.execution.PostExecutionAnalysisTaskExecuter.execute(PostExecutionAnalysisTaskExecuter.java:35)
- 11:22:52.199 [ERROR] [org.gradle.BuildExceptionReporter] at org.gradle.api.internal.tasks.execution.SkipUpToDateTaskExecuter.execute(SkipUpToDateTaskExecuter.java:64)
- 11:22:52.199 [ERROR] [org.gradle.BuildExceptionReporter] at org.gradle.api.internal.tasks.execution.ValidatingTaskExecuter.execute(ValidatingTaskExecuter.java:58)
- 11:22:52.199 [ERROR] [org.gradle.BuildExceptionReporter] at org.gradle.api.internal.tasks.execution.SkipEmptySourceFilesTaskExecuter.execute(SkipEmptySourceFilesTaskExecuter.java:42)
- 11:22:52.199 [ERROR] [org.gradle.BuildExceptionReporter] at org.gradle.api.internal.tasks.execution.SkipTaskWithNoActionsExecuter.execute(SkipTaskWithNoActionsExecuter.java:52)
- 11:22:52.200 [ERROR] [org.gradle.BuildExceptionReporter] at org.gradle.api.internal.tasks.execution.SkipOnlyIfTaskExecuter.execute(SkipOnlyIfTaskExecuter.java:53)
- 11:22:52.200 [ERROR] [org.gradle.BuildExceptionReporter] at org.gradle.api.internal.tasks.execution.ExecuteAtMostOnceTaskExecuter.execute(ExecuteAtMostOnceTaskExecuter.java:43)
- 11:22:52.200 [ERROR] [org.gradle.BuildExceptionReporter] at org.gradle.api.internal.AbstractTask.executeWithoutThrowingTaskFailure(AbstractTask.java:305)
- 11:22:52.200 [ERROR] [org.gradle.BuildExceptionReporter] at org.gradle.execution.taskgraph.AbstractTaskPlanExecutor$TaskExecutorWorker.executeTask(AbstractTaskPlanExecutor.java:79)
- 11:22:52.200 [ERROR] [org.gradle.BuildExceptionReporter] at org.gradle.execution.taskgraph.AbstractTaskPlanExecutor$TaskExecutorWorker.processTask(AbstractTaskPlanExecutor.java:63)
- 11:22:52.201 [ERROR] [org.gradle.BuildExceptionReporter] at org.gradle.execution.taskgraph.AbstractTaskPlanExecutor$TaskExecutorWorker.run(AbstractTaskPlanExecutor.java:51)
- 11:22:52.201 [ERROR] [org.gradle.BuildExceptionReporter] at org.gradle.execution.taskgraph.DefaultTaskPlanExecutor.process(DefaultTaskPlanExecutor.java:23)
- 11:22:52.201 [ERROR] [org.gradle.BuildExceptionReporter] at org.gradle.execution.taskgraph.DefaultTaskGraphExecuter.execute(DefaultTaskGraphExecuter.java:88)
- 11:22:52.201 [ERROR] [org.gradle.BuildExceptionReporter] at org.gradle.execution.SelectedTaskExecutionAction.execute(SelectedTaskExecutionAction.java:29)
- 11:22:52.201 [ERROR] [org.gradle.BuildExceptionReporter] at org.gradle.execution.DefaultBuildExecuter.execute(DefaultBuildExecuter.java:62)
- 11:22:52.202 [ERROR] [org.gradle.BuildExceptionReporter] at org.gradle.execution.DefaultBuildExecuter.access$200(DefaultBuildExecuter.java:23)
- 11:22:52.202 [ERROR] [org.gradle.BuildExceptionReporter] at org.gradle.execution.DefaultBuildExecuter$2.proceed(DefaultBuildExecuter.java:68)
- 11:22:52.202 [ERROR] [org.gradle.BuildExceptionReporter] at org.gradle.execution.DryRunBuildExecutionAction.execute(DryRunBuildExecutionAction.java:32)
- 11:22:52.202 [ERROR] [org.gradle.BuildExceptionReporter] at org.gradle.execution.DefaultBuildExecuter.execute(DefaultBuildExecuter.java:62)
- 11:22:52.202 [ERROR] [org.gradle.BuildExceptionReporter] at org.gradle.execution.DefaultBuildExecuter.execute(DefaultBuildExecuter.java:55)
- 11:22:52.202 [ERROR] [org.gradle.BuildExceptionReporter] at org.gradle.initialization.DefaultGradleLauncher.doBuildStages(DefaultGradleLauncher.java:149)
- 11:22:52.202 [ERROR] [org.gradle.BuildExceptionReporter] at org.gradle.initialization.DefaultGradleLauncher.doBuild(DefaultGradleLauncher.java:106)
- 11:22:52.202 [ERROR] [org.gradle.BuildExceptionReporter] at org.gradle.initialization.DefaultGradleLauncher.run(DefaultGradleLauncher.java:86)
- 11:22:52.203 [ERROR] [org.gradle.BuildExceptionReporter] at org.gradle.launcher.exec.InProcessBuildActionExecuter$DefaultBuildController.run(InProcessBuildActionExecuter.java:80)
- 11:22:52.203 [ERROR] [org.gradle.BuildExceptionReporter] at org.gradle.tooling.internal.provider.BuildModelAction.run(BuildModelAction.java:43)
- 11:22:52.203 [ERROR] [org.gradle.BuildExceptionReporter] at org.gradle.tooling.internal.provider.BuildModelAction.run(BuildModelAction.java:30)
- 11:22:52.204 [ERROR] [org.gradle.BuildExceptionReporter] at org.gradle.tooling.internal.provider.ConfiguringBuildAction.run(ConfiguringBuildAction.java:119)
- 11:22:52.204 [ERROR] [org.gradle.BuildExceptionReporter] at org.gradle.launcher.exec.InProcessBuildActionExecuter.execute(InProcessBuildActionExecuter.java:36)
- 11:22:52.204 [ERROR] [org.gradle.BuildExceptionReporter] at org.gradle.launcher.exec.InProcessBuildActionExecuter.execute(InProcessBuildActionExecuter.java:26)
- 11:22:52.204 [ERROR] [org.gradle.BuildExceptionReporter] at org.gradle.launcher.daemon.server.exec.ExecuteBuild.doBuild(ExecuteBuild.java:47)
- 11:22:52.204 [ERROR] [org.gradle.BuildExceptionReporter] at org.gradle.launcher.daemon.server.exec.BuildCommandOnly.execute(BuildCommandOnly.java:34)
- 11:22:52.204 [ERROR] [org.gradle.BuildExceptionReporter] at org.gradle.launcher.daemon.server.exec.DaemonCommandExecution.proceed(DaemonCommandExecution.java:119)
- 11:22:52.205 [ERROR] [org.gradle.BuildExceptionReporter] at org.gradle.launcher.daemon.server.exec.WatchForDisconnection.execute(WatchForDisconnection.java:35)
- 11:22:52.205 [ERROR] [org.gradle.BuildExceptionReporter] at org.gradle.launcher.daemon.server.exec.DaemonCommandExecution.proceed(DaemonCommandExecution.java:119)
- 11:22:52.205 [ERROR] [org.gradle.BuildExceptionReporter] at org.gradle.launcher.daemon.server.exec.ResetDeprecationLogger.execute(ResetDeprecationLogger.java:24)
- 11:22:52.206 [ERROR] [org.gradle.BuildExceptionReporter] at org.gradle.launcher.daemon.server.exec.DaemonCommandExecution.proceed(DaemonCommandExecution.java:119)
- 11:22:52.206 [ERROR] [org.gradle.BuildExceptionReporter] at org.gradle.launcher.daemon.server.exec.StartStopIfBuildAndStop.execute(StartStopIfBuildAndStop.java:33)
- 11:22:52.206 [ERROR] [org.gradle.BuildExceptionReporter] at org.gradle.launcher.daemon.server.exec.DaemonCommandExecution.proceed(DaemonCommandExecution.java:119)
- 11:22:52.206 [ERROR] [org.gradle.BuildExceptionReporter] at org.gradle.launcher.daemon.server.exec.ForwardClientInput$2.call(ForwardClientInput.java:71)
- 11:22:52.206 [ERROR] [org.gradle.BuildExceptionReporter] at org.gradle.launcher.daemon.server.exec.ForwardClientInput$2.call(ForwardClientInput.java:69)
- 11:22:52.206 [ERROR] [org.gradle.BuildExceptionReporter] at org.gradle.util.Swapper.swap(Swapper.java:38)
- 11:22:52.207 [ERROR] [org.gradle.BuildExceptionReporter] at org.gradle.launcher.daemon.server.exec.ForwardClientInput.execute(ForwardClientInput.java:69)
- 11:22:52.207 [ERROR] [org.gradle.BuildExceptionReporter] at org.gradle.launcher.daemon.server.exec.DaemonCommandExecution.proceed(DaemonCommandExecution.java:119)
- 11:22:52.207 [ERROR] [org.gradle.BuildExceptionReporter] at org.gradle.launcher.daemon.server.exec.LogToClient.doBuild(LogToClient.java:60)
- 11:22:52.207 [ERROR] [org.gradle.BuildExceptionReporter] at org.gradle.launcher.daemon.server.exec.BuildCommandOnly.execute(BuildCommandOnly.java:34)
- 11:22:52.207 [ERROR] [org.gradle.BuildExceptionReporter] at org.gradle.launcher.daemon.server.exec.DaemonCommandExecution.proceed(DaemonCommandExecution.java:119)
- 11:22:52.207 [ERROR] [org.gradle.BuildExceptionReporter] at org.gradle.launcher.daemon.server.exec.EstablishBuildEnvironment.doBuild(EstablishBuildEnvironment.java:70)
- 11:22:52.208 [ERROR] [org.gradle.BuildExceptionReporter] at org.gradle.launcher.daemon.server.exec.BuildCommandOnly.execute(BuildCommandOnly.java:34)
- 11:22:52.208 [ERROR] [org.gradle.BuildExceptionReporter] at org.gradle.launcher.daemon.server.exec.DaemonCommandExecution.proceed(DaemonCommandExecution.java:119)
- 11:22:52.208 [ERROR] [org.gradle.BuildExceptionReporter] at org.gradle.launcher.daemon.server.exec.DaemonHygieneAction.execute(DaemonHygieneAction.java:39)
- 11:22:52.208 [ERROR] [org.gradle.BuildExceptionReporter] at org.gradle.launcher.daemon.server.exec.DaemonCommandExecution.proceed(DaemonCommandExecution.java:119)
- 11:22:52.208 [ERROR] [org.gradle.BuildExceptionReporter] at org.gradle.launcher.daemon.server.exec.StartBuildOrRespondWithBusy$1.run(StartBuildOrRespondWithBusy.java:46)
- 11:22:52.209 [ERROR] [org.gradle.BuildExceptionReporter] at org.gradle.launcher.daemon.server.DaemonStateCoordinator$1.run(DaemonStateCoordinator.java:246)
- 11:22:52.209 [ERROR] [org.gradle.BuildExceptionReporter] at org.gradle.internal.concurrent.DefaultExecutorFactory$StoppableExecutorImpl$1.run(DefaultExecutorFactory.java:64)
- 11:22:52.209 [ERROR] [org.gradle.BuildExceptionReporter] Caused by: org.gradle.process.internal.ExecException: A problem occurred starting process 'command 'C:\Program Files\Java\jdk1.8.0_60\bin\java.exe''
- 11:22:52.209 [ERROR] [org.gradle.BuildExceptionReporter] at org.gradle.process.internal.DefaultExecHandle.setEndStateInfo(DefaultExecHandle.java:196)
- 11:22:52.210 [ERROR] [org.gradle.BuildExceptionReporter] at org.gradle.process.internal.DefaultExecHandle.failed(DefaultExecHandle.java:325)
- 11:22:52.210 [ERROR] [org.gradle.BuildExceptionReporter] at org.gradle.process.internal.ExecHandleRunner.run(ExecHandleRunner.java:83)
- 11:22:52.210 [ERROR] [org.gradle.BuildExceptionReporter] ... 1 more
- 11:22:52.210 [ERROR] [org.gradle.BuildExceptionReporter] Caused by: net.rubygrapefruit.platform.NativeException: Could not start 'C:\Program Files\Java\jdk1.8.0_60\bin\java.exe'
- 11:22:52.210 [ERROR] [org.gradle.BuildExceptionReporter] at net.rubygrapefruit.platform.internal.DefaultProcessLauncher.start(DefaultProcessLauncher.java:27)
- 11:22:52.210 [ERROR] [org.gradle.BuildExceptionReporter] at net.rubygrapefruit.platform.internal.WindowsProcessLauncher.start(WindowsProcessLauncher.java:22)
- 11:22:52.211 [ERROR] [org.gradle.BuildExceptionReporter] at net.rubygrapefruit.platform.internal.WrapperProcessLauncher.start(WrapperProcessLauncher.java:36)
- 11:22:52.211 [ERROR] [org.gradle.BuildExceptionReporter] at org.gradle.process.internal.ExecHandleRunner.run(ExecHandleRunner.java:65)
- 11:22:52.211 [ERROR] [org.gradle.BuildExceptionReporter] ... 1 more
- 11:22:52.211 [ERROR] [org.gradle.BuildExceptionReporter] Caused by: java.io.IOException: Cannot run program "C:\Program Files\Java\jdk1.8.0_60\bin\java.exe" (in directory "C:\work\projects\Intexsoft\news2mamo\news2project\News2"): CreateProcess error=206, The filename or extension is too long
- 11:22:52.211 [ERROR] [org.gradle.BuildExceptionReporter] at net.rubygrapefruit.platform.internal.DefaultProcessLauncher.start(DefaultProcessLauncher.java:25)
- 11:22:52.212 [ERROR] [org.gradle.BuildExceptionReporter] ... 4 more
- 11:22:52.212 [ERROR] [org.gradle.BuildExceptionReporter] Caused by: java.io.IOException: CreateProcess error=206, The filename or extension is too long
- 11:22:52.212 [ERROR] [org.gradle.BuildExceptionReporter] ... 5 more
- 11:22:52.212 [ERROR] [org.gradle.BuildExceptionReporter]
Advertisement
Add Comment
Please, Sign In to add comment