Want more features on Pastebin? Sign Up, it's FREE!
Guest

Madcow compile error

By: a guest on May 1st, 2012  |  syntax: C#  |  size: 20.25 KB  |  views: 123  |  expires: Never
download  |  raw  |  embed  |  report abuse  |  print
Text below is selected. Please press Ctrl+C to copy to your clipboard. (⌘+C on Mac)
  1. manuel@kobold /mnt/data/games/wine/diablo3/drive_c/Wesko-MadCow-db895a5 $ xbuild MadCow2011.slnXBuild Engine Version 2.10.5.0
  2. Mono, Version 2.10.5.0
  3. Copyright (C) Marek Sieradzki 2005-2008, Novell 2008-2011.
  4.  
  5. Build started 5/1/2012 2:07:23 PM.
  6. __________________________________________________
  7. Project "/mnt/data/games/wine/diablo3/drive_c/Wesko-MadCow-db895a5/MadCow2011.sln" (default target(s)):
  8.         Target ValidateSolutionConfiguration:
  9.                 Building solution configuration "Debug|x86".
  10.         Target Build:
  11.                 Project "/mnt/data/games/wine/diablo3/drive_c/Wesko-MadCow-db895a5/MadCowUpdater/MadCowUpdater.csproj" (default target(s)):
  12.                         Target PrepareForBuild:
  13.                                 Configuration: Debug Platform: x86
  14.                         Target ResolveAssemblyReferences:
  15. /usr/lib64/mono/4.0/Microsoft.Common.targets:  warning : Reference 'Microsoft.Build' not resolved
  16.                                 For searchpath {CandidateAssemblyFiles}
  17.                                 Warning: {CandidateAssemblyFiles} not supported currently
  18.                                 For searchpath {HintPathFromItem}
  19.                                 HintPath attribute not found
  20.                                 For searchpath {TargetFrameworkDirectory}
  21.                                 Considered target framework dir /usr/lib/mono/4.0, assembly named 'Microsoft.Build' not found.
  22.                                 For searchpath {PkgConfig}
  23.                                 Considered Microsoft.Build, but could not find in any pkg-config files.
  24.                                 For searchpath {GAC}
  25.                                 Considered Microsoft.Build, but could not find in the GAC.
  26.                                 For searchpath {RawFileName}
  27.                                 Considered '/mnt/data/games/wine/diablo3/drive_c/Wesko-MadCow-db895a5/MadCowUpdater/Microsoft.Build' as a file, but the file does not exist
  28.                                 For searchpath ../bin/MadCowDebug/MadCowUpdater/
  29.                                 Considered '/mnt/data/games/wine/diablo3/drive_c/Wesko-MadCow-db895a5/bin/MadCowDebug/MadCowUpdater/Microsoft.Build' as a file, but the file does not exist
  30.                                 Considered '/mnt/data/games/wine/diablo3/drive_c/Wesko-MadCow-db895a5/bin/MadCowDebug/MadCowUpdater/Microsoft.Build.exe' as a file, but the file does not exist
  31.                                 Considered '/mnt/data/games/wine/diablo3/drive_c/Wesko-MadCow-db895a5/bin/MadCowDebug/MadCowUpdater/Microsoft.Build.dll' as a file, but the file does not exist
  32. /usr/lib64/mono/4.0/Microsoft.Common.targets:  warning : Reference 'System.Deployment' not resolved
  33.                                 For searchpath {CandidateAssemblyFiles}
  34.                                 Warning: {CandidateAssemblyFiles} not supported currently
  35.                                 For searchpath {HintPathFromItem}
  36.                                 HintPath attribute not found
  37.                                 For searchpath {TargetFrameworkDirectory}
  38.                                 Considered target framework dir /usr/lib/mono/4.0, assembly named 'System.Deployment' not found.
  39.                                 For searchpath {PkgConfig}
  40.                                 Considered System.Deployment, but could not find in any pkg-config files.
  41.                                 For searchpath {GAC}
  42.                                 Considered System.Deployment, but could not find in the GAC.
  43.                                 For searchpath {RawFileName}
  44.                                 Considered '/mnt/data/games/wine/diablo3/drive_c/Wesko-MadCow-db895a5/MadCowUpdater/System.Deployment' as a file, but the file does not exist
  45.                                 For searchpath ../bin/MadCowDebug/MadCowUpdater/
  46.                                 Considered '/mnt/data/games/wine/diablo3/drive_c/Wesko-MadCow-db895a5/bin/MadCowDebug/MadCowUpdater/System.Deployment' as a file, but the file does not exist
  47.                                 Considered '/mnt/data/games/wine/diablo3/drive_c/Wesko-MadCow-db895a5/bin/MadCowDebug/MadCowUpdater/System.Deployment.exe' as a file, but the file does not exist
  48.                                 Considered '/mnt/data/games/wine/diablo3/drive_c/Wesko-MadCow-db895a5/bin/MadCowDebug/MadCowUpdater/System.Deployment.dll' as a file, but the file does not exist
  49. /usr/lib64/mono/4.0/Microsoft.Common.targets:  warning : Found a conflict between : 'System, Version=4.0.0.0, Culture=neutral, PublicKeyToken=b77a5c561934e089' and 'System, Version=2.0.0.0, Culture=neutral, PublicKeyToken=969db8053d3322ac, Retargetable=Yes'. Using 'System, Version=4.0.0.0, Culture=neutral, PublicKeyToken=b77a5c561934e089' reference.
  50.                         Target GenerateSatelliteAssemblies:
  51.                         Skipping target "GenerateSatelliteAssemblies" because its outputs are up-to-date.
  52.                         Target CoreCompile:
  53.                                 Tool /usr/bin/dmcs execution started with arguments: /noconfig /debug:full /debug+ /optimize- /out:obj/x86/Debug/MadCowUpdater.exe /resource:obj/x86/Debug/MadCowUpdater.Form1.resources /resource:obj/x86/Debug/MadCowUpdater.Properties.Resources.resources Classes/Check.cs Classes/Helper.cs Classes/UpdaterProcedure.cs Form1.cs Form1.Designer.cs Classes/ProcessFinder.cs Program.cs Properties/AssemblyInfo.cs Properties/Resources.Designer.cs /target:winexe /define:"DEBUG;TRACE" /platform:x86 /reference:../Tools/ICSharpCode.SharpZipLib.dll /reference:/usr/lib/mono/4.0/Microsoft.Build.Framework.dll /reference:/usr/lib/mono/4.0/System.dll /reference:/usr/lib/mono/4.0/System.Xml.Linq.dll /reference:/usr/lib/mono/4.0/System.Data.DataSetExtensions.dll /reference:/usr/lib/mono/4.0/Microsoft.CSharp.dll /reference:/usr/lib/mono/4.0/System.Data.dll /reference:/usr/lib/mono/4.0/System.Drawing.dll /reference:/usr/lib/mono/4.0/System.Windows.Forms.dll /reference:/usr/lib/mono/4.0/System.Xml.dll /reference:/usr/lib/mono/4.0/System.Core.dll /reference:/usr/lib/mono/4.0/mscorlib.dll /warn:4
  54. Classes/UpdaterProcedure.cs(23,23): error CS0234: The type or namespace name `Evaluation' does not exist in the namespace `Microsoft.Build'. Are you missing an assembly reference?
  55.                         Task "Csc" execution -- FAILED
  56.                         Done building target "CoreCompile" in project "/mnt/data/games/wine/diablo3/drive_c/Wesko-MadCow-db895a5/MadCowUpdater/MadCowUpdater.csproj".-- FAILED
  57.                 Done building project "/mnt/data/games/wine/diablo3/drive_c/Wesko-MadCow-db895a5/MadCowUpdater/MadCowUpdater.csproj".-- FAILED
  58.                 Project "/mnt/data/games/wine/diablo3/drive_c/Wesko-MadCow-db895a5/Bnet.Patcher/Bnet.Patcher.csproj" (default target(s)):
  59.                         Target PrepareForBuild:
  60.                                 Configuration: Debug Platform: x86
  61.                         Target GetReferenceAssemblyPaths:
  62. /usr/lib64/mono/4.0/Microsoft.Common.targets:  warning : Unable to find framework corresponding to the target framework moniker '.NETFramework,Version=v4.0,Profile=Client'. Framework assembly references will be resolved from the GAC, which might not be the intended behavior.
  63.                         Target GenerateSatelliteAssemblies:
  64.                         No input files were specified for target GenerateSatelliteAssemblies, skipping.
  65.                         Target CoreCompile:
  66.                         Skipping target "CoreCompile" because its outputs are up-to-date.
  67.                 Done building project "/mnt/data/games/wine/diablo3/drive_c/Wesko-MadCow-db895a5/Bnet.Patcher/Bnet.Patcher.csproj".
  68.                 Project "/mnt/data/games/wine/diablo3/drive_c/Wesko-MadCow-db895a5/MadCow.csproj" (default target(s)):
  69.                         Target PrepareForBuild:
  70.                                 Configuration: Debug Platform: x86
  71.                         Target ResolveAssemblyReferences:
  72. /usr/lib64/mono/4.0/Microsoft.Common.targets:  warning : Reference 'Microsoft.Build' not resolved
  73.                                 For searchpath {CandidateAssemblyFiles}
  74.                                 Warning: {CandidateAssemblyFiles} not supported currently
  75.                                 For searchpath {HintPathFromItem}
  76.                                 HintPath attribute not found
  77.                                 For searchpath {TargetFrameworkDirectory}
  78.                                 Considered target framework dir /usr/lib/mono/4.0, assembly named 'Microsoft.Build' not found.
  79.                                 For searchpath {PkgConfig}
  80.                                 Considered Microsoft.Build, but could not find in any pkg-config files.
  81.                                 For searchpath {GAC}
  82.                                 Considered Microsoft.Build, but could not find in the GAC.
  83.                                 For searchpath {RawFileName}
  84.                                 Considered '/mnt/data/games/wine/diablo3/drive_c/Wesko-MadCow-db895a5/Microsoft.Build' as a file, but the file does not exist
  85.                                 For searchpath bin/MadCowDebug/
  86.                                 Considered '/mnt/data/games/wine/diablo3/drive_c/Wesko-MadCow-db895a5/bin/MadCowDebug/Microsoft.Build' as a file, but the file does not exist
  87.                                 Considered '/mnt/data/games/wine/diablo3/drive_c/Wesko-MadCow-db895a5/bin/MadCowDebug/Microsoft.Build.exe' as a file, but the file does not exist
  88.                                 Considered '/mnt/data/games/wine/diablo3/drive_c/Wesko-MadCow-db895a5/bin/MadCowDebug/Microsoft.Build.dll' as a file, but the file does not exist
  89. /usr/lib64/mono/4.0/Microsoft.Common.targets:  warning : Reference 'Microsoft.VisualBasic' not resolved
  90.                                 For searchpath {CandidateAssemblyFiles}
  91.                                 Warning: {CandidateAssemblyFiles} not supported currently
  92.                                 For searchpath {HintPathFromItem}
  93.                                 HintPath attribute not found
  94.                                 For searchpath {TargetFrameworkDirectory}
  95.                                 Considered target framework dir /usr/lib/mono/4.0, assembly named 'Microsoft.VisualBasic' not found.
  96.                                 For searchpath {PkgConfig}
  97.                                 Considered Microsoft.VisualBasic, but could not find in any pkg-config files.
  98.                                 For searchpath {GAC}
  99.                                 Considered Microsoft.VisualBasic, but could not find in the GAC.
  100.                                 For searchpath {RawFileName}
  101.                                 Considered '/mnt/data/games/wine/diablo3/drive_c/Wesko-MadCow-db895a5/Microsoft.VisualBasic' as a file, but the file does not exist
  102.                                 For searchpath bin/MadCowDebug/
  103.                                 Considered '/mnt/data/games/wine/diablo3/drive_c/Wesko-MadCow-db895a5/bin/MadCowDebug/Microsoft.VisualBasic' as a file, but the file does not exist
  104.                                 Considered '/mnt/data/games/wine/diablo3/drive_c/Wesko-MadCow-db895a5/bin/MadCowDebug/Microsoft.VisualBasic.exe' as a file, but the file does not exist
  105.                                 Considered '/mnt/data/games/wine/diablo3/drive_c/Wesko-MadCow-db895a5/bin/MadCowDebug/Microsoft.VisualBasic.dll' as a file, but the file does not exist
  106. /usr/lib64/mono/4.0/Microsoft.Common.targets:  warning : Found a conflict between : 'System, Version=4.0.0.0, Culture=neutral, PublicKeyToken=b77a5c561934e089' and 'System, Version=2.0.0.0, Culture=neutral, PublicKeyToken=969db8053d3322ac, Retargetable=Yes'. Using 'System, Version=4.0.0.0, Culture=neutral, PublicKeyToken=b77a5c561934e089' reference.
  107. /usr/lib64/mono/4.0/Microsoft.Common.targets:  warning : Found a conflict between : 'mscorlib, Version=4.0.0.0, Culture=neutral, PublicKeyToken=b77a5c561934e089' and 'mscorlib, Version=2.0.0.0, Culture=neutral, PublicKeyToken=b77a5c561934e089'. Using 'mscorlib, Version=4.0.0.0, Culture=neutral, PublicKeyToken=b77a5c561934e089' reference.
  108. /usr/lib64/mono/4.0/Microsoft.Common.targets:  warning : Found a conflict between : 'System.Xml, Version=4.0.0.0, Culture=neutral, PublicKeyToken=b77a5c561934e089' and 'System.Xml, Version=2.0.0.0, Culture=neutral, PublicKeyToken=b77a5c561934e089'. Using 'System.Xml, Version=4.0.0.0, Culture=neutral, PublicKeyToken=b77a5c561934e089' reference.
  109. /usr/lib64/mono/4.0/Microsoft.Common.targets:  warning : Found a conflict between : 'System, Version=4.0.0.0, Culture=neutral, PublicKeyToken=b77a5c561934e089' and 'System, Version=2.0.0.0, Culture=neutral, PublicKeyToken=b77a5c561934e089'. Using 'System, Version=4.0.0.0, Culture=neutral, PublicKeyToken=b77a5c561934e089' reference.
  110.                         Target GenerateSatelliteAssemblies:
  111.                         No input files were specified for target GenerateSatelliteAssemblies, skipping.
  112.                         Target CoreCompile:
  113.                                 Tool /usr/bin/dmcs execution started with arguments: /noconfig /debug:full /debug+ /optimize- /out:obj/x86/Debug/MadCow.exe /resource:obj/x86/Debug/MadCow.Form1.resources /resource:obj/x86/Debug/MadCow.MPQDownloader.resources /resource:obj/x86/Debug/MadCow.RepositorySelectionPlay.resources /resource:obj/x86/Debug/MadCow.Properties.Resources.resources /resource:obj/x86/Debug/MadCow.RepositorySelectionServer.resources /resource:obj/x86/Debug/MadCow.SplashScreen.SpashScreen.resources MadCowClasses/Proxy.cs MadCowClasses/ShortCutCreator.cs MadCowClasses/Helpers.cs MadCowClasses/ErrorFinder.cs MadCowClasses/Diablo.cs MadCowClasses/FindBranch.cs MadCowClasses/RetrieveMpqList.cs MadCowClasses/TextBoxStreamWriter.cs MadCowClasses/ProcessFinder.cs MadCowClasses/Delete.cs MadCowClasses/MadCowProcedure.cs MadCowClasses/MPQprocedure.cs MadCowClasses/ParseRevision.cs MadCowClasses/Compile.cs MadCowClasses/PreRequeriments.cs MadCowClasses/RefreshDesktop.cs Forms/MainMadCowForm/Form1.cs Forms/MainMadCowForm/Form1.Designer.cs Forms/MPQDownloaderForm/MPQDownloader.cs Forms/MPQDownloaderForm/MPQDownloader.Designer.cs Forms/RepositorySelectionPlayForm/RepositorySelectionPlay.cs Forms/RepositorySelectionPlayForm/RepositorySelectionPlay.Designer.cs Program.cs Properties/AssemblyInfo.cs Properties/Resources.Designer.cs Forms/RepositorySelectionServerForm/RepositorySelectionServer.cs Forms/RepositorySelectionServerForm/RepositorySelectionServer.Designer.cs Forms/SplashScreenForm/SpashScreen.cs Forms/SplashScreenForm/SpashScreen.Designer.cs /target:winexe /define:"DEBUG;TRACE" /platform:x86 /reference:Tools/ICSharpCode.SharpZipLib.dll /reference:/usr/lib/mono/4.0/Microsoft.Build.Framework.dll /reference:/usr/lib/mono/4.0/Microsoft.CSharp.dll /reference:Tools/Nini.dll /reference:/usr/lib/mono/4.0/System.dll /reference:/usr/lib/mono/4.0/System.Drawing.dll /reference:/usr/lib/mono/4.0/System.Windows.Forms.dll /reference:/usr/lib/mono/4.0/System.Xml.Linq.dll /reference:/usr/lib/mono/4.0/System.Data.DataSetExtensions.dll /reference:/usr/lib/mono/4.0/System.Data.dll /reference:/usr/lib/mono/4.0/System.Xml.dll /reference:/usr/lib/mono/4.0/System.Core.dll /reference:/usr/lib/mono/4.0/mscorlib.dll /warn:4
  114. MadCowClasses/Compile.cs(22,23): error CS0234: The type or namespace name `Evaluation' does not exist in the namespace `Microsoft.Build'. Are you missing an assembly reference?
  115.                         Task "Csc" execution -- FAILED
  116.                         Done building target "CoreCompile" in project "/mnt/data/games/wine/diablo3/drive_c/Wesko-MadCow-db895a5/MadCow.csproj".-- FAILED
  117.                 Done building project "/mnt/data/games/wine/diablo3/drive_c/Wesko-MadCow-db895a5/MadCow.csproj".-- FAILED
  118.         Task "MSBuild" execution -- FAILED
  119.         Done building target "Build" in project "/mnt/data/games/wine/diablo3/drive_c/Wesko-MadCow-db895a5/MadCow2011.sln".-- FAILED
  120. Done building project "/mnt/data/games/wine/diablo3/drive_c/Wesko-MadCow-db895a5/MadCow2011.sln".-- FAILED
  121.  
  122. Build FAILED.
  123.  
  124. Warnings:
  125.  
  126. /mnt/data/games/wine/diablo3/drive_c/Wesko-MadCow-db895a5/MadCow2011.sln (default targets) ->
  127. (Build target) ->
  128. /mnt/data/games/wine/diablo3/drive_c/Wesko-MadCow-db895a5/MadCowUpdater/MadCowUpdater.csproj (default targets) ->
  129. /usr/lib64/mono/4.0/Microsoft.Common.targets (ResolveAssemblyReferences target) ->
  130.  
  131.         /usr/lib64/mono/4.0/Microsoft.Common.targets:  warning : Reference 'Microsoft.Build' not resolved
  132.         /usr/lib64/mono/4.0/Microsoft.Common.targets:  warning : Reference 'System.Deployment' not resolved
  133.         /usr/lib64/mono/4.0/Microsoft.Common.targets:  warning : Found a conflict between : 'System, Version=4.0.0.0, Culture=neutral, PublicKeyToken=b77a5c561934e089' and 'System, Version=2.0.0.0, Culture=neutral, PublicKeyToken=969db8053d3322ac, Retargetable=Yes'. Using 'System, Version=4.0.0.0, Culture=neutral, PublicKeyToken=b77a5c561934e089' reference.
  134.  
  135. /mnt/data/games/wine/diablo3/drive_c/Wesko-MadCow-db895a5/MadCow2011.sln (default targets) ->
  136. (Build target) ->
  137. /mnt/data/games/wine/diablo3/drive_c/Wesko-MadCow-db895a5/Bnet.Patcher/Bnet.Patcher.csproj (default targets) ->
  138. /usr/lib64/mono/4.0/Microsoft.Common.targets (GetReferenceAssemblyPaths target) ->
  139.  
  140.         /usr/lib64/mono/4.0/Microsoft.Common.targets:  warning : Unable to find framework corresponding to the target framework moniker '.NETFramework,Version=v4.0,Profile=Client'. Framework assembly references will be resolved from the GAC, which might not be the intended behavior.
  141.  
  142. /mnt/data/games/wine/diablo3/drive_c/Wesko-MadCow-db895a5/MadCow2011.sln (default targets) ->
  143. (Build target) ->
  144. /mnt/data/games/wine/diablo3/drive_c/Wesko-MadCow-db895a5/MadCow.csproj (default targets) ->
  145. /usr/lib64/mono/4.0/Microsoft.Common.targets (ResolveAssemblyReferences target) ->
  146.  
  147.         /usr/lib64/mono/4.0/Microsoft.Common.targets:  warning : Reference 'Microsoft.Build' not resolved
  148.         /usr/lib64/mono/4.0/Microsoft.Common.targets:  warning : Reference 'Microsoft.VisualBasic' not resolved
  149.         /usr/lib64/mono/4.0/Microsoft.Common.targets:  warning : Found a conflict between : 'System, Version=4.0.0.0, Culture=neutral, PublicKeyToken=b77a5c561934e089' and 'System, Version=2.0.0.0, Culture=neutral, PublicKeyToken=969db8053d3322ac, Retargetable=Yes'. Using 'System, Version=4.0.0.0, Culture=neutral, PublicKeyToken=b77a5c561934e089' reference.
  150.         /usr/lib64/mono/4.0/Microsoft.Common.targets:  warning : Found a conflict between : 'mscorlib, Version=4.0.0.0, Culture=neutral, PublicKeyToken=b77a5c561934e089' and 'mscorlib, Version=2.0.0.0, Culture=neutral, PublicKeyToken=b77a5c561934e089'. Using 'mscorlib, Version=4.0.0.0, Culture=neutral, PublicKeyToken=b77a5c561934e089' reference.
  151.         /usr/lib64/mono/4.0/Microsoft.Common.targets:  warning : Found a conflict between : 'System.Xml, Version=4.0.0.0, Culture=neutral, PublicKeyToken=b77a5c561934e089' and 'System.Xml, Version=2.0.0.0, Culture=neutral, PublicKeyToken=b77a5c561934e089'. Using 'System.Xml, Version=4.0.0.0, Culture=neutral, PublicKeyToken=b77a5c561934e089' reference.
  152.         /usr/lib64/mono/4.0/Microsoft.Common.targets:  warning : Found a conflict between : 'System, Version=4.0.0.0, Culture=neutral, PublicKeyToken=b77a5c561934e089' and 'System, Version=2.0.0.0, Culture=neutral, PublicKeyToken=b77a5c561934e089'. Using 'System, Version=4.0.0.0, Culture=neutral, PublicKeyToken=b77a5c561934e089' reference.
  153.  
  154. Errors:
  155.  
  156. /mnt/data/games/wine/diablo3/drive_c/Wesko-MadCow-db895a5/MadCow2011.sln (default targets) ->
  157. (Build target) ->
  158. /mnt/data/games/wine/diablo3/drive_c/Wesko-MadCow-db895a5/MadCowUpdater/MadCowUpdater.csproj (default targets) ->
  159. /usr/lib64/mono/4.0/Microsoft.CSharp.targets (CoreCompile target) ->
  160.  
  161.         Classes/UpdaterProcedure.cs(23,23): error CS0234: The type or namespace name `Evaluation' does not exist in the namespace `Microsoft.Build'. Are you missing an assembly reference?
  162.  
  163. /mnt/data/games/wine/diablo3/drive_c/Wesko-MadCow-db895a5/MadCow2011.sln (default targets) ->
  164. (Build target) ->
  165. /mnt/data/games/wine/diablo3/drive_c/Wesko-MadCow-db895a5/MadCow.csproj (default targets) ->
  166. /usr/lib64/mono/4.0/Microsoft.CSharp.targets (CoreCompile target) ->
  167.  
  168.         MadCowClasses/Compile.cs(22,23): error CS0234: The type or namespace name `Evaluation' does not exist in the namespace `Microsoft.Build'. Are you missing an assembly reference?
  169.  
  170.          10 Warning(s)
  171.          2 Error(s)
  172.  
  173. Time Elapsed 00:00:01.2241360
  174. manuel@kobold /mnt/data/games/wine/diablo3/drive_c/Wesko-MadCow-db895a5 $
clone this paste RAW Paste Data