This week only. Pastebin PRO Accounts Christmas Special! Don't miss out!Want more features on Pastebin? Sign Up, it's FREE!

synapse error

By: niharsarangi on Sep 4th, 2012  |  syntax: Bash  |  size: 1.24 KB  |  views: 232  |  expires: Never
download  |  raw  |  embed  |  report abuse  |  print
Text below is selected. Please press Ctrl+C to copy to your clipboard. (⌘+C on Mac)
  1. /usr/bin/ld: warning: librt.so.1, needed by /usr/lib/gcc/i686-pc-linux-gnu/4.7.1/../../../libjson-glib-1.0.so, not found (try using -rpath or -rpath-link)
  2. /usr/bin/ld: warning: libresolv.so.2, needed by /usr/lib/gcc/i686-pc-linux-gnu/4.7.1/../../../libgio-2.0.so, not found (try using -rpath or -rpath-link)
  3. /usr/lib/gcc/i686-pc-linux-gnu/4.7.1/../../../libgio-2.0.so: undefined reference to `__dn_expand@GLIBC_2.2'
  4. /usr/lib/gcc/i686-pc-linux-gnu/4.7.1/../../../libgio-2.0.so: undefined reference to `__res_query@GLIBC_2.2'
  5. /usr/lib/gcc/i686-pc-linux-gnu/4.7.1/../../../libcairo.so: undefined reference to `clock_gettime@GLIBC_2.2'
  6. /usr/lib/libdbus-1.so.3: undefined reference to `clock_getres@GLIBC_2.2'
  7. collect2: error: ld returned 1 exit status
  8. make[4]: *** [synapse] Error 1
  9. make[4]: Leaving directory `/tmp/yaourt-tmp-nihar/aur-synapse/src/synapse-0.2.10/src/ui'
  10. make[3]: *** [all] Error 2
  11. make[3]: Leaving directory `/tmp/yaourt-tmp-nihar/aur-synapse/src/synapse-0.2.10/src/ui'
  12. make[2]: *** [all-recursive] Error 1
  13. make[2]: Leaving directory `/tmp/yaourt-tmp-nihar/aur-synapse/src/synapse-0.2.10/src'
  14. make[1]: *** [all-recursive] Error 1
  15. make[1]: Leaving directory `/tmp/yaourt-tmp-nihar/aur-synapse/src/synapse-0.2.10'
  16. make: *** [all] Error 2
clone this paste RAW Paste Data