Want more features on Pastebin? Sign Up, it's FREE!
Guest

simulavr compile error

By: a guest on May 4th, 2010  |  syntax: None  |  size: 8.75 KB  |  views: 229  |  expires: Never
download  |  raw  |  embed  |  report abuse  |  print
Text below is selected. Please press Ctrl+C to copy to your clipboard. (⌘+C on Mac)
  1. patching file src/disp-vcd/config_scanner.c
  2. checking build system type... x86_64-unknown-linux-gnu
  3. checking host system type... x86_64-unknown-linux-gnu
  4. checking target system type... x86_64-unknown-linux-gnu
  5. checking for a BSD-compatible install... /bin/install -c
  6. checking whether build environment is sane... yes
  7. checking for gawk... gawk
  8. checking whether make sets $(MAKE)... yes
  9. checking for gcc... gcc
  10. checking for C compiler default output file name... a.out
  11. checking whether the C compiler works... yes
  12. checking whether we are cross compiling... no
  13. checking for suffix of executables...
  14. checking for suffix of object files... o
  15. checking whether we are using the GNU C compiler... yes
  16. checking whether gcc accepts -g... yes
  17. checking for gcc option to accept ANSI C... none needed
  18. checking for style of include used by make... GNU
  19. checking dependency style of gcc... gcc3
  20. checking for flex... flex
  21. checking for yywrap in -lfl... yes
  22. checking lex output file root... lex.yy
  23. checking whether yytext is a pointer... yes
  24. checking for bison... bison -y
  25. checking whether ln -s works... yes
  26. checking for ranlib... ranlib
  27. checking for avr-as... avr-as
  28. checking for avr-ld... avr-ld
  29. checking for avr-objcopy... avr-objcopy
  30. checking for avr-objdump... avr-objdump
  31. checking for avr-nm... avr-nm
  32. checking for avr-gcc... avr-gcc
  33. checking for python >= 2.1.1... yes
  34. checking for GNU make... make
  35. checking for makeinfo... yes
  36. checking for texi2dvi... yes
  37. checking for texindex... yes
  38. checking for tex... yes
  39. checking for pdftex... yes
  40. checking for texi2html... no
  41. configure: WARNING:  
  42. configure: WARNING: You do not seem to have tetex installed on your system.
  43. configure: WARNING: Documentation will not be build. If you wish to build the
  44. configure: WARNING: documentation files, you will have to install tetex.
  45. configure: WARNING:  
  46. checking if user wants a curses display... yes
  47. checking for initscr in -lncurses... yes
  48. checking for resizeterm in -lncurses... yes
  49. checking how to run the C preprocessor... gcc -E
  50. checking for egrep... grep -E
  51. checking for ANSI C header files... yes
  52. checking for sys/wait.h that is POSIX.1 compatible... yes
  53. checking for sys/types.h... yes
  54. checking for sys/stat.h... yes
  55. checking for stdlib.h... yes
  56. checking for string.h... yes
  57. checking for memory.h... yes
  58. checking for strings.h... yes
  59. checking for inttypes.h... yes
  60. checking for stdint.h... yes
  61. checking for unistd.h... yes
  62. checking arpa/inet.h usability... yes
  63. checking arpa/inet.h presence... yes
  64. checking for arpa/inet.h... yes
  65. checking fcntl.h usability... yes
  66. checking fcntl.h presence... yes
  67. checking for fcntl.h... yes
  68. checking netinet/in.h usability... yes
  69. checking netinet/in.h presence... yes
  70. checking for netinet/in.h... yes
  71. checking for stdlib.h... (cached) yes
  72. checking for string.h... (cached) yes
  73. checking for strings.h... (cached) yes
  74. checking sys/ioctl.h usability... yes
  75. checking sys/ioctl.h presence... yes
  76. checking for sys/ioctl.h... yes
  77. checking sys/socket.h usability... yes
  78. checking sys/socket.h presence... yes
  79. checking for sys/socket.h... yes
  80. checking sys/time.h usability... yes
  81. checking sys/time.h presence... yes
  82. checking for sys/time.h... yes
  83. checking termios.h usability... yes
  84. checking termios.h presence... yes
  85. checking for termios.h... yes
  86. checking for unistd.h... (cached) yes
  87. checking for inttypes.h... (cached) yes
  88. checking for an ANSI C-conforming const... yes
  89. checking for inline... inline
  90. checking for pid_t... yes
  91. checking for size_t... yes
  92. checking whether time.h and sys/time.h may both be included... yes
  93. checking for working volatile... yes
  94. checking for socklen_t... yes
  95. checking for unistd.h... (cached) yes
  96. checking vfork.h usability... no
  97. checking vfork.h presence... no
  98. checking for vfork.h... no
  99. checking for fork... yes
  100. checking for vfork... yes
  101. checking for working fork... yes
  102. checking for working vfork... (cached) yes
  103. checking whether gcc needs -traditional... no
  104. checking for stdlib.h... (cached) yes
  105. checking for GNU libc compatible malloc... yes
  106. checking for stdlib.h... (cached) yes
  107. checking for GNU libc compatible realloc... yes
  108. checking sys/select.h usability... yes
  109. checking sys/select.h presence... yes
  110. checking for sys/select.h... yes
  111. checking for sys/socket.h... (cached) yes
  112. checking types of arguments for select... int,fd_set *,struct timeval *
  113. checking return type of signal handlers... void
  114. checking for vprintf... yes
  115. checking for _doprnt... no
  116. checking for atexit... yes
  117. checking for gettimeofday... yes
  118. checking for inet_ntoa... yes
  119. checking for memset... yes
  120. checking for putenv... yes
  121. checking for select... yes
  122. checking for socket... yes
  123. checking for strdup... yes
  124. checking for strerror... yes
  125. checking for strrchr... yes
  126. checking for strtol... yes
  127. checking if user wants to build the documentation in pdf format... no
  128. checking for doxygen... no
  129. checking if avr test programs will be built... yes
  130. configure: creating ./config.status
  131. config.status: creating Makefile
  132. config.status: creating doc/Makefile
  133. config.status: creating doc/doxygen.config
  134. config.status: creating regress/Makefile
  135. config.status: creating regress/regress.py
  136. config.status: creating regress/modules/Makefile
  137. config.status: creating regress/test_opcodes/Makefile
  138. config.status: creating src/Makefile
  139. config.status: creating src/getopt/Makefile
  140. config.status: creating src/disp-vcd/Makefile
  141. config.status: creating src/disp/Makefile
  142. config.status: creating test_asm/Makefile
  143. config.status: creating test_asm/test_8515/Makefile
  144. config.status: creating test_c/Makefile
  145. config.status: creating simulavr.spec
  146. config.status: creating simulavr.1
  147. config.status: creating simulavr-disp.1
  148. config.status: creating src/config.h
  149. config.status: src/config.h is unchanged
  150. config.status: executing depfiles commands
  151. Making all in src
  152. make[1]: Entering directory `/home/ffiasd/Desktop/src/simulavr-0.1.2.6/src'
  153. make  all-recursive
  154. make[2]: Entering directory `/home/ffiasd/Desktop/src/simulavr-0.1.2.6/src'
  155. Making all in getopt
  156. make[3]: Entering directory `/home/ffiasd/Desktop/src/simulavr-0.1.2.6/src/getopt'
  157. make[3]: Nothing to be done for `all'.
  158. make[3]: Leaving directory `/home/ffiasd/Desktop/src/simulavr-0.1.2.6/src/getopt'
  159. Making all in disp
  160. make[3]: Entering directory `/home/ffiasd/Desktop/src/simulavr-0.1.2.6/src/disp'
  161. make[3]: Nothing to be done for `all'.
  162. make[3]: Leaving directory `/home/ffiasd/Desktop/src/simulavr-0.1.2.6/src/disp'
  163. Making all in disp-vcd
  164. make[3]: Entering directory `/home/ffiasd/Desktop/src/simulavr-0.1.2.6/src/disp-vcd'
  165. if gcc -DHAVE_CONFIG_H -I. -I. -I../../src    -Wall -Winline -Werror -I../../src -I../../src/getopt -march=athlon64 -O2 -pipe -MT config_scanner.o -MD -MP -MF ".deps/config_scanner.Tpo" -c -o config_scanner.o config_scanner.c; \
  166.         then mv -f ".deps/config_scanner.Tpo" ".deps/config_scanner.Po"; else rm -f ".deps/config_scanner.Tpo"; exit 1; fi
  167. gcc -Wall -Winline -Werror -I../../src -I../../src/getopt -march=athlon64 -O2 -pipe   -o simulavr-vcd  disp.o vcd.o config_parser.o config_scanner.o ../getopt/libgnugetopt.a
  168. make[3]: Leaving directory `/home/ffiasd/Desktop/src/simulavr-0.1.2.6/src/disp-vcd'
  169. make[3]: Entering directory `/home/ffiasd/Desktop/src/simulavr-0.1.2.6/src'
  170. if gcc -DHAVE_CONFIG_H -I. -I. -I.    -Wall -Winline -Werror -I../src/getopt -march=athlon64 -O2 -pipe -MT adc.o -MD -MP -MF ".deps/adc.Tpo" -c -o adc.o adc.c; \
  171.         then mv -f ".deps/adc.Tpo" ".deps/adc.Po"; else rm -f ".deps/adc.Tpo"; exit 1; fi
  172. if gcc -DHAVE_CONFIG_H -I. -I. -I.    -Wall -Winline -Werror -I../src/getopt -march=athlon64 -O2 -pipe -MT avrerror.o -MD -MP -MF ".deps/avrerror.Tpo" -c -o avrerror.o avrerror.c; \
  173.         then mv -f ".deps/avrerror.Tpo" ".deps/avrerror.Po"; else rm -f ".deps/avrerror.Tpo"; exit 1; fi
  174. if gcc -DHAVE_CONFIG_H -I. -I. -I.    -Wall -Winline -Werror -I../src/getopt -march=athlon64 -O2 -pipe -MT avrmalloc.o -MD -MP -MF ".deps/avrmalloc.Tpo" -c -o avrmalloc.o avrmalloc.c; \
  175.         then mv -f ".deps/avrmalloc.Tpo" ".deps/avrmalloc.Po"; else rm -f ".deps/avrmalloc.Tpo"; exit 1; fi
  176. cc1: warnings being treated as errors
  177. adc.c: In function 'adc_intr_cb':
  178. adc.c:270:35: error: cast from pointer to integer of different size
  179. if gcc -DHAVE_CONFIG_H -I. -I. -I.    -Wall -Winline -Werror -I../src/getopt -march=athlon64 -O2 -pipe -MT callback.o -MD -MP -MF ".deps/callback.Tpo" -c -o callback.o callback.c; \
  180.         then mv -f ".deps/callback.Tpo" ".deps/callback.Po"; else rm -f ".deps/callback.Tpo"; exit 1; fi
  181. make[3]: *** [adc.o] Error 1
  182. make[3]: *** Waiting for unfinished jobs....
  183. make[3]: Leaving directory `/home/ffiasd/Desktop/src/simulavr-0.1.2.6/src'
  184. make[2]: *** [all-recursive] Error 1
  185. make[2]: Leaving directory `/home/ffiasd/Desktop/src/simulavr-0.1.2.6/src'
  186. make[1]: *** [all] Error 2
  187. make[1]: Leaving directory `/home/ffiasd/Desktop/src/simulavr-0.1.2.6/src'
  188. make: *** [all-recursive] Error 1
clone this paste RAW Paste Data