SHARE
TWEET

Untitled

a guest Apr 21st, 2011 128 Never
  1. -- Found XFS:
  2. -- Found JNI...building kfs_access
  3. -- Configuring done
  4. -- Generating done
  5. -- Build files have been written to: /home/tom/kfs/kfs-svn/src/build
  6. Scanning dependencies of target Version.cc
  7. Traceback (most recent call last):
  8.   File "/home/tom/kfs/kfs-svn/src/kosmosfs/src/cc/common/buildVers.py", line 33, in <module>
  9.     print >> fh, "//"
  10. TypeError: unsupported operand type(s) for >>: 'builtin_function_or_method' and '_io.TextIOWrapper'
  11. make[2]: *** [src/cc/common/CMakeFiles/Version.cc] Error 1
  12. make[1]: *** [src/cc/common/CMakeFiles/Version.cc.dir/all] Error 2
  13. make: *** [all] Error 2
  14. ==> ERROR: A failure occurred in build().
  15.     Aborting...
RAW Paste Data
Top