Want more features on Pastebin? Sign Up, it's FREE!
Guest

kcm-ufw compile error

By: a guest on Apr 20th, 2011  |  syntax: Bash  |  size: 28.06 KB  |  views: 97  |  expires: Never
download  |  raw  |  embed  |  report abuse  |  print
Text below is selected. Please press Ctrl+C to copy to your clipboard. (⌘+C on Mac)
  1. Scanning dependencies of target docs-handbook
  2. [ 85%] Generating index.cache.bz2                                                                                      
  3. index.docbook:7: warning: failed to load external entity "dtd/kdex.dtd"                                                
  4. ]>
  5.   ^
  6. index.docbook:9: parser error : Entity 'language' not defined
  7. <article lang="&language;">
  8.                          ^
  9. index.docbook:9: element article: validity error : No declaration for attribute lang of element article
  10. <article lang="&language;">
  11.                           ^
  12. index.docbook:11: element title: validity error : No declaration for element title
  13.   <title>The Firewall Handbook</title>
  14.                                       ^
  15. index.docbook:13: parser error : Entity 'Craig.Drummond' not defined
  16.     <author>&Craig.Drummond; &Craig.Drummond.mail;</author>
  17.                             ^
  18. index.docbook:13: element email: validity error : No declaration for element email
  19.     <author>&Craig.Drummond; &Craig.Drummond.mail;</author>
  20.                                                   ^
  21. index.docbook:13: element author: validity error : No declaration for element author
  22.     <author>&Craig.Drummond; &Craig.Drummond.mail;</author>
  23.                                                            ^
  24. index.docbook:15: element authorgroup: validity error : No declaration for element authorgroup
  25.    </authorgroup>
  26.                  ^
  27. index.docbook:16: element date: validity error : No declaration for element date
  28.    <date>2011-04-07</date>
  29.                           ^
  30. index.docbook:17: element releaseinfo: validity error : No declaration for element releaseinfo
  31.    <releaseinfo>0.1.0</releaseinfo>
  32.                                    ^
  33. index.docbook:19: element keyword: validity error : No declaration for element keyword
  34.     <keyword>KDE</keyword>
  35.                           ^
  36. index.docbook:20: element keyword: validity error : No declaration for element keyword
  37.     <keyword>KControl</keyword>
  38.                                ^
  39. index.docbook:21: element keyword: validity error : No declaration for element keyword
  40.     <keyword>ufw</keyword>
  41.                           ^
  42. index.docbook:22: element keyword: validity error : No declaration for element keyword
  43.     <keyword>firewall</keyword>
  44.                                ^
  45. index.docbook:23: element keywordset: validity error : No declaration for element keywordset
  46.    </keywordset>
  47.                 ^
  48. index.docbook:24: element articleinfo: validity error : No declaration for element articleinfo
  49.   </articleinfo>
  50.                 ^
  51. index.docbook:25: element sect1: validity error : No declaration for attribute id of element sect1
  52.  <sect1 id="introduction">
  53.                          ^
  54. index.docbook:26: element title: validity error : No declaration for element title
  55.   <title>Introduction</title>
  56.                              ^
  57. index.docbook:27: element para: validity error : No declaration for element para
  58.  allows you to control the settings of the 'Uncomplicated FireWall' (UFW).</para
  59.                                                                                ^
  60. index.docbook:28: element sect1: validity error : No declaration for element sect1
  61.  </sect1>
  62.          ^
  63. index.docbook:30: element sect1: validity error : No declaration for attribute id of element sect1
  64.  <sect1 id="configuration">  
  65.                           ^
  66. index.docbook:31: element title: validity error : No declaration for element title
  67.   <title>Configuration</title>
  68.                               ^
  69. index.docbook:32: element para: validity error : No declaration for element para
  70.  and module settings can only be modified whilst the firewall is disabled.</para
  71.                                                                                ^
  72. index.docbook:34: element sect2: validity error : No declaration for attribute id of element sect2
  73.   <sect2 id="policies">
  74.                       ^
  75. index.docbook:35: element title: validity error : No declaration for element title
  76.    <title>Default Policies</title>
  77.                                   ^
  78. index.docbook:39: element quote: validity error : No declaration for element quote
  79.      <listitem><para><quote>Allow</quote> - accepts access to the specified port
  80.                                          ^
  81. index.docbook:39: element para: validity error : No declaration for element para
  82. ra><quote>Allow</quote> - accepts access to the specified ports/services.</para>
  83.                                                                                ^
  84. index.docbook:39: element listitem: validity error : No declaration for element listitem
  85. Allow</quote> - accepts access to the specified ports/services.</para></listitem
  86.                                                                                ^
  87. index.docbook:40: element quote: validity error : No declaration for element quote
  88.      <listitem><para><quote>Deny</quote> - blocks access to the specified ports/
  89.                                         ^
  90. index.docbook:40: element para: validity error : No declaration for element para
  91. para><quote>Deny</quote> - blocks access to the specified ports/services.</para>
  92.                                                                                ^
  93. index.docbook:40: element listitem: validity error : No declaration for element listitem
  94. e>Deny</quote> - blocks access to the specified ports/services.</para></listitem
  95.                                                                                ^
  96. index.docbook:41: element quote: validity error : No declaration for element quote
  97.      <listitem><para><quote>Reject</quote> - similar to Deny, but lets the sende
  98.                                           ^
  99. index.docbook:42: element para: validity error : No declaration for element para
  100.                      simply ignoring it.</para></listitem>
  101.                                                ^
  102. index.docbook:42: element listitem: validity error : No declaration for element listitem
  103.                      simply ignoring it.</para></listitem>
  104.                                                           ^
  105. index.docbook:43: element orderedlist: validity error : No declaration for element orderedlist
  106.     </orderedlist>
  107.                   ^
  108. index.docbook:44: element para: validity error : No declaration for element para
  109.    </para>
  110.           ^
  111. index.docbook:45: element sect2: validity error : No declaration for element sect2
  112.   </sect2>
  113.           ^
  114. index.docbook:47: element sect2: validity error : No declaration for attribute id of element sect2
  115.   <sect2 id="ipv6">
  116.                   ^
  117. index.docbook:48: element title: validity error : No declaration for element title
  118.    <title>IPv6 Support</title>
  119.                               ^
  120. index.docbook:49: element quote: validity error : No declaration for element quote
  121. ules based upon IPv6 address, you should enabled the <quote>IPv6 support</quote>
  122.                                                                                ^
  123. index.docbook:49: element para: validity error : No declaration for element para
  124.  IPv6 address, you should enabled the <quote>IPv6 support</quote> setting.</para
  125.                                                                                ^
  126. index.docbook:50: element sect2: validity error : No declaration for element sect2
  127.   </sect2>
  128.           ^
  129. index.docbook:52: element sect2: validity error : No declaration for attribute id of element sect2
  130.   <sect2 id="logging">
  131.                      ^
  132. index.docbook:53: element title: validity error : No declaration for element title
  133.    <title>Logging</title>
  134.                          ^
  135. index.docbook:54: element quote: validity error : No declaration for element quote
  136. eneral logging of the firewall may be set using the <quote>Logging level</quote>
  137.                                                                                ^
  138. index.docbook:57: element quote: validity error : No declaration for element quote
  139.      <listitem><para><quote>Off</quote> - disables logging.</para></listitem>
  140.                                        ^
  141. index.docbook:57: element para: validity error : No declaration for element para
  142.      <listitem><para><quote>Off</quote> - disables logging.</para></listitem>
  143.                                                                   ^
  144. index.docbook:57: element listitem: validity error : No declaration for element listitem
  145.      <listitem><para><quote>Off</quote> - disables logging.</para></listitem>
  146.                                                                              ^
  147. index.docbook:58: element quote: validity error : No declaration for element quote
  148.      <listitem><para><quote>Low</quote> - logs all blocked packets not matching
  149.                                        ^
  150. index.docbook:59: element para: validity error : No declaration for element para
  151.                      packets matching logged rules.</para></listitem>
  152.                                                           ^
  153. index.docbook:59: element listitem: validity error : No declaration for element listitem
  154.                      packets matching logged rules.</para></listitem>
  155.                                                                      ^
  156. index.docbook:60: element quote: validity error : No declaration for element quote
  157.      <listitem><para><quote>Medium</quote> - as per <quote>Low</quote>, plus all
  158.                                           ^
  159. index.docbook:60: element quote: validity error : No declaration for element quote
  160.      <listitem><para><quote>Medium</quote> - as per <quote>Low</quote>, plus all
  161.                                                                       ^
  162. index.docbook:61: element para: validity error : No declaration for element para
  163. packets, and all new connections. All logging is done with rate limiting.</para>
  164.                                                                                ^
  165. index.docbook:61: element listitem: validity error : No declaration for element listitem
  166. nd all new connections. All logging is done with rate limiting.</para></listitem
  167.                                                                                ^
  168. index.docbook:62: element quote: validity error : No declaration for element quote
  169.      <listitem><para><quote>High</quote> - as per <quote>Medium</quote> (without
  170.                                         ^
  171. index.docbook:62: element quote: validity error : No declaration for element quote
  172.      <listitem><para><quote>High</quote> - as per <quote>Medium</quote> (without
  173.                                                                        ^
  174. index.docbook:63: element para: validity error : No declaration for element para
  175.                </para></listitem>
  176.                       ^
  177. index.docbook:63: element listitem: validity error : No declaration for element listitem
  178.                </para></listitem>
  179.                                  ^
  180. index.docbook:64: element quote: validity error : No declaration for element quote
  181.      <listitem><para><quote>Full</quote> - log everything, without rate limiting
  182.                                         ^
  183. index.docbook:64: element para: validity error : No declaration for element para
  184. stitem><para><quote>Full</quote> - log everything, without rate limiting.</para>
  185.                                                                                ^
  186. index.docbook:64: element listitem: validity error : No declaration for element listitem
  187. ra><quote>Full</quote> - log everything, without rate limiting.</para></listitem
  188.                                                                                ^
  189. index.docbook:65: element orderedlist: validity error : No declaration for element orderedlist
  190.     </orderedlist>
  191.                   ^
  192. index.docbook:66: element quote: validity error : No declaration for element quote
  193.     NOTE: Levels above <quote>Medium</quote> generate a lot of logging output, a
  194.                                             ^
  195. index.docbook:68: element para: validity error : No declaration for element para
  196.    </para>
  197.           ^
  198. index.docbook:69: element sect2: validity error : No declaration for element sect2
  199.   </sect2>
  200.           ^
  201. index.docbook:70: element sect1: validity error : No declaration for element sect1
  202.  </sect1>
  203.          ^
  204. index.docbook:72: element sect1: validity error : No declaration for attribute id of element sect1
  205.  <sect1 id="rules">
  206.                   ^
  207. index.docbook:73: element title: validity error : No declaration for element title
  208.   <title>Rules</title>
  209.                       ^
  210. index.docbook:74: element para: validity error : No declaration for element para
  211. ded a list of rules as to which ports/services show be allowed or blocked.</para
  212.                                                                                ^
  213. index.docbook:76: element quote: validity error : No declaration for element quote
  214.  rules later. Rules may be re-ordered via the <quote>Move Up / Move Down</quote>
  215.                                                                                ^
  216. index.docbook:77: element para: validity error : No declaration for element para
  217.         entries in the rules list.</para>
  218.                                          ^
  219. index.docbook:80: element quote: validity error : No declaration for element quote
  220.     <listitem><para><quote>Application</quote> - allows quick control over the p
  221.                                               ^
  222. index.docbook:81: element para: validity error : No declaration for element para
  223.                     applications.</para></listitem>
  224.                                         ^
  225. index.docbook:81: element listitem: validity error : No declaration for element listitem
  226.                     applications.</para></listitem>
  227.                                                    ^
  228. index.docbook:82: element quote: validity error : No declaration for element quote
  229.     <listitem><para><quote>Service</quote> - allows quick control over the ports
  230.                                           ^
  231. index.docbook:82: element para: validity error : No declaration for element para
  232. > - allows quick control over the ports used by some well known services.</para>
  233.                                                                                ^
  234. index.docbook:82: element listitem: validity error : No declaration for element listitem
  235.  quick control over the ports used by some well known services.</para></listitem
  236.                                                                                ^
  237. index.docbook:83: element quote: validity error : No declaration for element quote
  238.     <listitem><para><quote>Simple (Port)</quote> - allows controlling of arbitra
  239.                                                 ^
  240. index.docbook:83: element para: validity error : No declaration for element para
  241. ote>Simple (Port)</quote> - allows controlling of arbitrary port numbers.</para>
  242.                                                                                ^
  243. index.docbook:83: element listitem: validity error : No declaration for element listitem
  244.  (Port)</quote> - allows controlling of arbitrary port numbers.</para></listitem
  245.                                                                                ^
  246. index.docbook:84: element quote: validity error : No declaration for element quote
  247.     <listitem><para><quote>Advanced (Adress and port)</quote> - allows complete
  248.                                                              ^
  249. index.docbook:85: element para: validity error : No declaration for element para
  250.                     Only the filed that you require need to be filled in.</para>
  251.                                                                                ^
  252. index.docbook:85: element listitem: validity error : No declaration for element listitem
  253.           Only the filed that you require need to be filled in.</para></listitem
  254.                                                                                ^
  255. index.docbook:86: element orderedlist: validity error : No declaration for element orderedlist
  256.    </orderedlist>
  257.                  ^
  258. index.docbook:87: element quote: validity error : No declaration for element quote
  259.    When editing a rule, only the <quote>Simple</quote> and <quote>Advanced</quot
  260.                                                       ^
  261. index.docbook:87: element quote: validity error : No declaration for element quote
  262.  When editing a rule, only the <quote>Simple</quote> and <quote>Advanced</quote>
  263.                                                                                ^
  264. index.docbook:88: element quote: validity error : No declaration for element quote
  265.    is added, it is transformed from an <quote>Application</quote> / <quote>Servi
  266.                                                                  ^
  267. index.docbook:88: element quote: validity error : No declaration for element quote
  268. d, it is transformed from an <quote>Application</quote> / <quote>Service</quote>
  269.                                                                                ^
  270. index.docbook:89: element para: validity error : No declaration for element para
  271.   </para>
  272.          ^
  273. index.docbook:92: element quote: validity error : No declaration for element quote
  274.     <listitem><para><quote>Policy</quote> controls how connections are handled.<
  275.                                          ^
  276. index.docbook:92: element para: validity error : No declaration for element para
  277. listitem><para><quote>Policy</quote> controls how connections are handled.</para
  278.                                                                                ^
  279. index.docbook:94: element quote: validity error : No declaration for element quote
  280.       <listitem><para><quote>Allow</quote> - accepts access to the specified por
  281.                                           ^
  282. index.docbook:94: element para: validity error : No declaration for element para
  283. ra><quote>Allow</quote> - accepts access to the specified ports/services.</para>
  284.                                                                                ^
  285. index.docbook:94: element listitem: validity error : No declaration for element listitem
  286. Allow</quote> - accepts access to the specified ports/services.</para></listitem
  287.                                                                                ^
  288. index.docbook:95: element quote: validity error : No declaration for element quote
  289.       <listitem><para><quote>Deny</quote> - blocks access to the specified ports
  290.                                          ^
  291. index.docbook:95: element para: validity error : No declaration for element para
  292. para><quote>Deny</quote> - blocks access to the specified ports/services.</para>
  293.                                                                                ^
  294. index.docbook:95: element listitem: validity error : No declaration for element listitem
  295. e>Deny</quote> - blocks access to the specified ports/services.</para></listitem
  296.                                                                                ^
  297. index.docbook:96: element quote: validity error : No declaration for element quote
  298.       <listitem><para><quote>Reject</quote> - similar to Deny, but lets the send
  299.                                            ^
  300. index.docbook:97: element para: validity error : No declaration for element para
  301.                       ignoring it.</para></listitem>
  302.                                          ^
  303. index.docbook:97: element listitem: validity error : No declaration for element listitem
  304.                       ignoring it.</para></listitem>
  305.                                                     ^
  306. index.docbook:98: element quote: validity error : No declaration for element quote
  307.       <listitem><para><quote>Limit</quote> - enables connection rate limiting. T
  308.                                           ^
  309. index.docbook:100: element para: validity error : No declaration for element para
  310.                       the last 30 seconds</para></listitem>
  311.                                                 ^
  312. index.docbook:100: element listitem: validity error : No declaration for element listitem
  313.                       the last 30 seconds</para></listitem>
  314.                                                            ^
  315. index.docbook:101: element orderedlist: validity error : No declaration for element orderedlist
  316.      </orderedlist>
  317.                    ^
  318. index.docbook:102: element listitem: validity error : No declaration for element listitem
  319.     </listitem>
  320.                ^
  321. index.docbook:103: element quote: validity error : No declaration for element quote
  322.     <listitem><para><quote>Direction</quote> - indicates the direction of the co
  323.                                             ^
  324. index.docbook:103: element para: validity error : No declaration for element para
  325. ara><quote>Direction</quote> - indicates the direction of the connection.</para>
  326.                                                                                ^
  327. index.docbook:103: element listitem: validity error : No declaration for element listitem
  328. >Direction</quote> - indicates the direction of the connection.</para></listitem
  329.                                                                                ^
  330. index.docbook:104: element quote: validity error : No declaration for element quote
  331.     <listitem><para><quote>Logging</quote> - controls per-rule logging</para>
  332.                                           ^
  333. index.docbook:104: element para: validity error : No declaration for element para
  334.     <listitem><para><quote>Logging</quote> - controls per-rule logging</para>
  335.                                                                              ^
  336. index.docbook:106: element quote: validity error : No declaration for element quote
  337.       <listitem><para><quote>None</quote> - no logging is performed when a packe
  338.                                          ^
  339. index.docbook:106: element para: validity error : No declaration for element para
  340. uote>None</quote> - no logging is performed when a packet matches a rule.</para>
  341.                                                                                ^
  342. index.docbook:106: element listitem: validity error : No declaration for element listitem
  343. /quote> - no logging is performed when a packet matches a rule.</para></listitem
  344.                                                                                ^
  345. index.docbook:107: element quote: validity error : No declaration for element quote
  346.       <listitem><para><quote>New</quote> - will log all new connections matching
  347.                                         ^
  348. index.docbook:107: element para: validity error : No declaration for element para
  349. ><para><quote>New</quote> - will log all new connections matching a rule.</para>
  350.                                                                                ^
  351. index.docbook:107: element listitem: validity error : No declaration for element listitem
  352. ote>New</quote> - will log all new connections matching a rule.</para></listitem
  353.                                                                                ^
  354. index.docbook:108: element quote: validity error : No declaration for element quote
  355.       <listitem><para><quote>All</quote> - will log all packets matching a rule.
  356.                                         ^
  357. index.docbook:108: element para: validity error : No declaration for element para
  358. listitem><para><quote>All</quote> - will log all packets matching a rule.</para>
  359.                                                                                ^
  360. index.docbook:108: element listitem: validity error : No declaration for element listitem
  361. para><quote>All</quote> - will log all packets matching a rule.</para></listitem
  362.                                                                                ^
  363. index.docbook:109: element orderedlist: validity error : No declaration for element orderedlist
  364.      </orderedlist>
  365.                    ^
  366. index.docbook:110: element listitem: validity error : No declaration for element listitem
  367.     </listitem>
  368.                ^
  369. index.docbook:111: element quote: validity error : No declaration for element quote
  370.     <listitem><para><quote>Description</quote></para></listitem>
  371.                                               ^
  372. index.docbook:111: element para: validity error : No declaration for element para
  373.     <listitem><para><quote>Description</quote></para></listitem>
  374.                                                      ^
  375. index.docbook:111: element listitem: validity error : No declaration for element listitem
  376.     <listitem><para><quote>Description</quote></para></listitem>
  377.                                                                 ^
  378. index.docbook:112: element orderedlist: validity error : No declaration for element orderedlist
  379.    </orderedlist>
  380.                  ^
  381. index.docbook:113: element quote: validity error : No declaration for element quote
  382.    When editing a rule, only the <quote>Simple</quote> and <quote>Advanced</quot
  383.                                                       ^
  384. index.docbook:113: element quote: validity error : No declaration for element quote
  385.  When editing a rule, only the <quote>Simple</quote> and <quote>Advanced</quote>
  386.                                                                                ^
  387. index.docbook:114: element quote: validity error : No declaration for element quote
  388.    is added it is transformed from an <quote>Application</quote> / <quote>Servic
  389.                                                                 ^
  390. index.docbook:114: element quote: validity error : No declaration for element quote
  391. ed it is transformed from an <quote>Application</quote> / <quote>Service</quote>
  392.                                                                                ^
  393. index.docbook:115: element para: validity error : No declaration for element para
  394.   </para>
  395.          ^
  396. index.docbook:116: element sect1: validity error : No declaration for element sect1
  397.  </sect1>
  398.          ^
  399. index.docbook:118: element sect1: validity error : No declaration for attribute id of element sect1
  400.  <sect1 id="modules">
  401.                     ^
  402. index.docbook:119: element title: validity error : No declaration for element title
  403.   <title>Modules</title>
  404.                         ^
  405. index.docbook:121: element quote: validity error : No declaration for element quote
  406.         will be listed in the <quote>Modules</quote> section. Each enabled modul
  407.                                                     ^
  408. index.docbook:121: element para: validity error : No declaration for element para
  409. odules</quote> section. Each enabled module is indicated with a checkmark.</para
  410.                                                                                ^
  411. index.docbook:124: element quote: validity error : No declaration for element quote
  412.     <listitem><para><quote>Connection tracking</quote> - is the ability to maint
  413.                                                       ^
  414. index.docbook:126: element para: validity error : No declaration for element para
  415.               </para></listitem>
  416.                      ^
  417. index.docbook:126: element listitem: validity error : No declaration for element listitem
  418.               </para></listitem>
  419.                                 ^
  420. index.docbook:127: element quote: validity error : No declaration for element quote
  421.     <listitem><para><quote>NAT (Network Address Translation)</quote> - Where any
  422.                                                                     ^
  423. index.docbook:130: element para: validity error : No declaration for element para
  424.                     module.</para></listitem>
  425.                                   ^
  426. index.docbook:130: element listitem: validity error : No declaration for element listitem
  427.                     module.</para></listitem>
  428.                                              ^
  429. index.docbook:131: element orderedlist: validity error : No declaration for element orderedlist
  430.    </orderedlist>
  431.                  ^
  432. index.docbook:132: element para: validity error : No declaration for element para
  433.   </para>
  434.          ^
  435. index.docbook:133: element sect1: validity error : No declaration for element sect1
  436.  </sect1>
  437.          ^
  438. index.docbook:135: element article: validity error : No declaration for element article
  439. </article>
  440.           ^
  441. make[2]: *** [docs/index.cache.bz2] Error 1
  442. make[1]: *** [docs/CMakeFiles/docs-handbook.dir/all] Error 2
  443. make: *** [all] Error 2
  444. ==> ERROR: Se produjo un error en build().
  445.     Cancelando...
  446. ==> ERROR: Makepkg was unable to build kcm-ufw.
  447. ==> Restart building kcm-ufw ? [y/N]
clone this paste RAW Paste Data