Guest User

Untitled

a guest
Jul 26th, 2014
261
0
Never
Not a member of Pastebin yet? Sign Up, it unlocks many cool features!
  1. Target AfterBuild:
  2. Task "CreateItem"
  3.     Using task CreateItem from Microsoft.Build.Tasks.CreateItem, Microsoft.Build.Tasks.v4.0, Version=4.0.0.0, Culture=neutral, PublicKeyToken=b03f5f7f11d50a3a
  4. /libgit2sharp/LibGit2Sharp/CopyNativeDependencies.targets: error : Error executing task CreateItem: Invalid path
  5.  
  6. Error executing task CreateItem: System.ArgumentException: Invalid path
  7.     at System.IO.Path.GetDirectoryName (System.String path) [0x00117] in corlib/System.IO/Path.cs:237
  8.     at Microsoft.Build.BuildEngine.DirectoryScanner.ProcessInclude (ITaskItem include_item, System.Collections.Generic. Dictionary`2 excludedItems, System.Collections.Generic.List`1 includedItems) [0x001ba] in Microsoft.Build.Engine/Microsoft.Build.BuildEngine/DirectoryScanner.cs:123
  9.     at Microsoft.Build.BuildEngine.DirectoryScanner.Scan () [0x0008b] in Microsoft.Build.Engine/Microsoft.Build.BuildEngine/DirectoryScanner.cs:72
  10.     at Microsoft.Build.Tasks.CreateItem.Execute () [0x00048] in Microsoft.Build.Tasks/Microsoft.Build.Tasks/CreateItem.cs:58
  11.     at Microsoft.Build.BuildEngine.TaskEngine.Execute () [0x00000] in Microsoft.Build.Engine/Microsoft.Build.BuildEngine/TaskEngine.cs:137
  12.     at Microsoft.Build.BuildEngine.BuildTask.Execute () [0x0009a] in Microsoft.Build.Engine/Microsoft.Build.BuildEngine/BuildTask.cs:104
  13. Task "CreateItem" execution -- FAILED
  14.  
  15. Done building target "AfterBuild" in project "/libgit2sharp/LibGit2Sharp.Tests/LibGit2Sharp.Tests.csproj".-- FAILED
  16. Done building target "AfterBuild" in project "/libgit2sharp/LibGit2Sharp.Tests/LibGit2Sharp.Tests.csproj" ("/libgit2sharp/LibGit2Sharp/CopyNativeDependencies.targets"); "Build" depends on it.
  17. Done building target "Build" in project "/libgit2sharp/LibGit2Sharp.Tests/LibGit2Sharp.Tests.csproj" ("/Library/Frameworks/Mono.framework/Versions/3.4.0/lib/mono/4.5/Microsoft.Common.targets").
  18. Done building project "/libgit2sharp/LibGit2Sharp.Tests/LibGit2Sharp.Tests.csproj".-- FAILED
  19.  
  20. Task "MSBuild" execution -- FAILED
  21.         Done building target "Build" in project "/libgit2sharp/LibGit2Sharp.sln".-- FAILED
  22.         Done building target "Build" in project "/libgit2sharp/LibGit2Sharp.sln" ("/libgit2sharp/LibGit2Sharp.sln").
  23.         Done building project "/libgit2sharp/LibGit2Sharp.sln".-- FAILED
  24. Task "MSBuild" execution -- FAILED
  25.  
  26. Done building target "Build" in project "/libgit2sharp/CI/build.msbuild".-- FAILED
  27.  
  28. Done building target "Build" in project "/libgit2sharp/CI/build.msbuild" ("/libgit2sharp/CI/build.msbuild");
  29.     "Test" depends on it.
  30.  
  31. Done building target "Test" in project "/libgit2sharp/CI/build.msbuild" ("/libgit2sharp/CI/build.msbuild");
  32.     "Deploy" depends on it.
  33.  
  34. Done building target "Deploy" in project "/libgit2sharp/CI/build.msbuild" ("/libgit2sharp/CI/build.msbuild").
  35. Done building project "/libgit2sharp/CI/build.msbuild".-- FAILED
  36.  
  37. Build FAILED.
  38. Errors:
  39.  
  40. /libgit2sharp/CI/build.msbuild (Deploy) -> (Build target) ->
  41. /libgit2sharp/LibGit2Sharp.sln (Build)  -> (Build target) ->
  42. /libgit2sharp/LibGit2Sharp.Tests/LibGit2Sharp.Tests.csproj (default targets)  ->
  43. /libgit2sharp/LibGit2Sharp/CopyNativeDependencies.targets (AfterBuild target) ->
  44.  
  45. /libgit2sharp/LibGit2Sharp/CopyNativeDependencies.targets: error : Error executing task CreateItem: Invalid path
  46.  
  47.      0 Warning(s)
  48.      1 Error(s)
  49.  
  50. Time Elapsed 00:00:02.4272580
Advertisement
Add Comment
Please, Sign In to add comment