Guest User

build failure gobject-introspection

a guest
Apr 24th, 2013
138
0
Never
Not a member of Pastebin yet? Sign Up, it unlocks many cool features!
text 29.81 KB | None | 0 0
  1. Build info:
  2. FreeBSD i3wm 9.1-RELEASE FreeBSD 9.1-RELEASE #0 r243825: Tue Dec 4 09:23:10 UTC 2012 [email protected]:/usr/obj/usr/src/sys/GENERIC amd64
  3.  
  4. current directory:
  5. /usr/ports/x11-wm/i3
  6.  
  7. confirming no configs:
  8. ===> Setting user-specified options for i3-4.5.1_1 and dependencies
  9. ===> No options to configure
  10. ===> No options to configure
  11. ===> No options to configure
  12. ===> No options to configure
  13. ===> No options to configure
  14. ===> No options to configure
  15. ===> No options to configure
  16. ===> No options to configure
  17. ===> No options to configure
  18. ===> No options to configure
  19. ===> No options to configure
  20. ===> No options to configure
  21. ===> No options to configure
  22. ===> No options to configure
  23. ===> No options to configure
  24. ===> No options to configure
  25. ===> No options to configure
  26. ===> No options to configure
  27. ===> No options to configure
  28. ===> No options to configure
  29. ===> No options to configure
  30. ===> No options to configure
  31. ===> No options to configure
  32. ===> No options to configure
  33. ===> No options to configure
  34. ===> No options to configure
  35. ===> No options to configure
  36. ===> No options to configure
  37. ===> No options to configure
  38. ===> No options to configure
  39. ===> No options to configure
  40. ===> No options to configure
  41. ===> No options to configure
  42. ===> No options to configure
  43. ===> No options to configure
  44. ===> No options to configure
  45. ===> No options to configure
  46. ===> No options to configure
  47. ===> No options to configure
  48. ===> No options to configure
  49. ===> No options to configure
  50. ===> No options to configure
  51. ===> No options to configure
  52. ===> No options to configure
  53. ===> No options to configure
  54. ===> No options to configure
  55. ===> No options to configure
  56. ===> No options to configure
  57. ===> No options to configure
  58. ===> No options to configure
  59. ===> No options to configure
  60. ===> No options to configure
  61. ===> No options to configure
  62. ===> No options to configure
  63. ===> No options to configure
  64. ===> No options to configure
  65. ===> No options to configure
  66. ===> No options to configure
  67. ===> No options to configure
  68. ===> No options to configure
  69. ===> No options to configure
  70. ===> No options to configure
  71. ===> No options to configure
  72. ===> No options to configure
  73. ===> No options to configure
  74.  
  75. starting build, which fails on gobject-introspection:
  76. ===> License BSD accepted by the user
  77. ===> Fetching all distfiles required by i3-4.5.1_1 for building
  78. ===> Extracting for i3-4.5.1_1
  79. => SHA256 Checksum OK for i3-4.5.1.tar.bz2.
  80. ===> Patching for i3-4.5.1_1
  81. ===> Applying FreeBSD patches for i3-4.5.1_1
  82. ===> i3-4.5.1_1 depends on package: flex>=2.5.35 - found
  83. ===> i3-4.5.1_1 depends on executable: bison - found
  84. ===> i3-4.5.1_1 depends on executable: pkgconf - found
  85. ===> i3-4.5.1_1 depends on executable: gmake - found
  86. ===> i3-4.5.1_1 depends on file: /usr/local/libdata/pkgconfig/x11.pc - found
  87. ===> i3-4.5.1_1 depends on file: /usr/local/libdata/pkgconfig/xcursor.pc - found
  88. ===> i3-4.5.1_1 depends on shared library: xcb - found
  89. ===> i3-4.5.1_1 depends on shared library: startup-notification - found
  90. ===> i3-4.5.1_1 depends on shared library: xcb-util - found
  91. ===> i3-4.5.1_1 depends on shared library: xcb-keysyms - found
  92. ===> i3-4.5.1_1 depends on shared library: xcb-icccm - found
  93. ===> i3-4.5.1_1 depends on shared library: ev - found
  94. ===> i3-4.5.1_1 depends on shared library: yajl - found
  95. ===> i3-4.5.1_1 depends on shared library: cairo - found
  96. ===> i3-4.5.1_1 depends on shared library: pangocairo - not found
  97. ===> Verifying install for pangocairo in /usr/ports/x11-toolkits/pango
  98. ===> Found saved configuration for pango-1.30.1
  99. ===> Fetching all distfiles required by pango-1.30.1 for building
  100. ===> Extracting for pango-1.30.1
  101. => SHA256 Checksum OK for gnome2/pango-1.30.1.tar.xz.
  102. ===> Patching for pango-1.30.1
  103. ===> pango-1.30.1 depends on package: libtool>=2.4 - found
  104. ===> pango-1.30.1 depends on file: /usr/local/libdata/pkgconfig/freetype2.pc - found
  105. ===> pango-1.30.1 depends on executable: g-ir-scanner - not found
  106. ===> Verifying install for g-ir-scanner in /usr/ports/devel/gobject-introspection
  107. ===> Fetching all distfiles required by gobject-introspection-1.34.2 for building
  108. ===> Extracting for gobject-introspection-1.34.2
  109. => SHA256 Checksum OK for gnome3/gobject-introspection-1.34.2.tar.xz.
  110. ===> Patching for gobject-introspection-1.34.2
  111. ===> gobject-introspection-1.34.2 depends on package: libtool>=2.4 - found
  112. ===> Applying FreeBSD patches for gobject-introspection-1.34.2
  113. ===> gobject-introspection-1.34.2 depends on executable: cairo-trace - found
  114. ===> gobject-introspection-1.34.2 depends on file: /usr/local/bin/python2.7 - found
  115. ===> gobject-introspection-1.34.2 depends on executable: bison - found
  116. ===> gobject-introspection-1.34.2 depends on executable: pkgconf - found
  117. ===> gobject-introspection-1.34.2 depends on executable: gmake - found
  118. ===> gobject-introspection-1.34.2 depends on package: libtool>=2.4 - found
  119. ===> gobject-introspection-1.34.2 depends on shared library: ffi.6 - found
  120. ===> gobject-introspection-1.34.2 depends on shared library: intl - found
  121. ===> gobject-introspection-1.34.2 depends on shared library: glib-2.0 - found
  122. ===> gobject-introspection-1.34.2 depends on shared library: pcre - found
  123. ===> Configuring for gobject-introspection-1.34.2
  124. configure: loading site script /usr/ports/Templates/config.site
  125. checking for a BSD-compatible install... /usr/bin/install -c -o root -g wheel
  126. checking whether build environment is sane... yes
  127. checking for a thread-safe mkdir -p... (cached) /bin/mkdir -p
  128. checking for gawk... (cached) /usr/bin/awk
  129. checking whether gmake sets $(MAKE)... yes
  130. checking how to create a ustar tar archive... (cached) /usr/bin/tar
  131. checking whether to enable maintainer-specific portions of Makefiles... yes
  132. checking whether gmake supports nested variables... yes
  133. checking build system type... amd64-portbld-freebsd9.1
  134. checking host system type... amd64-portbld-freebsd9.1
  135. checking for gcc... /usr/local/libexec/ccache/world/cc
  136. checking whether the C compiler works... yes
  137. checking for C compiler default output file name... a.out
  138. checking for suffix of executables...
  139. checking whether we are cross compiling... no
  140. checking for suffix of object files... o
  141. checking whether we are using the GNU C compiler... yes
  142. checking whether /usr/local/libexec/ccache/world/cc accepts -g... yes
  143. checking for /usr/local/libexec/ccache/world/cc option to accept ISO C89... none needed
  144. checking for style of include used by gmake... GNU
  145. checking dependency style of /usr/local/libexec/ccache/world/cc... gcc3
  146. checking whether /usr/local/libexec/ccache/world/cc and cc understand -c and -o together... yes
  147. checking how to print strings... printf
  148. checking for a sed that does not truncate output... (cached) /usr/bin/sed
  149. checking for grep that handles long lines and -e... (cached) /usr/bin/grep
  150. checking for egrep... (cached) /usr/bin/egrep
  151. checking for fgrep... (cached) /usr/bin/fgrep
  152. checking for ld used by /usr/local/libexec/ccache/world/cc... /usr/bin/ld
  153. checking if the linker (/usr/bin/ld) is GNU ld... yes
  154. checking for BSD- or MS-compatible name lister (nm)... /usr/bin/nm -B
  155. checking the name lister (/usr/bin/nm -B) interface... BSD nm
  156. checking whether ln -s works... yes
  157. checking the maximum length of command line arguments... (cached) 262144
  158. checking whether the shell understands some XSI constructs... yes
  159. checking whether the shell understands "+="... no
  160. checking how to convert amd64-portbld-freebsd9.1 file names to amd64-portbld-freebsd9.1 format... func_convert_file_noop
  161. checking how to convert amd64-portbld-freebsd9.1 file names to toolchain format... func_convert_file_noop
  162. checking for /usr/bin/ld option to reload object files... -r
  163. checking for objdump... objdump
  164. checking how to recognize dependent libraries... pass_all
  165. checking for dlltool... no
  166. checking how to associate runtime and link libraries... printf %s\n
  167. checking for ar... ar
  168. checking for archiver @FILE support... no
  169. checking for strip... strip
  170. checking for ranlib... ranlib
  171. checking command to parse /usr/bin/nm -B output from /usr/local/libexec/ccache/world/cc object... ok
  172. checking for sysroot... no
  173. checking for mt... mt
  174. checking if mt is a manifest tool... no
  175. checking how to run the C preprocessor... cpp
  176. checking for ANSI C header files... yes
  177. checking for sys/types.h... (cached) yes
  178. checking for sys/stat.h... (cached) yes
  179. checking for stdlib.h... (cached) yes
  180. checking for string.h... (cached) yes
  181. checking for memory.h... (cached) yes
  182. checking for strings.h... (cached) yes
  183. checking for inttypes.h... (cached) yes
  184. checking for stdint.h... (cached) yes
  185. checking for unistd.h... (cached) yes
  186. checking for dlfcn.h... (cached) yes
  187. checking for objdir... .libs
  188. checking if /usr/local/libexec/ccache/world/cc supports -fno-rtti -fno-exceptions... no
  189. checking for /usr/local/libexec/ccache/world/cc option to produce PIC... -fPIC -DPIC
  190. checking if /usr/local/libexec/ccache/world/cc PIC flag -fPIC -DPIC works... yes
  191. checking if /usr/local/libexec/ccache/world/cc static flag -static works... yes
  192. checking if /usr/local/libexec/ccache/world/cc supports -c -o file.o... yes
  193. checking if /usr/local/libexec/ccache/world/cc supports -c -o file.o... (cached) yes
  194. checking whether the /usr/local/libexec/ccache/world/cc linker (/usr/bin/ld) supports shared libraries... yes
  195. checking whether -lc should be explicitly linked in... no
  196. checking dynamic linker characteristics... freebsd9.1 ld.so
  197. checking how to hardcode library paths into programs... immediate
  198. checking whether stripping libraries is possible... yes
  199. checking if libtool supports shared libraries... yes
  200. checking whether to build shared libraries... yes
  201. checking whether to build static libraries... yes
  202. checking pkg-config is at least version 0.9.0... yes
  203. checking for flex... flex
  204. checking lex output file root... lex.yy
  205. checking lex library... -lfl
  206. checking whether yytext is a pointer... yes
  207. checking for bison... bison -y
  208. checking for dlopen in -ldl... no
  209. checking for the suffix of shared libraries... .so
  210. checking for GLIB... yes
  211. checking for GOBJECT... yes
  212. checking for GMODULE... yes
  213. checking for GIO... yes
  214. checking for GIO_UNIX... yes
  215. checking for SCANNER... yes
  216. checking for FFI... yes
  217. checking size of char... 1
  218. checking size of short... 2
  219. checking size of int... 4
  220. checking size of long... 8
  221. checking for GIREPO... yes
  222. checking for gtkdoc-check... no
  223. checking for gtkdoc-rebase... no
  224. checking for gtkdoc-mkpdf... no
  225. checking whether to build gtk-doc documentation... no
  226. checking for ANSI C header files... (cached) yes
  227. checking fcntl.h usability... yes
  228. checking fcntl.h presence... yes
  229. checking for fcntl.h... yes
  230. checking for stdlib.h... (cached) yes
  231. checking for string.h... (cached) yes
  232. checking for an ANSI C-conforming const... yes
  233. checking for working strtod... yes
  234. checking for memchr... (cached) yes
  235. checking for strchr... yes
  236. checking for strspn... yes
  237. checking for strstr... yes
  238. checking for strtol... (cached) yes
  239. checking for strtoull... yes
  240. checking for backtrace... no
  241. checking for backtrace_symbols... no
  242. checking whether /usr/local/bin/python2.7 version >= 2.5... yes
  243. checking for /usr/local/bin/python2.7 version... 2.7
  244. checking for /usr/local/bin/python2.7 platform... freebsd9
  245. checking for /usr/local/bin/python2.7 script directory... ${prefix}/lib/python2.7/site-packages
  246. checking for /usr/local/bin/python2.7 extension module directory... ${exec_prefix}/lib/python2.7/site-packages
  247. checking for headers required to compile python extensions... found
  248. checking for glib source directory to use for documentation...
  249. configure: creating ./config.status
  250. config.status: creating Makefile
  251. config.status: creating m4/Makefile
  252. config.status: creating tests/Makefile
  253. config.status: creating tests/offsets/Makefile
  254. config.status: creating tests/scanner/Makefile
  255. config.status: creating tests/repository/Makefile
  256. config.status: creating tests/warn/Makefile
  257. config.status: creating tests/doctool/Makefile
  258. config.status: creating docs/Makefile
  259. config.status: creating docs/reference/Makefile
  260. config.status: creating gobject-introspection-1.0.pc
  261. config.status: creating gobject-introspection-no-export-1.0.pc
  262. config.status: creating config.h
  263. config.status: executing depfiles commands
  264. config.status: executing libtool commands
  265.  
  266. gobject-introspection 1.34.2
  267. ===============
  268.  
  269. tests: no
  270.  
  271. ===> Building for gobject-introspection-1.34.2
  272. [ -d gir ] || /bin/mkdir -p gir ; \
  273. sed \
  274. -e s,%CAIRO_SHARED_LIBRARY%,libcairo-gobject.so.2, \
  275. -e s,%CAIRO_GIR_PACKAGE%,cairo-gobject, \
  276. < gir/cairo-1.0.gir.in > gir/cairo-1.0.gir.tmp && mv gir/cairo-1.0.gir.tmp gir/cairo-1.0.gir
  277. gmake all-recursive
  278. gmake[1]: Entering directory `/usr/ports/devel/gobject-introspection/work/gobject-introspection-1.34.2'
  279. Making all in .
  280. gmake[2]: Entering directory `/usr/ports/devel/gobject-introspection/work/gobject-introspection-1.34.2'
  281. CC libgirepository_1_0_la-gdump.lo
  282. CC libgirepository_1_0_la-giarginfo.lo
  283. CC libgirepository_1_0_la-gibaseinfo.lo
  284. CC libgirepository_1_0_la-gicallableinfo.lo
  285. CC libgirepository_1_0_la-giconstantinfo.lo
  286. CC libgirepository_1_0_la-gienuminfo.lo
  287. CC libgirepository_1_0_la-gifieldinfo.lo
  288. CC libgirepository_1_0_la-gifunctioninfo.lo
  289. CC libgirepository_1_0_la-ginvoke.lo
  290. CC libgirepository_1_0_la-giinterfaceinfo.lo
  291. CC libgirepository_1_0_la-giobjectinfo.lo
  292. CC libgirepository_1_0_la-gipropertyinfo.lo
  293. CC libgirepository_1_0_la-giregisteredtypeinfo.lo
  294. CC libgirepository_1_0_la-girepository.lo
  295. CC libgirepository_1_0_la-girffi.lo
  296. CC libgirepository_1_0_la-gisignalinfo.lo
  297. CC libgirepository_1_0_la-gistructinfo.lo
  298. CC libgirepository_1_0_la-gitypeinfo.lo
  299. CC libgirepository_1_0_la-gitypelib.lo
  300. CC libgirepository_1_0_la-giunioninfo.lo
  301. CC libgirepository_1_0_la-givfuncinfo.lo
  302. CC libgirepository_gthash_la-gthash.lo
  303. CC libcmph_la-bdz.lo
  304. CC libcmph_la-bdz_ph.lo
  305. CC libcmph_la-bmz8.lo
  306. CC libcmph_la-bmz.lo
  307. CC libcmph_la-brz.lo
  308. CC libcmph_la-buffer_entry.lo
  309. CC libcmph_la-buffer_manager.lo
  310. CC libcmph_la-chd.lo
  311. CC libcmph_la-chd_ph.lo
  312. CC libcmph_la-chm.lo
  313. CC libcmph_la-cmph.lo
  314. CC libcmph_la-cmph_structs.lo
  315. CC libcmph_la-compressed_rank.lo
  316. CC libcmph_la-compressed_seq.lo
  317. CC libcmph_la-fch_buckets.lo
  318. CC libcmph_la-fch.lo
  319. CC libcmph_la-graph.lo
  320. CC libcmph_la-hash.lo
  321. CC libcmph_la-jenkins_hash.lo
  322. CC libcmph_la-miller_rabin.lo
  323. CC libcmph_la-select.lo
  324. CC libcmph_la-vqueue.lo
  325. CC libcmph_la-vstack.lo
  326. CCLD libcmph.la
  327. CCLD libgirepository-gthash.la
  328. CCLD libgirepository-1.0.la
  329. CC libgirepository_internals_la-girmodule.lo
  330. CC libgirepository_internals_la-girnode.lo
  331. CC libgirepository_internals_la-giroffsets.lo
  332. CC libgirepository_internals_la-girparser.lo
  333. CC libgirepository_internals_la-girwriter.lo
  334. CCLD libgirepository-internals.la
  335. CC libgiscanner_la-sourcescanner.lo
  336. CC libgiscanner_la-scannerlexer.lo
  337. scannerlexer.c: In function 'yy_scan_bytes':
  338. scannerlexer.c:2495: warning: comparison between signed and unsigned
  339. CC libgiscanner_la-scannerparser.lo
  340. CCLD libgiscanner.la
  341. CC _giscanner_la-giscannermodule.lo
  342. In file included from /usr/local/include/glib-2.0/glib/deprecated/gthread.h:124,
  343. from /usr/local/include/glib-2.0/glib.h:108,
  344. from giscanner/sourcescanner.h:26,
  345. from giscanner/giscannermodule.c:26:
  346. /usr/local/include/pth/pthread.h:517:1: warning: "fork" redefined
  347. In file included from /usr/local/include/python2.7/Python.h:166,
  348. from giscanner/giscannermodule.c:25:
  349. /usr/local/include/pth/pth.h:557:1: warning: this is the location of the previous definition
  350. In file included from /usr/local/include/glib-2.0/glib/deprecated/gthread.h:124,
  351. from /usr/local/include/glib-2.0/glib.h:108,
  352. from giscanner/sourcescanner.h:26,
  353. from giscanner/giscannermodule.c:26:
  354. /usr/local/include/pth/pthread.h:518:1: warning: "sleep" redefined
  355. In file included from /usr/local/include/python2.7/Python.h:166,
  356. from giscanner/giscannermodule.c:25:
  357. /usr/local/include/pth/pth.h:562:1: warning: this is the location of the previous definition
  358. In file included from /usr/local/include/glib-2.0/glib/deprecated/gthread.h:124,
  359. from /usr/local/include/glib-2.0/glib.h:108,
  360. from giscanner/sourcescanner.h:26,
  361. from giscanner/giscannermodule.c:26:
  362. /usr/local/include/pth/pthread.h:519:1: warning: "nanosleep" redefined
  363. In file included from /usr/local/include/python2.7/Python.h:166,
  364. from giscanner/giscannermodule.c:25:
  365. /usr/local/include/pth/pth.h:560:1: warning: this is the location of the previous definition
  366. In file included from /usr/local/include/glib-2.0/glib/deprecated/gthread.h:124,
  367. from /usr/local/include/glib-2.0/glib.h:108,
  368. from giscanner/sourcescanner.h:26,
  369. from giscanner/giscannermodule.c:26:
  370. /usr/local/include/pth/pthread.h:520:1: warning: "usleep" redefined
  371. In file included from /usr/local/include/python2.7/Python.h:166,
  372. from giscanner/giscannermodule.c:25:
  373. /usr/local/include/pth/pth.h:561:1: warning: this is the location of the previous definition
  374. In file included from /usr/local/include/glib-2.0/glib/deprecated/gthread.h:124,
  375. from /usr/local/include/glib-2.0/glib.h:108,
  376. from giscanner/sourcescanner.h:26,
  377. from giscanner/giscannermodule.c:26:
  378. /usr/local/include/pth/pthread.h:521:1: warning: "system" redefined
  379. In file included from /usr/local/include/python2.7/Python.h:166,
  380. from giscanner/giscannermodule.c:25:
  381. /usr/local/include/pth/pth.h:559:1: warning: this is the location of the previous definition
  382. In file included from /usr/local/include/glib-2.0/glib/deprecated/gthread.h:124,
  383. from /usr/local/include/glib-2.0/glib.h:108,
  384. from giscanner/sourcescanner.h:26,
  385. from giscanner/giscannermodule.c:26:
  386. /usr/local/include/pth/pthread.h:522:1: warning: "sigwait" redefined
  387. In file included from /usr/local/include/python2.7/Python.h:166,
  388. from giscanner/giscannermodule.c:25:
  389. /usr/local/include/pth/pth.h:564:1: warning: this is the location of the previous definition
  390. In file included from /usr/local/include/glib-2.0/glib/deprecated/gthread.h:124,
  391. from /usr/local/include/glib-2.0/glib.h:108,
  392. from giscanner/sourcescanner.h:26,
  393. from giscanner/giscannermodule.c:26:
  394. /usr/local/include/pth/pthread.h:523:1: warning: "waitpid" redefined
  395. In file included from /usr/local/include/python2.7/Python.h:166,
  396. from giscanner/giscannermodule.c:25:
  397. /usr/local/include/pth/pth.h:558:1: warning: this is the location of the previous definition
  398. In file included from /usr/local/include/glib-2.0/glib/deprecated/gthread.h:124,
  399. from /usr/local/include/glib-2.0/glib.h:108,
  400. from giscanner/sourcescanner.h:26,
  401. from giscanner/giscannermodule.c:26:
  402. /usr/local/include/pth/pthread.h:524:1: warning: "connect" redefined
  403. In file included from /usr/local/include/python2.7/Python.h:166,
  404. from giscanner/giscannermodule.c:25:
  405. /usr/local/include/pth/pth.h:568:1: warning: this is the location of the previous definition
  406. In file included from /usr/local/include/glib-2.0/glib/deprecated/gthread.h:124,
  407. from /usr/local/include/glib-2.0/glib.h:108,
  408. from giscanner/sourcescanner.h:26,
  409. from giscanner/giscannermodule.c:26:
  410. /usr/local/include/pth/pthread.h:525:1: warning: "accept" redefined
  411. In file included from /usr/local/include/python2.7/Python.h:166,
  412. from giscanner/giscannermodule.c:25:
  413. /usr/local/include/pth/pth.h:569:1: warning: this is the location of the previous definition
  414. In file included from /usr/local/include/glib-2.0/glib/deprecated/gthread.h:124,
  415. from /usr/local/include/glib-2.0/glib.h:108,
  416. from giscanner/sourcescanner.h:26,
  417. from giscanner/giscannermodule.c:26:
  418. /usr/local/include/pth/pthread.h:526:1: warning: "select" redefined
  419. In file included from /usr/local/include/python2.7/Python.h:166,
  420. from giscanner/giscannermodule.c:25:
  421. /usr/local/include/pth/pth.h:565:1: warning: this is the location of the previous definition
  422. In file included from /usr/local/include/glib-2.0/glib/deprecated/gthread.h:124,
  423. from /usr/local/include/glib-2.0/glib.h:108,
  424. from giscanner/sourcescanner.h:26,
  425. from giscanner/giscannermodule.c:26:
  426. /usr/local/include/pth/pthread.h:527:1: warning: "poll" redefined
  427. In file included from /usr/local/include/python2.7/Python.h:166,
  428. from giscanner/giscannermodule.c:25:
  429. /usr/local/include/pth/pth.h:567:1: warning: this is the location of the previous definition
  430. In file included from /usr/local/include/glib-2.0/glib/deprecated/gthread.h:124,
  431. from /usr/local/include/glib-2.0/glib.h:108,
  432. from giscanner/sourcescanner.h:26,
  433. from giscanner/giscannermodule.c:26:
  434. /usr/local/include/pth/pthread.h:528:1: warning: "read" redefined
  435. In file included from /usr/local/include/python2.7/Python.h:166,
  436. from giscanner/giscannermodule.c:25:
  437. /usr/local/include/pth/pth.h:570:1: warning: this is the location of the previous definition
  438. In file included from /usr/local/include/glib-2.0/glib/deprecated/gthread.h:124,
  439. from /usr/local/include/glib-2.0/glib.h:108,
  440. from giscanner/sourcescanner.h:26,
  441. from giscanner/giscannermodule.c:26:
  442. /usr/local/include/pth/pthread.h:529:1: warning: "write" redefined
  443. In file included from /usr/local/include/python2.7/Python.h:166,
  444. from giscanner/giscannermodule.c:25:
  445. /usr/local/include/pth/pth.h:571:1: warning: this is the location of the previous definition
  446. In file included from /usr/local/include/glib-2.0/glib/deprecated/gthread.h:124,
  447. from /usr/local/include/glib-2.0/glib.h:108,
  448. from giscanner/sourcescanner.h:26,
  449. from giscanner/giscannermodule.c:26:
  450. /usr/local/include/pth/pthread.h:530:1: warning: "readv" redefined
  451. In file included from /usr/local/include/python2.7/Python.h:166,
  452. from giscanner/giscannermodule.c:25:
  453. /usr/local/include/pth/pth.h:572:1: warning: this is the location of the previous definition
  454. In file included from /usr/local/include/glib-2.0/glib/deprecated/gthread.h:124,
  455. from /usr/local/include/glib-2.0/glib.h:108,
  456. from giscanner/sourcescanner.h:26,
  457. from giscanner/giscannermodule.c:26:
  458. /usr/local/include/pth/pthread.h:531:1: warning: "writev" redefined
  459. In file included from /usr/local/include/python2.7/Python.h:166,
  460. from giscanner/giscannermodule.c:25:
  461. /usr/local/include/pth/pth.h:573:1: warning: this is the location of the previous definition
  462. In file included from /usr/local/include/glib-2.0/glib/deprecated/gthread.h:124,
  463. from /usr/local/include/glib-2.0/glib.h:108,
  464. from giscanner/sourcescanner.h:26,
  465. from giscanner/giscannermodule.c:26:
  466. /usr/local/include/pth/pthread.h:532:1: warning: "recv" redefined
  467. In file included from /usr/local/include/python2.7/Python.h:166,
  468. from giscanner/giscannermodule.c:25:
  469. /usr/local/include/pth/pth.h:574:1: warning: this is the location of the previous definition
  470. In file included from /usr/local/include/glib-2.0/glib/deprecated/gthread.h:124,
  471. from /usr/local/include/glib-2.0/glib.h:108,
  472. from giscanner/sourcescanner.h:26,
  473. from giscanner/giscannermodule.c:26:
  474. /usr/local/include/pth/pthread.h:533:1: warning: "send" redefined
  475. In file included from /usr/local/include/python2.7/Python.h:166,
  476. from giscanner/giscannermodule.c:25:
  477. /usr/local/include/pth/pth.h:575:1: warning: this is the location of the previous definition
  478. In file included from /usr/local/include/glib-2.0/glib/deprecated/gthread.h:124,
  479. from /usr/local/include/glib-2.0/glib.h:108,
  480. from giscanner/sourcescanner.h:26,
  481. from giscanner/giscannermodule.c:26:
  482. /usr/local/include/pth/pthread.h:534:1: warning: "recvfrom" redefined
  483. In file included from /usr/local/include/python2.7/Python.h:166,
  484. from giscanner/giscannermodule.c:25:
  485. /usr/local/include/pth/pth.h:576:1: warning: this is the location of the previous definition
  486. In file included from /usr/local/include/glib-2.0/glib/deprecated/gthread.h:124,
  487. from /usr/local/include/glib-2.0/glib.h:108,
  488. from giscanner/sourcescanner.h:26,
  489. from giscanner/giscannermodule.c:26:
  490. /usr/local/include/pth/pthread.h:535:1: warning: "sendto" redefined
  491. In file included from /usr/local/include/python2.7/Python.h:166,
  492. from giscanner/giscannermodule.c:25:
  493. /usr/local/include/pth/pth.h:577:1: warning: this is the location of the previous definition
  494. In file included from /usr/local/include/glib-2.0/glib/deprecated/gthread.h:124,
  495. from /usr/local/include/glib-2.0/glib.h:108,
  496. from giscanner/sourcescanner.h:26,
  497. from giscanner/giscannermodule.c:26:
  498. /usr/local/include/pth/pthread.h:536:1: warning: "pread" redefined
  499. In file included from /usr/local/include/python2.7/Python.h:166,
  500. from giscanner/giscannermodule.c:25:
  501. /usr/local/include/pth/pth.h:578:1: warning: this is the location of the previous definition
  502. In file included from /usr/local/include/glib-2.0/glib/deprecated/gthread.h:124,
  503. from /usr/local/include/glib-2.0/glib.h:108,
  504. from giscanner/sourcescanner.h:26,
  505. from giscanner/giscannermodule.c:26:
  506. /usr/local/include/pth/pthread.h:537:1: warning: "pwrite" redefined
  507. In file included from /usr/local/include/python2.7/Python.h:166,
  508. from giscanner/giscannermodule.c:25:
  509. /usr/local/include/pth/pth.h:579:1: warning: this is the location of the previous definition
  510. In file included from /usr/local/include/python2.7/Python.h:127,
  511. from giscanner/giscannermodule.c:26:
  512. /usr/local/include/python2.7/modsupport.h:27: warning: 'PyArg_ParseTuple' is an unrecognized format function type
  513. In file included from /usr/local/include/glib-2.0/glib/deprecated/gthread.h:125,
  514. from /usr/local/include/glib-2.0/glib.h:109,
  515. from giscanner/sourcescanner.h:27,
  516. from giscanner/giscannermodule.c:27:
  517. /usr/local/include/pth/pthread.h:285: error: conflicting types for 'pthread_t'
  518. /usr/include/sys/_pthreadtypes.h:65: error: previous declaration of 'pthread_t' was here
  519. /usr/local/include/pth/pthread.h:286: error: conflicting types for 'pthread_attr_t'
  520. /usr/include/sys/_pthreadtypes.h:68: error: previous declaration of 'pthread_attr_t' was here
  521. /usr/local/include/pth/pthread.h:288: error: conflicting types for 'pthread_once_t'
  522. /usr/include/sys/_pthreadtypes.h:74: error: previous declaration of 'pthread_once_t' was here
  523. /usr/local/include/pth/pthread.h:289: error: conflicting types for 'pthread_mutexattr_t'
  524. /usr/include/sys/_pthreadtypes.h:70: error: previous declaration of 'pthread_mutexattr_t' was here
  525. /usr/local/include/pth/pthread.h:290: error: conflicting types for 'pthread_mutex_t'
  526. /usr/include/sys/_pthreadtypes.h:69: error: previous declaration of 'pthread_mutex_t' was here
  527. /usr/local/include/pth/pthread.h:291: error: conflicting types for 'pthread_condattr_t'
  528. /usr/include/sys/_pthreadtypes.h:72: error: previous declaration of 'pthread_condattr_t' was here
  529. /usr/local/include/pth/pthread.h:292: error: conflicting types for 'pthread_cond_t'
  530. /usr/include/sys/_pthreadtypes.h:71: error: previous declaration of 'pthread_cond_t' was here
  531. /usr/local/include/pth/pthread.h:293: error: conflicting types for 'pthread_rwlockattr_t'
  532. /usr/include/sys/_pthreadtypes.h:76: error: previous declaration of 'pthread_rwlockattr_t' was here
  533. /usr/local/include/pth/pthread.h:294: error: conflicting types for 'pthread_rwlock_t'
  534. /usr/include/sys/_pthreadtypes.h:75: error: previous declaration of 'pthread_rwlock_t' was here
  535. /usr/local/include/pth/pthread.h:357: error: conflicting types for 'pthread_kill'
  536. /usr/include/signal.h:71: error: previous declaration of 'pthread_kill' was here
  537. gmake[2]: *** [_giscanner_la-giscannermodule.lo] Error 1
  538. gmake[2]: Leaving directory `/usr/ports/devel/gobject-introspection/work/gobject-introspection-1.34.2'
  539. gmake[1]: *** [all-recursive] Error 1
  540. gmake[1]: Leaving directory `/usr/ports/devel/gobject-introspection/work/gobject-introspection-1.34.2'
  541. gmake: *** [all] Error 2
  542. *** [do-build] Error code 1
  543.  
  544. Stop in /usr/ports/devel/gobject-introspection.
  545. *** [build-depends] Error code 1
  546.  
  547. Stop in /usr/ports/x11-toolkits/pango.
  548. *** [install] Error code 1
  549.  
  550. Stop in /usr/ports/x11-toolkits/pango.
  551. *** [lib-depends] Error code 1
  552.  
  553. Stop in /usr/ports/x11-wm/i3.
  554.  
  555.  
  556.  
  557. Below is my make.conf:
  558.  
  559.  
  560. #CPUTYPE?=native #not necessary
  561.  
  562. QT4_OPTIONS=CUPS QGTKSTYLE
  563. KDE4_PREFIX=/usr/local
  564. WITHOUT_NOUVEAU=yes
  565. MAKE_JOBS_NUMBER?=8 #number of cores x2
  566. WITH_NEW_XORG=yes
  567. WITHOUT_NLS=yes
  568. WITHOUT_DEBUG=yes
  569. NO_NIS=yes
  570.  
  571. # added by use.perl 2013-04-24 00:16:48
  572. PERL_VERSION=5.14.2
  573.  
  574. #for CCache
  575. #CCACHE
  576. .if !defined(NO_CCACHE)
  577. CC= /usr/local/libexec/ccache/world/cc
  578. CCX= /usr/local/libexec/ccache/world/c++
  579. .endif
  580.  
  581. .if ${.CURDIR:M*/ports/devel/ccache}
  582. NO_CCACHE=yes
  583. .endif
  584.  
  585. #Breaks i3wm and some other packages
  586. #For GCC 4.8 (latest stable)
  587. #.if !empty(.CURDIR:M/usr/ports/*) && exists(/usr/local/bin/gcc48)
  588. #CC=gcc48
  589. #CXX=g++48
  590. #CPP=cpp48
  591. #CFLAGS+=-march=native
  592. #.endif
Advertisement
Add Comment
Please, Sign In to add comment