Pastebin launched a little side project called HostCabi.net, check it out ;-)Don't like ads? PRO users don't see any ads ;-)
Guest

kdevplatform-git-aur-110511

By: a guest on May 10th, 2011  |  syntax: None  |  size: 4.17 KB  |  hits: 60  |  expires: Never
download  |  raw  |  embed  |  report abuse  |  print
Text below is selected. Please press Ctrl+C to copy to your clipboard. (⌘+C on Mac)
  1. [ 18%] Building CXX object language/CMakeFiles/kdevplatformlanguage.dir/duchain/duchain.o
  2. In file included from /tmp/yaourt-tmp-poe/aur-kdevplatform-git/src/kdevplatform/language/duchain/duchain.cpp:60:0:
  3. /tmp/yaourt-tmp-poe/aur-kdevplatform-git/src/kdevplatform/language/duchain/duchainregister.h: In constructor ‘KDevelop::DUChainItemRegistrator<T, Data>::DUChainItemRegistrator()’:
  4. /tmp/yaourt-tmp-poe/aur-kdevplatform-git/src/kdevplatform/language/duchain/duchainregister.h:163:50: error: expected primary-expression before ‘,’ token
  5. /tmp/yaourt-tmp-poe/aur-kdevplatform-git/src/kdevplatform/language/duchain/duchainregister.h:163:56: error: expected primary-expression before ‘>’ token
  6. /tmp/yaourt-tmp-poe/aur-kdevplatform-git/src/kdevplatform/language/duchain/duchainregister.h:163:58: error: expected primary-expression before ‘)’ token
  7. /tmp/yaourt-tmp-poe/aur-kdevplatform-git/src/kdevplatform/language/duchain/duchainregister.h: In destructor ‘KDevelop::DUChainItemRegistrator<T, Data>::~DUChainItemRegistrator()’:
  8. /tmp/yaourt-tmp-poe/aur-kdevplatform-git/src/kdevplatform/language/duchain/duchainregister.h:166:52: error: expected primary-expression before ‘,’ token
  9. /tmp/yaourt-tmp-poe/aur-kdevplatform-git/src/kdevplatform/language/duchain/duchainregister.h:166:58: error: expected primary-expression before ‘>’ token
  10. /tmp/yaourt-tmp-poe/aur-kdevplatform-git/src/kdevplatform/language/duchain/duchainregister.h:166:60: error: expected primary-expression before ‘)’ token
  11. /tmp/yaourt-tmp-poe/aur-kdevplatform-git/src/kdevplatform/language/duchain/duchain.cpp: In member function ‘void KDevelop::DUChainPrivate::removeEnvironmentInformation(KDevelop::ParsingEnvironmentFilePointer)’:
  12. /tmp/yaourt-tmp-poe/aur-kdevplatform-git/src/kdevplatform/language/duchain/duchain.cpp:471:10: warning: unused variable ‘removed’ [-Wunused-variable]
  13. /tmp/yaourt-tmp-poe/aur-kdevplatform-git/src/kdevplatform/language/duchain/duchain.cpp:473:10: warning: unused variable ‘removed2’ [-Wunused-variable]
  14. /tmp/yaourt-tmp-poe/aur-kdevplatform-git/src/kdevplatform/language/duchain/duchain.cpp: In member function ‘void KDevelop::DUChainPrivate::doMoreCleanup(int, bool)’:
  15. /tmp/yaourt-tmp-poe/aur-kdevplatform-git/src/kdevplatform/language/duchain/duchain.cpp:862:14: warning: unused variable ‘opened’ [-Wunused-variable]
  16. /tmp/yaourt-tmp-poe/aur-kdevplatform-git/src/kdevplatform/language/duchain/duchain.cpp:872:14: warning: unused variable ‘opened’ [-Wunused-variable]
  17. /tmp/yaourt-tmp-poe/aur-kdevplatform-git/src/kdevplatform/language/duchain/duchain.cpp: In member function ‘void KDevelop::DUChain::addToEnvironmentManager(KDevelop::TopDUContext*)’:
  18. /tmp/yaourt-tmp-poe/aur-kdevplatform-git/src/kdevplatform/language/duchain/duchain.cpp:1255:30: warning: unused variable ‘alreadyHave’ [-Wunused-variable]
  19. In file included from /tmp/yaourt-tmp-poe/aur-kdevplatform-git/src/kdevplatform/language/duchain/../interfaces/../duchain/duchainbase.h:26:0,
  20.                  from /tmp/yaourt-tmp-poe/aur-kdevplatform-git/src/kdevplatform/language/duchain/../interfaces/iproblem.h:31,
  21.                  from /tmp/yaourt-tmp-poe/aur-kdevplatform-git/src/kdevplatform/language/duchain/duchainobserver.h:29,
  22.                  from /tmp/yaourt-tmp-poe/aur-kdevplatform-git/src/kdevplatform/language/duchain/duchain.h:25,
  23.                  from /tmp/yaourt-tmp-poe/aur-kdevplatform-git/src/kdevplatform/language/duchain/duchain.cpp:20:
  24. /tmp/yaourt-tmp-poe/aur-kdevplatform-git/src/kdevplatform/language/duchain/../interfaces/../duchain/appendedlist.h: In constructor ‘KDevelop::TemporaryDataManager<T, threadSafe>::TemporaryDataManager(QString) [with T = KDevVarLengthArray<unsigned int, 10>, bool threadSafe = true]’:
  25. /tmp/yaourt-tmp-poe/aur-kdevplatform-git/src/kdevplatform/language/duchain/duchain.cpp:97:1:   instantiated from here
  26. /tmp/yaourt-tmp-poe/aur-kdevplatform-git/src/kdevplatform/language/duchain/../interfaces/../duchain/appendedlist.h:70:12: warning: unused variable ‘first’ [-Wunused-variable]
  27. make[2]: *** [language/CMakeFiles/kdevplatformlanguage.dir/duchain/duchain.o] Błąd 1
  28. make[1]: *** [language/CMakeFiles/kdevplatformlanguage.dir/all] Error 2
  29. make: *** [all] Error 2