daily pastebin goal
43%
SHARE
TWEET

py-mini-racer error python with pydebug

a guest Nov 16th, 2018 101 Never
Upgrade to PRO!
ENDING IN00days00hours00mins00secs
 
  1. $ python setup.py build
  2. running build
  3. running build_py
  4. running egg_info
  5. writing py_mini_racer.egg-info/PKG-INFO
  6. writing top-level names to py_mini_racer.egg-info/top_level.txt
  7. writing dependency_links to py_mini_racer.egg-info/dependency_links.txt
  8. reading manifest file 'py_mini_racer.egg-info/SOURCES.txt'
  9. reading manifest template 'MANIFEST.in'
  10. warning: no previously-included files matching '__pycache__' found under directory '*'
  11. warning: no previously-included files matching '*.py[co]' found under directory '*'
  12. writing manifest file 'py_mini_racer.egg-info/SOURCES.txt'
  13. running build_ext
  14. running build_v8
  15. building v8
  16. DEBUG:py_mini_racer.extension.v8_build:Calling: 'gclient fetch' from working directory /home/pablo/src/sqreen/PyMiniRacer/py_mini_racer/extension/v8
  17. git fetch: 100% (13/13), done.                    
  18. DEBUG:py_mini_racer.extension.v8_build:Calling: 'git checkout 5.1.281.67 -- .' from working directory /home/pablo/src/sqreen/PyMiniRacer/py_mini_racer/extension/v8/v8
  19. DEBUG:py_mini_racer.extension.v8_build:Calling: 'gclient sync' from working directory /home/pablo/src/sqreen/PyMiniRacer/py_mini_racer/extension/v8
  20. Syncing projects: 100% (13/13), done.                    
  21.  
  22. ________ running 'download_from_google_storage --no_resume --platform=win32 --no_auth --bucket chromium-clang-format -s v8/buildtools/win/clang-format.exe.sha1' in '/home/pablo/src/sqreen/PyMiniRacer/py_mini_racer/extension/v8'
  23. The current platform doesn't match "win32", skipping.
  24.  
  25. ________ running 'download_from_google_storage --no_resume --platform=darwin --no_auth --bucket chromium-clang-format -s v8/buildtools/mac/clang-format.sha1' in '/home/pablo/src/sqreen/PyMiniRacer/py_mini_racer/extension/v8'
  26. The current platform doesn't match "darwin", skipping.
  27.  
  28. ________ running '/home/pablo/src/sqreen/AgentDaemon/env27dbg/bin/python v8/tools/gcmole/download_gcmole_tools.py' in '/home/pablo/src/sqreen/PyMiniRacer/py_mini_racer/extension/v8'
  29. Skipping gcmole download as gcmole is not set in gyp flags.
  30.  
  31. ________ running '/home/pablo/src/sqreen/AgentDaemon/env27dbg/bin/python v8/tools/jsfunfuzz/download_jsfunfuzz.py' in '/home/pablo/src/sqreen/PyMiniRacer/py_mini_racer/extension/v8'
  32. Skipping jsfunfuzz download as jsfunfuzz is not set in gyp flags.
  33.  
  34. ________ running 'download_from_google_storage --no_resume --platform=win32 --no_auth --bucket chromium-luci -d v8/tools/luci-go/win64' in '/home/pablo/src/sqreen/PyMiniRacer/py_mini_racer/extension/v8'
  35. The current platform doesn't match "win32", skipping.
  36.  
  37. ________ running 'download_from_google_storage --no_resume --platform=darwin --no_auth --bucket chromium-luci -d v8/tools/luci-go/mac64' in '/home/pablo/src/sqreen/PyMiniRacer/py_mini_racer/extension/v8'
  38. The current platform doesn't match "darwin", skipping.
  39. Running hooks:  58% (10/17) gn_win
  40. ________ running 'download_from_google_storage --no_resume --platform=win32 --no_auth --bucket chromium-gn -s v8/buildtools/win/gn.exe.sha1' in '/home/pablo/src/sqreen/PyMiniRacer/py_mini_racer/extension/v8'
  41. The current platform doesn't match "win32", skipping.
  42. Running hooks:  64% (11/17) gn_mac
  43. ________ running 'download_from_google_storage --no_resume --platform=darwin --no_auth --bucket chromium-gn -s v8/buildtools/mac/gn.sha1' in '/home/pablo/src/sqreen/PyMiniRacer/py_mini_racer/extension/v8'
  44. The current platform doesn't match "darwin", skipping.
  45. Running hooks:  88% (15/17) gold_plugin  
  46. ________ running '/home/pablo/src/sqreen/AgentDaemon/env27dbg/bin/python v8/build/download_gold_plugin.py' in '/home/pablo/src/sqreen/PyMiniRacer/py_mini_racer/extension/v8'
  47. Skipping gold plugin download for non-cfi build.
  48. Running hooks:  94% (16/17) clang      
  49. ________ running '/home/pablo/src/sqreen/AgentDaemon/env27dbg/bin/python v8/tools/clang/scripts/update.py --if-needed' in '/home/pablo/src/sqreen/PyMiniRacer/py_mini_racer/extension/v8'
  50. Updating Clang to 264915-1...
  51. Clang is already up to date.
  52. Running hooks: 100% (17/17)      
  53. ________ running '/home/pablo/src/sqreen/AgentDaemon/env27dbg/bin/python v8/build/gyp_v8' in '/home/pablo/src/sqreen/PyMiniRacer/py_mini_racer/extension/v8'
  54. Updating projects from gyp files...
  55. Running hooks: 100% (17/17), done.
  56. DEBUG:py_mini_racer.extension.v8_build:Calling: 'make native -j 6 i18nsupport=off werror=no GYP_DEFINES="v8_use_external_startup_data=0 linux_use_bundled_gold=0"' from working directory /home/pablo/src/sqreen/PyMiniRacer/py_mini_racer/extension/v8/v8
  57. PYTHONPATH="/home/pablo/src/sqreen/PyMiniRacer/py_mini_racer/extension/v8/v8/tools/generate_shim_headers:/home/pablo/src/sqreen/PyMiniRacer/py_mini_racer/extension/v8/v8/build::/home/pablo/src/sqreen/PyMiniRacer/py_mini_racer/extension/v8/v8/build/gyp/pylib:" \
  58. GYP_GENERATORS=make \
  59. build/gyp/gyp --generator-output="out" build/all.gyp \
  60.               -Ibuild/standalone.gypi --depth=. -S.native  -Dv8_enable_backtrace=1 -Dwerror='' -Dv8_enable_i18n_support=0 -Darm_fpu=default -Darm_float_abi=default
  61. make[1]: Entering directory '/home/pablo/src/sqreen/PyMiniRacer/py_mini_racer/extension/v8/v8/out'
  62.   CXX(target) /home/pablo/src/sqreen/PyMiniRacer/py_mini_racer/extension/v8/v8/out/native/obj.target/v8_base/src/allocation-site-scopes.o
  63.   CXX(target) /home/pablo/src/sqreen/PyMiniRacer/py_mini_racer/extension/v8/v8/out/native/obj.target/v8_base/src/api-experimental.o
  64.   CXX(target) /home/pablo/src/sqreen/PyMiniRacer/py_mini_racer/extension/v8/v8/out/native/obj.target/v8_base/src/api.o
  65.   CXX(target) /home/pablo/src/sqreen/PyMiniRacer/py_mini_racer/extension/v8/v8/out/native/obj.target/v8_base/src/allocation.o
  66.   CXX(target) /home/pablo/src/sqreen/PyMiniRacer/py_mini_racer/extension/v8/v8/out/native/obj.target/v8_base/src/accessors.o
  67.   CXX(target) /home/pablo/src/sqreen/PyMiniRacer/py_mini_racer/extension/v8/v8/out/native/obj.target/v8_base/src/address-map.o
  68. In file included from ../src/allocation-site-scopes.cc:5:
  69. In file included from .././src/allocation-site-scopes.h:8:
  70. In file included from .././src/ast/ast.h:8:
  71. In file included from .././src/assembler.h:38:
  72. In file included from .././src/allocation.h:8:
  73. In file included from .././src/globals.h:11:
  74. In file included from /usr/lib/gcc/x86_64-linux-gnu/7.3.0/../../../../include/c++/7.3.0/ostream:38:
  75. In file included from /usr/lib/gcc/x86_64-linux-gnu/7.3.0/../../../../include/c++/7.3.0/ios:42:
  76. In file included from /usr/lib/gcc/x86_64-linux-gnu/7.3.0/../../../../include/c++/7.3.0/bits/ios_base.h:41:
  77. In file included from /usr/lib/gcc/x86_64-linux-gnu/7.3.0/../../../../include/c++/7.3.0/bits/locale_classes.h:40:
  78. In file included from /usr/lib/gcc/x86_64-linux-gnu/7.3.0/../../../../include/c++/7.3.0/string:52:
  79. In file included from /usr/lib/gcc/x86_64-linux-gnu/7.3.0/../../../../include/c++/7.3.0/bits/basic_string.h:6352:
  80. In file included from /usr/lib/gcc/x86_64-linux-gnu/7.3.0/../../../../include/c++/7.3.0/ext/string_conversions.h:41:
  81. In file included from In file included from ../src/allocation.cc../src/address-map.cc:5:
  82. :In file included from In file included from .././src/address-map.h:8:
  83. In file included from .././src/assert-scope.h:/usr/lib/gcc/x86_64-linux-gnu/7.3.0/../../../../include/c++/7.3.0/cstdlib9:
  84. 5In file included from :
  85. :.././src/base/macros.h77:
  86. :15:
  87. /usr/lib/gcc/x86_64-linux-gnu/7.3.0/../../../../include/c++/7.3.0/bits/std_abs.hIn file included from :.././src/base/logging.h102::93:
  88. :In file included from  error: /usr/lib/gcc/x86_64-linux-gnu/7.3.0/../../../../include/c++/7.3.0/sstreamsupport: 38for:
  89.  In file included from type/usr/lib/gcc/x86_64-linux-gnu/7.3.0/../../../../include/c++/7.3.0/istream :'__float128'38 :
  90. isIn file included from  /usr/lib/gcc/x86_64-linux-gnu/7.3.0/../../../../include/c++/7.3.0/iosnot:
  91. 42      :
  92. yetIn file included from  /usr/lib/gcc/x86_64-linux-gnu/7.3.0/../../../../include/c++/7.3.0/bits/ios_base.himplemented:41
  93. :
  94. In file included from /usr/lib/gcc/x86_64-linux-gnu/7.3.0/../../../../include/c++/7.3.0/bits/locale_classes.hIn file included from :40:
  95.   abs(__float128 __x)In file included from /usr/lib/gcc/x86_64-linux-gnu/7.3.0/../../../../include/c++/7.3.0/string:52
  96. :
  97. In file included from /usr/lib/gcc/x86_64-linux-gnu/7.3.0/../../../../include/c++/7.3.0/bits/basic_string.h:6352:
  98. In file included from /usr/lib/gcc/x86_64-linux-gnu/7.3.0/../../../../include/c++/7.3.0/ext/string_conversions.h:.././src/allocation.h41::
  99. In file included from /usr/lib/gcc/x86_64-linux-gnu/7.3.0/../../../../include/c++/7.3.0/cstdlib:8:
  100. 77:
  101. /usr/lib/gcc/x86_64-linux-gnu/7.3.0/../../../../include/c++/7.3.0/bits/std_abs.h:102:3: error:   ^support
  102.  for type '__float128' is not/usr/lib/gcc/x86_64-linux-gnu/7.3.0/../../../../include/c++/7.3.0/bits/std_abs.h
  103. :      102yet: 18implemented:
  104. error: support for type '__float128'   abs(__float128 __x)is
  105.  
  106.         ^not
  107.  yet implemented
  108. /usr/lib/gcc/x86_64-linux-gnu/7.3.0/../../../../include/c++/7.3.0/bits/std_abs.h:102:18:  abs(__float128 __x)
  109.                  ^error
  110. : support for type '__float128' is
  111.       not yet implemented
  112.   abs(__float128 __x)
  113.                  ^
  114. In file included from .././src/globals.h:11:
  115. In file included from /usr/lib/gcc/x86_64-linux-gnu/7.3.0/../../../../include/c++/7.3.0/ostream:38:
  116. In file included from /usr/lib/gcc/x86_64-linux-gnu/7.3.0/../../../../include/c++/7.3.0/ios:42:
  117. In file included from /usr/lib/gcc/x86_64-linux-gnu/7.3.0/../../../../include/c++/7.3.0/bits/ios_base.h:41:
  118. In file included from /usr/lib/gcc/x86_64-linux-gnu/7.3.0/../../../../include/c++/7.3.0/bits/locale_classes.h:40:
  119. In file included from /usr/lib/gcc/x86_64-linux-gnu/7.3.0/../../../../include/c++/7.3.0/string:52:
  120. In file included from /usr/lib/gcc/x86_64-linux-gnu/7.3.0/../../../../include/c++/7.3.0/bits/basic_string.h:6352:
  121. In file included from /usr/lib/gcc/x86_64-linux-gnu/7.3.0/../../../../include/c++/7.3.0/ext/string_conversions.h:41:
  122. In file included from /usr/lib/gcc/x86_64-linux-gnu/7.3.0/../../../../include/c++/7.3.0/cstdlib:77:
  123. /usr/lib/gcc/x86_64-linux-gnu/7.3.0/../../../../include/c++/7.3.0/bits/std_abs.h:102:3: error: support for type '__float128' is not
  124.       yet implemented
  125.   abs(__float128 __x)
  126.   ^
  127. /usr/lib/gcc/x86_64-linux-gnu/7.3.0/../../../../include/c++/7.3.0/bits/std_abs.h:102:18: error: support for type '__float128' is
  128.       not yet implemented
  129.   abs(__float128 __x)
  130.                  ^
  131. In file included from ../src/accessors.cc:5:
  132. In file included from .././src/accessors.h:9:
  133. In file included from .././src/allocation.h:8:
  134. In file included from .././src/globals.h:11:
  135. In file included from /usr/lib/gcc/x86_64-linux-gnu/7.3.0/../../../../include/c++/7.3.0/ostream:38:
  136. In file included from /usr/lib/gcc/x86_64-linux-gnu/7.3.0/../../../../include/c++/7.3.0/ios:42:
  137. In file included from /usr/lib/gcc/x86_64-linux-gnu/7.3.0/../../../../include/c++/7.3.0/bits/ios_base.h:41:
  138. In file included from /usr/lib/gcc/x86_64-linux-gnu/7.3.0/../../../../include/c++/7.3.0/bits/locale_classes.h:40:
  139. In file included from /usr/lib/gcc/x86_64-linux-gnu/7.3.0/../../../../include/c++/7.3.0/string:52:
  140. In file included from /usr/lib/gcc/x86_64-linux-gnu/7.3.0/../../../../include/c++/7.3.0/bits/basic_string.h:6352:
  141. In file included from /usr/lib/gcc/x86_64-linux-gnu/7.3.0/../../../../include/c++/7.3.0/ext/string_conversions.h:41:
  142. In file included from /usr/lib/gcc/x86_64-linux-gnu/7.3.0/../../../../include/c++/7.3.0/cstdlib:77:
  143. /usr/lib/gcc/x86_64-linux-gnu/7.3.0/../../../../include/c++/7.3.0/bits/std_abs.h:102:3: error: support for type '__float128' is not
  144.       yet implemented
  145.   abs(__float128 __x)
  146.   ^
  147. /usr/lib/gcc/x86_64-linux-gnu/7.3.0/../../../../include/c++/7.3.0/bits/std_abs.h:102:18: error: support for type '__float128' is
  148.       not yet implemented
  149.   abs(__float128 __x)
  150.                  ^
  151. In file included from ../src/api-experimental.cc:9:
  152. In file included from .././src/api-experimental.h:8:
  153. In file included from .././src/handles.h:9:
  154. In file included from .././src/base/functional.h:13:
  155. In file included from /usr/lib/gcc/x86_64-linux-gnu/7.3.0/../../../../include/c++/7.3.0/functional:54:
  156. In file included from /usr/lib/gcc/x86_64-linux-gnu/7.3.0/../../../../include/c++/7.3.0/tuple:39:
  157. In file included from /usr/lib/gcc/x86_64-linux-gnu/7.3.0/../../../../include/c++/7.3.0/array:39:
  158. In file included from /usr/lib/gcc/x86_64-linux-gnu/7.3.0/../../../../include/c++/7.3.0/stdexcept:39:
  159. In file included from /usr/lib/gcc/x86_64-linux-gnu/7.3.0/../../../../include/c++/7.3.0/string:52:
  160. In file included from /usr/lib/gcc/x86_64-linux-gnu/7.3.0/../../../../include/c++/7.3.0/bits/basic_string.h:6352:
  161. In file included from /usr/lib/gcc/x86_64-linux-gnu/7.3.0/../../../../include/c++/7.3.0/ext/string_conversions.h:41:
  162. In file included from /usr/lib/gcc/x86_64-linux-gnu/7.3.0/../../../../include/c++/7.3.0/cstdlib:77:
  163. /usr/lib/gcc/x86_64-linux-gnu/7.3.0/../../../../include/c++/7.3.0/bits/std_abs.h:102:3: error: support for type '__float128' is not
  164.       yet implemented
  165.   abs(__float128 __x)
  166.   ^
  167. /usr/lib/gcc/x86_64-linux-gnu/7.3.0/../../../../include/c++/7.3.0/bits/std_abs.h:102:18: error: support for type '__float128' is
  168.       not yet implemented
  169.   abs(__float128 __x)
  170.                  ^
  171. In file included from ../src/api.cc:5:
  172. In file included from .././src/api.h:9:
  173. In file included from .././src/contexts.h:8:
  174. In file included from .././src/heap/heap.h:8:
  175. In file included from /usr/lib/gcc/x86_64-linux-gnu/7.3.0/../../../../include/c++/7.3.0/cmath:47:
  176. /usr/lib/gcc/x86_64-linux-gnu/7.3.0/../../../../include/c++/7.3.0/bits/std_abs.h:102:3: error: support for type '__float128' is not
  177.       yet implemented
  178.   abs(__float128 __x)
  179.   ^
  180. /usr/lib/gcc/x86_64-linux-gnu/7.3.0/../../../../include/c++/7.3.0/bits/std_abs.h:102:18: error: support for type '__float128' is
  181.       not yet implemented
  182.   abs(__float128 __x)
  183.                  ^
  184. 2 errors generated.
  185. tools/gyp/v8_base.target.native.mk:551: recipe for target '/home/pablo/src/sqreen/PyMiniRacer/py_mini_racer/extension/v8/v8/out/native/obj.target/v8_base/src/allocation.o' failed
  186. make[1]: *** [/home/pablo/src/sqreen/PyMiniRacer/py_mini_racer/extension/v8/v8/out/native/obj.target/v8_base/src/allocation.o] Error 1
  187. make[1]: *** Waiting for unfinished jobs....
  188. 2 errors generated.
  189. tools/gyp/v8_base.target.native.mk:551: recipe for target '/home/pablo/src/sqreen/PyMiniRacer/py_mini_racer/extension/v8/v8/out/native/obj.target/v8_base/src/address-map.o' failed
  190. make[1]: *** [/home/pablo/src/sqreen/PyMiniRacer/py_mini_racer/extension/v8/v8/out/native/obj.target/v8_base/src/address-map.o] Error 1
  191. 2 errors generated.
  192. tools/gyp/v8_base.target.native.mk:551: recipe for target '/home/pablo/src/sqreen/PyMiniRacer/py_mini_racer/extension/v8/v8/out/native/obj.target/v8_base/src/api-experimental.o' failed
  193. make[1]: *** [/home/pablo/src/sqreen/PyMiniRacer/py_mini_racer/extension/v8/v8/out/native/obj.target/v8_base/src/api-experimental.o] Error 1
  194. 2 errors generated.
  195. tools/gyp/v8_base.target.native.mk:551: recipe for target '/home/pablo/src/sqreen/PyMiniRacer/py_mini_racer/extension/v8/v8/out/native/obj.target/v8_base/src/allocation-site-scopes.o' failed
  196. make[1]: *** [/home/pablo/src/sqreen/PyMiniRacer/py_mini_racer/extension/v8/v8/out/native/obj.target/v8_base/src/allocation-site-scopes.o] Error 1
  197. 2 errors generated.
  198. tools/gyp/v8_base.target.native.mk:551: recipe for target '/home/pablo/src/sqreen/PyMiniRacer/py_mini_racer/extension/v8/v8/out/native/obj.target/v8_base/src/accessors.o' failed
  199. make[1]: *** [/home/pablo/src/sqreen/PyMiniRacer/py_mini_racer/extension/v8/v8/out/native/obj.target/v8_base/src/accessors.o] Error 1
  200. 2 errors generated.
  201. tools/gyp/v8_base.target.native.mk:551: recipe for target '/home/pablo/src/sqreen/PyMiniRacer/py_mini_racer/extension/v8/v8/out/native/obj.target/v8_base/src/api.o' failed
  202. make[1]: *** [/home/pablo/src/sqreen/PyMiniRacer/py_mini_racer/extension/v8/v8/out/native/obj.target/v8_base/src/api.o] Error 1
  203. make[1]: Leaving directory '/home/pablo/src/sqreen/PyMiniRacer/py_mini_racer/extension/v8/v8/out'
  204. Makefile:319: recipe for target 'native' failed
  205. make: *** [native] Error 2
  206. Traceback (most recent call last):
  207.   File "setup.py", line 246, in <module>
  208.     'build_v8': MiniRacerBuildV8,
  209.   File "/home/pablo/src/sqreen/AgentDaemon/env27dbg/lib/python2.7/site-packages/setuptools/__init__.py", line 143, in setup
  210.     return distutils.core.setup(**attrs)
  211.   File "/home/pablo/.pythonz/pythons/CPython-2.7.15rc1/lib/python2.7/distutils/core.py", line 151, in setup
  212.     dist.run_commands()
  213.   File "/home/pablo/.pythonz/pythons/CPython-2.7.15rc1/lib/python2.7/distutils/dist.py", line 953, in run_commands
  214.     self.run_command(cmd)
  215.   File "/home/pablo/.pythonz/pythons/CPython-2.7.15rc1/lib/python2.7/distutils/dist.py", line 972, in run_command
  216.     cmd_obj.run()
  217.   File "/home/pablo/.pythonz/pythons/CPython-2.7.15rc1/lib/python2.7/distutils/command/build.py", line 127, in run
  218.     self.run_command(cmd_name)
  219.   File "/home/pablo/.pythonz/pythons/CPython-2.7.15rc1/lib/python2.7/distutils/cmd.py", line 326, in run_command
  220.     self.distribution.run_command(command)
  221.   File "/home/pablo/.pythonz/pythons/CPython-2.7.15rc1/lib/python2.7/distutils/dist.py", line 972, in run_command
  222.     cmd_obj.run()
  223.   File "/home/pablo/src/sqreen/AgentDaemon/env27dbg/lib/python2.7/site-packages/setuptools/command/build_ext.py", line 78, in run
  224.     _build_ext.run(self)
  225.   File "/home/pablo/.pythonz/pythons/CPython-2.7.15rc1/lib/python2.7/distutils/command/build_ext.py", line 340, in run
  226.     self.build_extensions()
  227.   File "/home/pablo/.pythonz/pythons/CPython-2.7.15rc1/lib/python2.7/distutils/command/build_ext.py", line 449, in build_extensions
  228.     self.build_extension(ext)
  229.   File "setup.py", line 176, in build_extension
  230.     raise Exception(err_msg % repr(e))
  231. Exception: py_mini_racer failed to build, ensure you have an up-to-date pip (>= 8.1) to use the wheel instead
  232.             To update pip: 'pip install -U pip'
  233.             See also: https://github.com/sqreen/PyMiniRacer#binary-builds-availability
  234.  
  235.             Original error: CalledProcessError()
RAW Paste Data
We use cookies for various purposes including analytics. By continuing to use Pastebin, you agree to our use of cookies as described in the Cookies Policy. OK, I Understand
 
Top