SHARE
TWEET

OpenArena compile errors

a guest May 18th, 2014 33 Never
Not a member of Pastebin yet? Sign Up, it unlocks many cool features!
  1. code/SDL12/include/SDL_opengl.h:4859: error: expected ')' before 'pname'
  2. code/SDL12/include/SDL_opengl.h:4860: error: expected ')' before 'pname'
  3. code/SDL12/include/SDL_opengl.h:4861: error: expected ')' before 'pname'
  4. code/SDL12/include/SDL_opengl.h:4862: error: expected ')' before 'face'
  5. code/SDL12/include/SDL_opengl.h:4863: error: expected ')' before 'face'
  6. code/SDL12/include/SDL_opengl.h:4864: error: expected ')' before 'face'
  7. code/SDL12/include/SDL_opengl.h:4865: error: expected ')' before 'face'
  8. code/SDL12/include/SDL_opengl.h:4866: error: expected ')' before 'light'
  9. code/SDL12/include/SDL_opengl.h:4867: error: expected ')' before 'light'
  10. code/SDL12/include/SDL_opengl.h:4868: error: expected ')' before 'face'
  11. code/SDL12/include/SDL_opengl.h:4869: error: expected ')' before 'face'
  12. code/SDL12/include/SDL_opengl.h:4870: error: expected ')' before 'pname'
  13. code/SDL12/include/SDL_opengl.h:4886: error: expected ')' before 'mode'
  14. code/SDL12/include/SDL_opengl.h:4904: error: expected ')' before 'mode'
  15. code/SDL12/include/SDL_opengl.h:4905: error: expected ')' before 'pname'
  16. code/SDL12/include/SDL_opengl.h:4906: error: expected ')' before 'face'
  17. code/SDL12/include/SDL_opengl.h:4928: error: 'PFNGLFINISHASYNCSGIXPROC' declared as function returning a function
  18. code/SDL12/include/SDL_opengl.h:4929: error: 'PFNGLPOLLASYNCSGIXPROC' declared as function returning a function
  19. code/SDL12/include/SDL_opengl.h:4930: error: expected ')' before 'range'
  20. code/SDL12/include/SDL_opengl.h:4931: error: expected declaration specifiers or '...' before 'GLsizei'
  21. code/SDL12/include/SDL_opengl.h:4932: error: 'PFNGLISASYNCMARKERSGIXPROC' declared as function returning a function
  22. code/SDL12/include/SDL_opengl.h:4951: error: expected declaration specifiers or '...' before 'GLenum'
  23. code/SDL12/include/SDL_opengl.h:4951: warning: type defaults to 'int' in declaration of 'GLvoid'
  24. code/SDL12/include/SDL_opengl.h:4951: error: expected ';', ',' or ')' before '*' token
  25. code/SDL12/include/SDL_opengl.h:4952: error: expected ')' before 'type'
  26. code/SDL12/include/SDL_opengl.h:4953: error: expected declaration specifiers or '...' before 'GLenum'
  27. code/SDL12/include/SDL_opengl.h:4953: warning: type defaults to 'int' in declaration of 'GLvoid'
  28. code/SDL12/include/SDL_opengl.h:4953: error: expected ';', ',' or ')' before '*' token
  29. code/SDL12/include/SDL_opengl.h:4954: error: expected declaration specifiers or '...' before 'GLenum'
  30. code/SDL12/include/SDL_opengl.h:4954: warning: type defaults to 'int' in declaration of 'GLvoid'
  31. code/SDL12/include/SDL_opengl.h:4954: error: expected ';', ',' or ')' before '*' token
  32. code/SDL12/include/SDL_opengl.h:4969: error: expected ')' before 'target'
  33. code/SDL12/include/SDL_opengl.h:4970: error: expected ')' before 'target'
  34. code/SDL12/include/SDL_opengl.h:4971: error: expected ')' before 'target'
  35. code/SDL12/include/SDL_opengl.h:4972: error: expected ')' before 'target'
  36. code/SDL12/include/SDL_opengl.h:5008: error: expected ')' before 'red'
  37. code/SDL12/include/SDL_opengl.h:5009: warning: type defaults to 'int' in declaration of 'GLbyte'
  38. code/SDL12/include/SDL_opengl.h:5009: error: expected ';', ',' or ')' before '*' token
  39. code/SDL12/include/SDL_opengl.h:5010: error: expected ')' before 'red'
  40. code/SDL12/include/SDL_opengl.h:5011: warning: type defaults to 'int' in declaration of 'GLdouble'
  41. code/SDL12/include/SDL_opengl.h:5011: error: expected ';', ',' or ')' before '*' token
  42. code/SDL12/include/SDL_opengl.h:5012: error: expected ')' before 'red'
  43. code/SDL12/include/SDL_opengl.h:5013: warning: type defaults to 'int' in declaration of 'GLfloat'
  44. code/SDL12/include/SDL_opengl.h:5013: error: expected ';', ',' or ')' before '*' token
  45. code/SDL12/include/SDL_opengl.h:5016: error: expected ')' before 'red'
  46. code/SDL12/include/SDL_opengl.h:5017: warning: type defaults to 'int' in declaration of 'GLshort'
  47. code/SDL12/include/SDL_opengl.h:5017: error: expected ';', ',' or ')' before '*' token
  48. code/SDL12/include/SDL_opengl.h:5018: error: expected ')' before 'red'
  49. code/SDL12/include/SDL_opengl.h:5019: warning: type defaults to 'int' in declaration of 'GLubyte'
  50. code/SDL12/include/SDL_opengl.h:5019: error: expected ';', ',' or ')' before '*' token
  51. code/SDL12/include/SDL_opengl.h:5022: error: expected ')' before 'red'
  52. code/SDL12/include/SDL_opengl.h:5023: warning: type defaults to 'int' in declaration of 'GLushort'
  53. code/SDL12/include/SDL_opengl.h:5023: error: expected ';', ',' or ')' before '*' token
  54. code/SDL12/include/SDL_opengl.h:5024: error: expected declaration specifiers or '...' before 'GLenum'
  55. code/SDL12/include/SDL_opengl.h:5024: error: expected declaration specifiers or '...' before 'GLsizei'
  56. code/SDL12/include/SDL_opengl.h:5024: warning: type defaults to 'int' in declaration of 'GLvoid'
  57. code/SDL12/include/SDL_opengl.h:5024: error: expected ';', ',' or ')' before '*' token
  58. code/SDL12/include/SDL_opengl.h:5032: error: expected ')' before 'mode'
  59. code/SDL12/include/SDL_opengl.h:5041: error: expected ')' before 'mode'
  60. code/SDL12/include/SDL_opengl.h:5042: error: expected ')' before 'mode'
  61. code/SDL12/include/SDL_opengl.h:5054: error: expected ')' before 'coord'
  62. code/SDL12/include/SDL_opengl.h:5055: warning: type defaults to 'int' in declaration of 'GLfloat'
  63. code/SDL12/include/SDL_opengl.h:5055: error: expected ';', ',' or ')' before '*' token
  64. code/SDL12/include/SDL_opengl.h:5056: error: expected ')' before 'coord'
  65. code/SDL12/include/SDL_opengl.h:5057: warning: type defaults to 'int' in declaration of 'GLdouble'
  66. code/SDL12/include/SDL_opengl.h:5057: error: expected ';', ',' or ')' before '*' token
  67. code/SDL12/include/SDL_opengl.h:5058: error: expected ')' before 'type'
  68. code/SDL12/include/SDL_opengl.h:5091: error: expected ')' before 'tx'
  69. code/SDL12/include/SDL_opengl.h:5092: warning: type defaults to 'int' in declaration of 'GLbyte'
  70. code/SDL12/include/SDL_opengl.h:5092: error: expected ';', ',' or ')' before '*' token
  71. code/SDL12/include/SDL_opengl.h:5093: error: expected ')' before 'tx'
  72. code/SDL12/include/SDL_opengl.h:5094: warning: type defaults to 'int' in declaration of 'GLdouble'
  73. code/SDL12/include/SDL_opengl.h:5094: error: expected ';', ',' or ')' before '*' token
  74. code/SDL12/include/SDL_opengl.h:5095: error: expected ')' before 'tx'
  75. code/SDL12/include/SDL_opengl.h:5096: warning: type defaults to 'int' in declaration of 'GLfloat'
  76. code/SDL12/include/SDL_opengl.h:5096: error: expected ';', ',' or ')' before '*' token
  77. code/SDL12/include/SDL_opengl.h:5099: error: expected ')' before 'tx'
  78. code/SDL12/include/SDL_opengl.h:5100: warning: type defaults to 'int' in declaration of 'GLshort'
  79. code/SDL12/include/SDL_opengl.h:5100: error: expected ';', ',' or ')' before '*' token
  80. code/SDL12/include/SDL_opengl.h:5101: error: expected ')' before 'bx'
  81. code/SDL12/include/SDL_opengl.h:5102: warning: type defaults to 'int' in declaration of 'GLbyte'
  82. code/SDL12/include/SDL_opengl.h:5102: error: expected ';', ',' or ')' before '*' token
  83. code/SDL12/include/SDL_opengl.h:5103: error: expected ')' before 'bx'
  84. code/SDL12/include/SDL_opengl.h:5104: warning: type defaults to 'int' in declaration of 'GLdouble'
  85. code/SDL12/include/SDL_opengl.h:5104: error: expected ';', ',' or ')' before '*' token
  86. code/SDL12/include/SDL_opengl.h:5105: error: expected ')' before 'bx'
  87. code/SDL12/include/SDL_opengl.h:5106: warning: type defaults to 'int' in declaration of 'GLfloat'
  88. code/SDL12/include/SDL_opengl.h:5106: error: expected ';', ',' or ')' before '*' token
  89. code/SDL12/include/SDL_opengl.h:5109: error: expected ')' before 'bx'
  90. code/SDL12/include/SDL_opengl.h:5110: warning: type defaults to 'int' in declaration of 'GLshort'
  91. code/SDL12/include/SDL_opengl.h:5110: error: expected ';', ',' or ')' before '*' token
  92. code/SDL12/include/SDL_opengl.h:5111: error: expected ')' before 'type'
  93. code/SDL12/include/SDL_opengl.h:5112: error: expected ')' before 'type'
  94. code/SDL12/include/SDL_opengl.h:5151: error: expected ')' before 'factor'
  95. code/SDL12/include/SDL_opengl.h:5152: error: expected ')' before 'factor'
  96. code/SDL12/include/SDL_opengl.h:5154: error: expected ')' before 'factor'
  97. code/SDL12/include/SDL_opengl.h:5155: error: expected ')' before 'factor'
  98. code/SDL12/include/SDL_opengl.h:5156: error: expected ')' before 'factor'
  99. code/SDL12/include/SDL_opengl.h:5157: error: expected ')' before 'factor'
  100. code/SDL12/include/SDL_opengl.h:5173: error: expected ')' before 'code'
  101. code/SDL12/include/SDL_opengl.h:5174: error: expected ')' before 'code'
  102. code/SDL12/include/SDL_opengl.h:5176: warning: type defaults to 'int' in declaration of 'GLushort'
  103. code/SDL12/include/SDL_opengl.h:5176: error: expected ';', ',' or ')' before '*' token
  104. code/SDL12/include/SDL_opengl.h:5177: warning: type defaults to 'int' in declaration of 'GLubyte'
  105. code/SDL12/include/SDL_opengl.h:5177: error: expected ';', ',' or ')' before '*' token
  106. code/SDL12/include/SDL_opengl.h:5178: error: expected ')' before 'type'
  107. code/SDL12/include/SDL_opengl.h:5225: error: expected ')' before 'r'
  108. code/SDL12/include/SDL_opengl.h:5226: warning: type defaults to 'int' in declaration of 'GLubyte'
  109. code/SDL12/include/SDL_opengl.h:5226: error: expected ';', ',' or ')' before '*' token
  110. code/SDL12/include/SDL_opengl.h:5227: error: expected ')' before 'r'
  111. code/SDL12/include/SDL_opengl.h:5228: warning: type defaults to 'int' in declaration of 'GLubyte'
  112. code/SDL12/include/SDL_opengl.h:5228: error: expected ';', ',' or ')' before '*' token
  113. code/SDL12/include/SDL_opengl.h:5229: error: expected ')' before 'r'
  114. code/SDL12/include/SDL_opengl.h:5230: warning: type defaults to 'int' in declaration of 'GLfloat'
  115. code/SDL12/include/SDL_opengl.h:5230: error: expected ';', ',' or ')' before '*' token
  116. code/SDL12/include/SDL_opengl.h:5231: error: expected ')' before 'nx'
  117. code/SDL12/include/SDL_opengl.h:5232: warning: type defaults to 'int' in declaration of 'GLfloat'
  118. code/SDL12/include/SDL_opengl.h:5232: error: expected ';', ',' or ')' before '*' token
  119. code/SDL12/include/SDL_opengl.h:5233: error: expected ')' before 'r'
  120. code/SDL12/include/SDL_opengl.h:5234: warning: type defaults to 'int' in declaration of 'GLfloat'
  121. code/SDL12/include/SDL_opengl.h:5234: error: expected ';', ',' or ')' before '*' token
  122. code/SDL12/include/SDL_opengl.h:5235: error: expected ')' before 's'
  123. code/SDL12/include/SDL_opengl.h:5236: warning: type defaults to 'int' in declaration of 'GLfloat'
  124. code/SDL12/include/SDL_opengl.h:5236: error: expected ';', ',' or ')' before '*' token
  125. code/SDL12/include/SDL_opengl.h:5237: error: expected ')' before 's'
  126. code/SDL12/include/SDL_opengl.h:5238: warning: type defaults to 'int' in declaration of 'GLfloat'
  127. code/SDL12/include/SDL_opengl.h:5238: error: expected ';', ',' or ')' before '*' token
  128. code/SDL12/include/SDL_opengl.h:5239: error: expected ')' before 's'
  129. code/SDL12/include/SDL_opengl.h:5240: warning: type defaults to 'int' in declaration of 'GLfloat'
  130. code/SDL12/include/SDL_opengl.h:5240: error: expected ';', ',' or ')' before '*' token
  131. code/SDL12/include/SDL_opengl.h:5241: error: expected ')' before 's'
  132. code/SDL12/include/SDL_opengl.h:5242: warning: type defaults to 'int' in declaration of 'GLfloat'
  133. code/SDL12/include/SDL_opengl.h:5242: error: expected ';', ',' or ')' before '*' token
  134. code/SDL12/include/SDL_opengl.h:5243: error: expected ')' before 's'
  135. code/SDL12/include/SDL_opengl.h:5244: warning: type defaults to 'int' in declaration of 'GLfloat'
  136. code/SDL12/include/SDL_opengl.h:5244: error: expected ';', ',' or ')' before '*' token
  137. code/SDL12/include/SDL_opengl.h:5245: error: expected ')' before 's'
  138. code/SDL12/include/SDL_opengl.h:5246: warning: type defaults to 'int' in declaration of 'GLfloat'
  139. code/SDL12/include/SDL_opengl.h:5246: error: expected ';', ',' or ')' before '*' token
  140. code/SDL12/include/SDL_opengl.h:5247: error: expected ')' before 's'
  141. code/SDL12/include/SDL_opengl.h:5248: warning: type defaults to 'int' in declaration of 'GLfloat'
  142. code/SDL12/include/SDL_opengl.h:5248: error: expected ';', ',' or ')' before '*' token
  143. code/SDL12/include/SDL_opengl.h:5249: error: expected declaration specifiers or '...' before 'GLfloat'
  144. code/SDL12/include/SDL_opengl.h:5249: error: expected declaration specifiers or '...' before 'GLfloat'
  145. code/SDL12/include/SDL_opengl.h:5249: error: expected declaration specifiers or '...' before 'GLfloat'
  146. code/SDL12/include/SDL_opengl.h:5250: warning: type defaults to 'int' in declaration of 'GLfloat'
  147. code/SDL12/include/SDL_opengl.h:5250: error: expected ';', ',' or ')' before '*' token
  148. code/SDL12/include/SDL_opengl.h:5251: error: expected declaration specifiers or '...' before 'GLubyte'
  149. code/SDL12/include/SDL_opengl.h:5251: error: expected declaration specifiers or '...' before 'GLubyte'
  150. code/SDL12/include/SDL_opengl.h:5251: error: expected declaration specifiers or '...' before 'GLubyte'
  151. code/SDL12/include/SDL_opengl.h:5251: error: expected declaration specifiers or '...' before 'GLubyte'
  152. code/SDL12/include/SDL_opengl.h:5251: error: expected declaration specifiers or '...' before 'GLfloat'
  153. code/SDL12/include/SDL_opengl.h:5251: error: expected declaration specifiers or '...' before 'GLfloat'
  154. code/SDL12/include/SDL_opengl.h:5251: error: expected declaration specifiers or '...' before 'GLfloat'
  155. code/SDL12/include/SDL_opengl.h:5252: warning: type defaults to 'int' in declaration of 'GLubyte'
  156. code/SDL12/include/SDL_opengl.h:5252: error: expected ';', ',' or ')' before '*' token
  157. code/SDL12/include/SDL_opengl.h:5253: error: expected declaration specifiers or '...' before 'GLfloat'
  158. code/SDL12/include/SDL_opengl.h:5253: error: expected declaration specifiers or '...' before 'GLfloat'
  159. code/SDL12/include/SDL_opengl.h:5253: error: expected declaration specifiers or '...' before 'GLfloat'
  160. code/SDL12/include/SDL_opengl.h:5253: error: expected declaration specifiers or '...' before 'GLfloat'
  161. code/SDL12/include/SDL_opengl.h:5253: error: expected declaration specifiers or '...' before 'GLfloat'
  162. code/SDL12/include/SDL_opengl.h:5253: error: expected declaration specifiers or '...' before 'GLfloat'
  163. code/SDL12/include/SDL_opengl.h:5254: warning: type defaults to 'int' in declaration of 'GLfloat'
  164. code/SDL12/include/SDL_opengl.h:5254: error: expected ';', ',' or ')' before '*' token
  165. code/SDL12/include/SDL_opengl.h:5255: error: expected declaration specifiers or '...' before 'GLfloat'
  166. code/SDL12/include/SDL_opengl.h:5255: error: expected declaration specifiers or '...' before 'GLfloat'
  167. code/SDL12/include/SDL_opengl.h:5255: error: expected declaration specifiers or '...' before 'GLfloat'
  168. code/SDL12/include/SDL_opengl.h:5255: error: expected declaration specifiers or '...' before 'GLfloat'
  169. code/SDL12/include/SDL_opengl.h:5255: error: expected declaration specifiers or '...' before 'GLfloat'
  170. code/SDL12/include/SDL_opengl.h:5255: error: expected declaration specifiers or '...' before 'GLfloat'
  171. code/SDL12/include/SDL_opengl.h:5256: warning: type defaults to 'int' in declaration of 'GLfloat'
  172. code/SDL12/include/SDL_opengl.h:5256: error: expected ';', ',' or ')' before '*' token
  173. code/SDL12/include/SDL_opengl.h:5257: error: expected declaration specifiers or '...' before 'GLfloat'
  174. code/SDL12/include/SDL_opengl.h:5257: error: expected declaration specifiers or '...' before 'GLfloat'
  175. code/SDL12/include/SDL_opengl.h:5257: error: expected declaration specifiers or '...' before 'GLfloat'
  176. code/SDL12/include/SDL_opengl.h:5257: error: expected declaration specifiers or '...' before 'GLfloat'
  177. code/SDL12/include/SDL_opengl.h:5257: error: expected declaration specifiers or '...' before 'GLfloat'
  178. code/SDL12/include/SDL_opengl.h:5257: error: expected declaration specifiers or '...' before 'GLfloat'
  179. code/SDL12/include/SDL_opengl.h:5257: error: expected declaration specifiers or '...' before 'GLfloat'
  180. code/SDL12/include/SDL_opengl.h:5257: error: expected declaration specifiers or '...' before 'GLfloat'
  181. code/SDL12/include/SDL_opengl.h:5257: error: expected declaration specifiers or '...' before 'GLfloat'
  182. code/SDL12/include/SDL_opengl.h:5257: error: expected declaration specifiers or '...' before 'GLfloat'
  183. code/SDL12/include/SDL_opengl.h:5258: warning: type defaults to 'int' in declaration of 'GLfloat'
  184. code/SDL12/include/SDL_opengl.h:5258: error: expected ';', ',' or ')' before '*' token
  185. code/SDL12/include/SDL_opengl.h:5259: error: expected declaration specifiers or '...' before 'GLfloat'
  186. code/SDL12/include/SDL_opengl.h:5259: error: expected declaration specifiers or '...' before 'GLfloat'
  187. code/SDL12/include/SDL_opengl.h:5259: error: expected declaration specifiers or '...' before 'GLfloat'
  188. code/SDL12/include/SDL_opengl.h:5259: error: expected declaration specifiers or '...' before 'GLfloat'
  189. code/SDL12/include/SDL_opengl.h:5259: error: expected declaration specifiers or '...' before 'GLfloat'
  190. code/SDL12/include/SDL_opengl.h:5260: warning: type defaults to 'int' in declaration of 'GLfloat'
  191. code/SDL12/include/SDL_opengl.h:5260: error: expected ';', ',' or ')' before '*' token
  192. code/SDL12/include/SDL_opengl.h:5261: error: expected declaration specifiers or '...' before 'GLfloat'
  193. code/SDL12/include/SDL_opengl.h:5261: error: expected declaration specifiers or '...' before 'GLfloat'
  194. code/SDL12/include/SDL_opengl.h:5261: error: expected declaration specifiers or '...' before 'GLfloat'
  195. code/SDL12/include/SDL_opengl.h:5261: error: expected declaration specifiers or '...' before 'GLfloat'
  196. code/SDL12/include/SDL_opengl.h:5261: error: expected declaration specifiers or '...' before 'GLfloat'
  197. code/SDL12/include/SDL_opengl.h:5261: error: expected declaration specifiers or '...' before 'GLfloat'
  198. code/SDL12/include/SDL_opengl.h:5261: error: expected declaration specifiers or '...' before 'GLfloat'
  199. code/SDL12/include/SDL_opengl.h:5261: error: expected declaration specifiers or '...' before 'GLfloat'
  200. code/SDL12/include/SDL_opengl.h:5262: warning: type defaults to 'int' in declaration of 'GLfloat'
  201. code/SDL12/include/SDL_opengl.h:5262: error: expected ';', ',' or ')' before '*' token
  202. code/SDL12/include/SDL_opengl.h:5263: error: expected declaration specifiers or '...' before 'GLfloat'
  203. code/SDL12/include/SDL_opengl.h:5263: error: expected declaration specifiers or '...' before 'GLfloat'
  204. code/SDL12/include/SDL_opengl.h:5263: error: expected declaration specifiers or '...' before 'GLfloat'
  205. code/SDL12/include/SDL_opengl.h:5263: error: expected declaration specifiers or '...' before 'GLfloat'
  206. code/SDL12/include/SDL_opengl.h:5263: error: expected declaration specifiers or '...' before 'GLfloat'
  207. code/SDL12/include/SDL_opengl.h:5263: error: expected declaration specifiers or '...' before 'GLfloat'
  208. code/SDL12/include/SDL_opengl.h:5263: error: expected declaration specifiers or '...' before 'GLfloat'
  209. code/SDL12/include/SDL_opengl.h:5263: error: expected declaration specifiers or '...' before 'GLfloat'
  210. code/SDL12/include/SDL_opengl.h:5263: error: expected declaration specifiers or '...' before 'GLfloat'
  211. code/SDL12/include/SDL_opengl.h:5263: error: expected declaration specifiers or '...' before 'GLfloat'
  212. code/SDL12/include/SDL_opengl.h:5263: error: expected declaration specifiers or '...' before 'GLfloat'
  213. code/SDL12/include/SDL_opengl.h:5263: error: expected declaration specifiers or '...' before 'GLfloat'
  214. code/SDL12/include/SDL_opengl.h:5264: warning: type defaults to 'int' in declaration of 'GLfloat'
  215. code/SDL12/include/SDL_opengl.h:5264: error: expected ';', ',' or ')' before '*' token
  216. code/SDL12/include/SDL_opengl.h:5272: error: expected ')' before 'sfactorRGB'
  217. code/SDL12/include/SDL_opengl.h:5280: error: expected ')' before 'sfactorRGB'
  218. code/SDL12/include/SDL_opengl.h:5326: error: expected ')' before 'weight'
  219. code/SDL12/include/SDL_opengl.h:5327: warning: type defaults to 'int' in declaration of 'GLfloat'
  220. code/SDL12/include/SDL_opengl.h:5327: error: expected ';', ',' or ')' before '*' token
  221. code/SDL12/include/SDL_opengl.h:5328: error: expected ')' before 'size'
  222. code/SDL12/include/SDL_opengl.h:5342: error: expected ')' before 'length'
  223. code/SDL12/include/SDL_opengl.h:5362: error: expected ')' before 'pname'
  224. code/SDL12/include/SDL_opengl.h:5363: error: expected ')' before 'pname'
  225. code/SDL12/include/SDL_opengl.h:5364: error: expected ')' before 'pname'
  226. code/SDL12/include/SDL_opengl.h:5365: error: expected ')' before 'pname'
  227. code/SDL12/include/SDL_opengl.h:5366: error: expected ')' before 'stage'
  228. code/SDL12/include/SDL_opengl.h:5367: error: expected ')' before 'stage'
  229. code/SDL12/include/SDL_opengl.h:5368: error: expected ')' before 'variable'
  230. code/SDL12/include/SDL_opengl.h:5369: error: expected ')' before 'stage'
  231. code/SDL12/include/SDL_opengl.h:5370: error: expected ')' before 'stage'
  232. code/SDL12/include/SDL_opengl.h:5371: error: expected ')' before 'stage'
  233. code/SDL12/include/SDL_opengl.h:5372: error: expected ')' before 'stage'
  234. code/SDL12/include/SDL_opengl.h:5373: error: expected ')' before 'variable'
  235. code/SDL12/include/SDL_opengl.h:5374: error: expected ')' before 'variable'
  236. code/SDL12/include/SDL_opengl.h:5429: error: expected ')' before 'x'
  237. code/SDL12/include/SDL_opengl.h:5430: warning: type defaults to 'int' in declaration of 'GLdouble'
  238. code/SDL12/include/SDL_opengl.h:5430: error: expected ';', ',' or ')' before '*' token
  239. code/SDL12/include/SDL_opengl.h:5431: error: expected ')' before 'x'
  240. code/SDL12/include/SDL_opengl.h:5432: warning: type defaults to 'int' in declaration of 'GLfloat'
  241. code/SDL12/include/SDL_opengl.h:5432: error: expected ';', ',' or ')' before '*' token
  242. code/SDL12/include/SDL_opengl.h:5435: error: expected ')' before 'x'
  243. code/SDL12/include/SDL_opengl.h:5436: warning: type defaults to 'int' in declaration of 'GLshort'
  244. code/SDL12/include/SDL_opengl.h:5436: error: expected ';', ',' or ')' before '*' token
  245. code/SDL12/include/SDL_opengl.h:5437: error: expected ')' before 'x'
  246. code/SDL12/include/SDL_opengl.h:5438: warning: type defaults to 'int' in declaration of 'GLdouble'
  247. code/SDL12/include/SDL_opengl.h:5438: error: expected ';', ',' or ')' before '*' token
  248. code/SDL12/include/SDL_opengl.h:5439: error: expected ')' before 'x'
  249. code/SDL12/include/SDL_opengl.h:5440: warning: type defaults to 'int' in declaration of 'GLfloat'
  250. code/SDL12/include/SDL_opengl.h:5440: error: expected ';', ',' or ')' before '*' token
  251. code/SDL12/include/SDL_opengl.h:5443: error: expected ')' before 'x'
  252. code/SDL12/include/SDL_opengl.h:5444: warning: type defaults to 'int' in declaration of 'GLshort'
  253. code/SDL12/include/SDL_opengl.h:5444: error: expected ';', ',' or ')' before '*' token
  254. code/SDL12/include/SDL_opengl.h:5445: error: expected ')' before 'x'
  255. code/SDL12/include/SDL_opengl.h:5446: warning: type defaults to 'int' in declaration of 'GLdouble'
  256. code/SDL12/include/SDL_opengl.h:5446: error: expected ';', ',' or ')' before '*' token
  257. code/SDL12/include/SDL_opengl.h:5447: error: expected ')' before 'x'
  258. code/SDL12/include/SDL_opengl.h:5448: warning: type defaults to 'int' in declaration of 'GLfloat'
  259. code/SDL12/include/SDL_opengl.h:5448: error: expected ';', ',' or ')' before '*' token
  260. code/SDL12/include/SDL_opengl.h:5451: error: expected ')' before 'x'
  261. code/SDL12/include/SDL_opengl.h:5452: warning: type defaults to 'int' in declaration of 'GLshort'
  262. code/SDL12/include/SDL_opengl.h:5452: error: expected ';', ',' or ')' before '*' token
  263. code/SDL12/include/SDL_opengl.h:5465: warning: type defaults to 'int' in declaration of 'GLenum'
  264. code/SDL12/include/SDL_opengl.h:5465: error: expected ';', ',' or ')' before '*' token
  265. code/SDL12/include/SDL_opengl.h:5466: warning: type defaults to 'int' in declaration of 'GLenum'
  266. code/SDL12/include/SDL_opengl.h:5466: error: expected ';', ',' or ')' before '*' token
  267. code/SDL12/include/SDL_opengl.h:5481: error: expected declaration specifiers or '...' before 'GLenum'
  268. code/SDL12/include/SDL_opengl.h:5481: warning: type defaults to 'int' in declaration of 'GLvoid'
  269. code/SDL12/include/SDL_opengl.h:5481: error: expected ';', ',' or ')' before '*' token
  270. code/SDL12/include/SDL_opengl.h:5482: error: expected declaration specifiers or '...' before 'GLenum'
  271. code/SDL12/include/SDL_opengl.h:5482: warning: type defaults to 'int' in declaration of 'GLvoid'
  272. code/SDL12/include/SDL_opengl.h:5482: error: expected ';', ',' or ')' before '*' token
  273. code/SDL12/include/SDL_opengl.h:5484: error: expected ')' before 'type'
  274. code/SDL12/include/SDL_opengl.h:5485: error: expected ')' before 'type'
  275. code/SDL12/include/SDL_opengl.h:5486: error: expected ')' before 'type'
  276. code/SDL12/include/SDL_opengl.h:5487: error: expected declaration specifiers or '...' before 'GLenum'
  277. code/SDL12/include/SDL_opengl.h:5487: warning: type defaults to 'int' in declaration of 'GLvoid'
  278. code/SDL12/include/SDL_opengl.h:5487: error: expected ';', ',' or ')' before '*' token
  279. code/SDL12/include/SDL_opengl.h:5488: error: expected declaration specifiers or '...' before 'GLenum'
  280. code/SDL12/include/SDL_opengl.h:5488: warning: type defaults to 'int' in declaration of 'GLvoid'
  281. code/SDL12/include/SDL_opengl.h:5488: error: expected ';', ',' or ')' before '*' token
  282. code/SDL12/include/SDL_opengl.h:5529: error: expected ')' before 'value'
  283. code/SDL12/include/SDL_opengl.h:5530: error: expected ')' before 'pattern'
  284. code/SDL12/include/SDL_opengl.h:5562: error: expected ')' before 'pname'
  285. code/SDL12/include/SDL_opengl.h:5584: error: expected ')' before 'n'
  286. code/SDL12/include/SDL_opengl.h:5585: error: expected ')' before 'n'
  287. code/SDL12/include/SDL_opengl.h:5586: error: 'PFNGLISFENCENVPROC' declared as function returning a function
  288. code/SDL12/include/SDL_opengl.h:5587: error: 'PFNGLTESTFENCENVPROC' declared as function returning a function
  289. code/SDL12/include/SDL_opengl.h:5588: error: expected declaration specifiers or '...' before 'GLenum'
  290. code/SDL12/include/SDL_opengl.h:5590: error: expected declaration specifiers or '...' before 'GLenum'
  291. code/SDL12/include/SDL_opengl.h:5606: error: expected ')' before 'target'
  292. code/SDL12/include/SDL_opengl.h:5607: error: expected ')' before 'target'
  293. code/SDL12/include/SDL_opengl.h:5608: error: expected ')' before 'target'
  294. code/SDL12/include/SDL_opengl.h:5609: error: expected ')' before 'target'
  295. code/SDL12/include/SDL_opengl.h:5610: error: expected ')' before 'target'
  296. code/SDL12/include/SDL_opengl.h:5611: error: expected ')' before 'target'
  297. code/SDL12/include/SDL_opengl.h:5612: error: expected ')' before 'target'
  298. code/SDL12/include/SDL_opengl.h:5613: error: expected ')' before 'target'
  299. code/SDL12/include/SDL_opengl.h:5614: error: expected ')' before 'target'
  300. code/SDL12/include/SDL_opengl.h:5627: error: expected ')' before 'stage'
  301. code/SDL12/include/SDL_opengl.h:5628: error: expected ')' before 'stage'
  302. code/SDL12/include/SDL_opengl.h:5719: error: expected ')' before 'n'
  303. code/SDL12/include/SDL_opengl.h:5720: error: expected ')' before 'target'
  304. code/SDL12/include/SDL_opengl.h:5721: error: expected ')' before 'n'
  305. code/SDL12/include/SDL_opengl.h:5722: error: expected ')' before 'target'
  306. code/SDL12/include/SDL_opengl.h:5723: error: expected ')' before 'n'
  307. code/SDL12/include/SDL_opengl.h:5724: error: expected ')' before 'target'
  308. code/SDL12/include/SDL_opengl.h:5725: error: expected ')' before 'target'
  309. code/SDL12/include/SDL_opengl.h:5726: error: expected declaration specifiers or '...' before 'GLenum'
  310. code/SDL12/include/SDL_opengl.h:5727: error: expected declaration specifiers or '...' before 'GLenum'
  311. code/SDL12/include/SDL_opengl.h:5727: error: expected declaration specifiers or '...' before 'GLubyte'
  312. code/SDL12/include/SDL_opengl.h:5728: error: expected ')' before 'target'
  313. code/SDL12/include/SDL_opengl.h:5729: error: expected declaration specifiers or '...' before 'GLenum'
  314. code/SDL12/include/SDL_opengl.h:5729: error: expected declaration specifiers or '...' before 'GLdouble'
  315. code/SDL12/include/SDL_opengl.h:5730: error: expected declaration specifiers or '...' before 'GLenum'
  316. code/SDL12/include/SDL_opengl.h:5730: error: expected declaration specifiers or '...' before 'GLfloat'
  317. code/SDL12/include/SDL_opengl.h:5731: error: expected declaration specifiers or '...' before 'GLenum'
  318. code/SDL12/include/SDL_opengl.h:5732: error: expected declaration specifiers or '...' before 'GLenum'
  319. code/SDL12/include/SDL_opengl.h:5732: error: expected declaration specifiers or '...' before 'GLvoid'
  320. code/SDL12/include/SDL_opengl.h:5733: error: 'PFNGLISPROGRAMNVPROC' declared as function returning a function
  321. code/SDL12/include/SDL_opengl.h:5734: error: expected ')' before 'target'
  322. code/SDL12/include/SDL_opengl.h:5735: error: expected ')' before 'target'
  323. code/SDL12/include/SDL_opengl.h:5736: error: expected ')' before 'target'
  324. code/SDL12/include/SDL_opengl.h:5737: error: expected ')' before 'target'
  325. code/SDL12/include/SDL_opengl.h:5738: error: expected ')' before 'target'
  326. code/SDL12/include/SDL_opengl.h:5739: error: expected ')' before 'target'
  327. code/SDL12/include/SDL_opengl.h:5740: error: expected ')' before 'target'
  328. code/SDL12/include/SDL_opengl.h:5741: error: expected ')' before 'n'
  329. code/SDL12/include/SDL_opengl.h:5742: error: expected ')' before 'target'
  330. code/SDL12/include/SDL_opengl.h:5743: error: expected declaration specifiers or '...' before 'GLenum'
  331. code/SDL12/include/SDL_opengl.h:5743: error: expected declaration specifiers or '...' before 'GLsizei'
  332. code/SDL12/include/SDL_opengl.h:5743: warning: type defaults to 'int' in declaration of 'GLvoid'
  333. code/SDL12/include/SDL_opengl.h:5743: error: expected ';', ',' or ')' before '*' token
  334. code/SDL12/include/SDL_opengl.h:5744: error: expected declaration specifiers or '...' before 'GLdouble'
  335. code/SDL12/include/SDL_opengl.h:5745: warning: type defaults to 'int' in declaration of 'GLdouble'
  336. code/SDL12/include/SDL_opengl.h:5745: error: expected ';', ',' or ')' before '*' token
  337. code/SDL12/include/SDL_opengl.h:5746: error: expected declaration specifiers or '...' before 'GLfloat'
  338. code/SDL12/include/SDL_opengl.h:5747: warning: type defaults to 'int' in declaration of 'GLfloat'
  339. code/SDL12/include/SDL_opengl.h:5747: error: expected ';', ',' or ')' before '*' token
  340. code/SDL12/include/SDL_opengl.h:5748: error: expected declaration specifiers or '...' before 'GLshort'
  341. code/SDL12/include/SDL_opengl.h:5749: warning: type defaults to 'int' in declaration of 'GLshort'
  342. code/SDL12/include/SDL_opengl.h:5749: error: expected ';', ',' or ')' before '*' token
  343. code/SDL12/include/SDL_opengl.h:5750: error: expected declaration specifiers or '...' before 'GLdouble'
  344. code/SDL12/include/SDL_opengl.h:5750: error: expected declaration specifiers or '...' before 'GLdouble'
  345. code/SDL12/include/SDL_opengl.h:5751: warning: type defaults to 'int' in declaration of 'GLdouble'
  346. code/SDL12/include/SDL_opengl.h:5751: error: expected ';', ',' or ')' before '*' token
  347. code/SDL12/include/SDL_opengl.h:5752: error: expected declaration specifiers or '...' before 'GLfloat'
  348. code/SDL12/include/SDL_opengl.h:5752: error: expected declaration specifiers or '...' before 'GLfloat'
  349. code/SDL12/include/SDL_opengl.h:5753: warning: type defaults to 'int' in declaration of 'GLfloat'
  350. code/SDL12/include/SDL_opengl.h:5753: error: expected ';', ',' or ')' before '*' token
  351. code/SDL12/include/SDL_opengl.h:5754: error: expected declaration specifiers or '...' before 'GLshort'
  352. code/SDL12/include/SDL_opengl.h:5754: error: expected declaration specifiers or '...' before 'GLshort'
  353. code/SDL12/include/SDL_opengl.h:5755: warning: type defaults to 'int' in declaration of 'GLshort'
  354. code/SDL12/include/SDL_opengl.h:5755: error: expected ';', ',' or ')' before '*' token
  355. code/SDL12/include/SDL_opengl.h:5756: error: expected declaration specifiers or '...' before 'GLdouble'
  356. code/SDL12/include/SDL_opengl.h:5756: error: expected declaration specifiers or '...' before 'GLdouble'
  357. code/SDL12/include/SDL_opengl.h:5756: error: expected declaration specifiers or '...' before 'GLdouble'
  358. code/SDL12/include/SDL_opengl.h:5757: warning: type defaults to 'int' in declaration of 'GLdouble'
  359. code/SDL12/include/SDL_opengl.h:5757: error: expected ';', ',' or ')' before '*' token
  360. code/SDL12/include/SDL_opengl.h:5758: error: expected declaration specifiers or '...' before 'GLfloat'
  361. code/SDL12/include/SDL_opengl.h:5758: error: expected declaration specifiers or '...' before 'GLfloat'
  362. code/SDL12/include/SDL_opengl.h:5758: error: expected declaration specifiers or '...' before 'GLfloat'
  363. code/SDL12/include/SDL_opengl.h:5759: warning: type defaults to 'int' in declaration of 'GLfloat'
  364. code/SDL12/include/SDL_opengl.h:5759: error: expected ';', ',' or ')' before '*' token
  365. code/SDL12/include/SDL_opengl.h:5760: error: expected declaration specifiers or '...' before 'GLshort'
  366. code/SDL12/include/SDL_opengl.h:5760: error: expected declaration specifiers or '...' before 'GLshort'
  367. code/SDL12/include/SDL_opengl.h:5760: error: expected declaration specifiers or '...' before 'GLshort'
  368. code/SDL12/include/SDL_opengl.h:5761: warning: type defaults to 'int' in declaration of 'GLshort'
  369. code/SDL12/include/SDL_opengl.h:5761: error: expected ';', ',' or ')' before '*' token
  370. code/SDL12/include/SDL_opengl.h:5762: error: expected declaration specifiers or '...' before 'GLdouble'
  371. code/SDL12/include/SDL_opengl.h:5762: error: expected declaration specifiers or '...' before 'GLdouble'
  372. code/SDL12/include/SDL_opengl.h:5762: error: expected declaration specifiers or '...' before 'GLdouble'
  373. code/SDL12/include/SDL_opengl.h:5762: error: expected declaration specifiers or '...' before 'GLdouble'
  374. code/SDL12/include/SDL_opengl.h:5763: warning: type defaults to 'int' in declaration of 'GLdouble'
  375. code/SDL12/include/SDL_opengl.h:5763: error: expected ';', ',' or ')' before '*' token
  376. code/SDL12/include/SDL_opengl.h:5764: error: expected declaration specifiers or '...' before 'GLfloat'
  377. code/SDL12/include/SDL_opengl.h:5764: error: expected declaration specifiers or '...' before 'GLfloat'
  378. code/SDL12/include/SDL_opengl.h:5764: error: expected declaration specifiers or '...' before 'GLfloat'
  379. code/SDL12/include/SDL_opengl.h:5764: error: expected declaration specifiers or '...' before 'GLfloat'
  380. code/SDL12/include/SDL_opengl.h:5765: warning: type defaults to 'int' in declaration of 'GLfloat'
  381. code/SDL12/include/SDL_opengl.h:5765: error: expected ';', ',' or ')' before '*' token
  382. code/SDL12/include/SDL_opengl.h:5766: error: expected declaration specifiers or '...' before 'GLshort'
  383. code/SDL12/include/SDL_opengl.h:5766: error: expected declaration specifiers or '...' before 'GLshort'
  384. code/SDL12/include/SDL_opengl.h:5766: error: expected declaration specifiers or '...' before 'GLshort'
  385. code/SDL12/include/SDL_opengl.h:5766: error: expected declaration specifiers or '...' before 'GLshort'
  386. code/SDL12/include/SDL_opengl.h:5767: warning: type defaults to 'int' in declaration of 'GLshort'
  387. code/SDL12/include/SDL_opengl.h:5767: error: expected ';', ',' or ')' before '*' token
  388. code/SDL12/include/SDL_opengl.h:5768: error: expected declaration specifiers or '...' before 'GLubyte'
  389. code/SDL12/include/SDL_opengl.h:5768: error: expected declaration specifiers or '...' before 'GLubyte'
  390. code/SDL12/include/SDL_opengl.h:5768: error: expected declaration specifiers or '...' before 'GLubyte'
  391. code/SDL12/include/SDL_opengl.h:5768: error: expected declaration specifiers or '...' before 'GLubyte'
  392. code/SDL12/include/SDL_opengl.h:5769: warning: type defaults to 'int' in declaration of 'GLubyte'
  393. code/SDL12/include/SDL_opengl.h:5769: error: expected ';', ',' or ')' before '*' token
  394. code/SDL12/include/SDL_opengl.h:5770: error: expected declaration specifiers or '...' before 'GLsizei'
  395. code/SDL12/include/SDL_opengl.h:5770: warning: type defaults to 'int' in declaration of 'GLdouble'
  396. code/SDL12/include/SDL_opengl.h:5770: error: expected ';', ',' or ')' before '*' token
  397. code/SDL12/include/SDL_opengl.h:5771: error: expected declaration specifiers or '...' before 'GLsizei'
  398. code/SDL12/include/SDL_opengl.h:5771: warning: type defaults to 'int' in declaration of 'GLfloat'
  399. code/SDL12/include/SDL_opengl.h:5771: error: expected ';', ',' or ')' before '*' token
  400. code/SDL12/include/SDL_opengl.h:5772: error: expected declaration specifiers or '...' before 'GLsizei'
  401. code/SDL12/include/SDL_opengl.h:5772: warning: type defaults to 'int' in declaration of 'GLshort'
  402. code/SDL12/include/SDL_opengl.h:5772: error: expected ';', ',' or ')' before '*' token
  403. code/SDL12/include/SDL_opengl.h:5773: error: expected declaration specifiers or '...' before 'GLsizei'
  404. code/SDL12/include/SDL_opengl.h:5773: warning: type defaults to 'int' in declaration of 'GLdouble'
  405. code/SDL12/include/SDL_opengl.h:5773: error: expected ';', ',' or ')' before '*' token
  406. code/SDL12/include/SDL_opengl.h:5774: error: expected declaration specifiers or '...' before 'GLsizei'
  407. code/SDL12/include/SDL_opengl.h:5774: warning: type defaults to 'int' in declaration of 'GLfloat'
  408. code/SDL12/include/SDL_opengl.h:5774: error: expected ';', ',' or ')' before '*' token
  409. code/SDL12/include/SDL_opengl.h:5775: error: expected declaration specifiers or '...' before 'GLsizei'
  410. code/SDL12/include/SDL_opengl.h:5775: warning: type defaults to 'int' in declaration of 'GLshort'
  411. code/SDL12/include/SDL_opengl.h:5775: error: expected ';', ',' or ')' before '*' token
  412. code/SDL12/include/SDL_opengl.h:5776: error: expected declaration specifiers or '...' before 'GLsizei'
  413. code/SDL12/include/SDL_opengl.h:5776: warning: type defaults to 'int' in declaration of 'GLdouble'
  414. code/SDL12/include/SDL_opengl.h:5776: error: expected ';', ',' or ')' before '*' token
  415. code/SDL12/include/SDL_opengl.h:5777: error: expected declaration specifiers or '...' before 'GLsizei'
  416. code/SDL12/include/SDL_opengl.h:5777: warning: type defaults to 'int' in declaration of 'GLfloat'
  417. code/SDL12/include/SDL_opengl.h:5777: error: expected ';', ',' or ')' before '*' token
  418. code/SDL12/include/SDL_opengl.h:5778: error: expected declaration specifiers or '...' before 'GLsizei'
  419. code/SDL12/include/SDL_opengl.h:5778: warning: type defaults to 'int' in declaration of 'GLshort'
  420. code/SDL12/include/SDL_opengl.h:5778: error: expected ';', ',' or ')' before '*' token
  421. code/SDL12/include/SDL_opengl.h:5779: error: expected declaration specifiers or '...' before 'GLsizei'
  422. code/SDL12/include/SDL_opengl.h:5779: warning: type defaults to 'int' in declaration of 'GLdouble'
  423. code/SDL12/include/SDL_opengl.h:5779: error: expected ';', ',' or ')' before '*' token
  424. code/SDL12/include/SDL_opengl.h:5780: error: expected declaration specifiers or '...' before 'GLsizei'
  425. code/SDL12/include/SDL_opengl.h:5780: warning: type defaults to 'int' in declaration of 'GLfloat'
  426. code/SDL12/include/SDL_opengl.h:5780: error: expected ';', ',' or ')' before '*' token
  427. code/SDL12/include/SDL_opengl.h:5781: error: expected declaration specifiers or '...' before 'GLsizei'
  428. code/SDL12/include/SDL_opengl.h:5781: warning: type defaults to 'int' in declaration of 'GLshort'
  429. code/SDL12/include/SDL_opengl.h:5781: error: expected ';', ',' or ')' before '*' token
  430. code/SDL12/include/SDL_opengl.h:5782: error: expected declaration specifiers or '...' before 'GLsizei'
  431. code/SDL12/include/SDL_opengl.h:5782: warning: type defaults to 'int' in declaration of 'GLubyte'
  432. code/SDL12/include/SDL_opengl.h:5782: error: expected ';', ',' or ')' before '*' token
  433. code/SDL12/include/SDL_opengl.h:5817: error: expected ')' before 'pname'
  434. code/SDL12/include/SDL_opengl.h:5818: error: expected ')' before 'pname'
  435. code/SDL12/include/SDL_opengl.h:5819: error: expected ')' before 'pname'
  436. code/SDL12/include/SDL_opengl.h:5820: error: expected ')' before 'pname'
  437. code/SDL12/include/SDL_opengl.h:5841: error: 'PFNGLGENFRAGMENTSHADERSATIPROC' declared as function returning a function
  438. code/SDL12/include/SDL_opengl.h:5846: error: expected declaration specifiers or '...' before 'GLenum'
  439. code/SDL12/include/SDL_opengl.h:5847: error: expected declaration specifiers or '...' before 'GLenum'
  440. code/SDL12/include/SDL_opengl.h:5848: error: expected ')' before 'op'
  441. code/SDL12/include/SDL_opengl.h:5849: error: expected ')' before 'op'
  442. code/SDL12/include/SDL_opengl.h:5850: error: expected ')' before 'op'
  443. code/SDL12/include/SDL_opengl.h:5851: error: expected ')' before 'op'
  444. code/SDL12/include/SDL_opengl.h:5852: error: expected ')' before 'op'
  445. code/SDL12/include/SDL_opengl.h:5853: error: expected ')' before 'op'
  446. code/SDL12/include/SDL_opengl.h:5854: warning: type defaults to 'int' in declaration of 'GLfloat'
  447. code/SDL12/include/SDL_opengl.h:5854: error: expected ';', ',' or ')' before '*' token
  448. code/SDL12/include/SDL_opengl.h:5863: error: expected ')' before 'pname'
  449. code/SDL12/include/SDL_opengl.h:5864: error: expected ')' before 'pname'
  450. code/SDL12/include/SDL_opengl.h:5883: error: expected ')' before 'size'
  451. code/SDL12/include/SDL_opengl.h:5884: error: 'PFNGLISOBJECTBUFFERATIPROC' declared as function returning a function
  452. code/SDL12/include/SDL_opengl.h:5885: error: expected declaration specifiers or '...' before 'GLsizei'
  453. code/SDL12/include/SDL_opengl.h:5885: warning: type defaults to 'int' in declaration of 'GLvoid'
  454. code/SDL12/include/SDL_opengl.h:5885: error: expected ';', ',' or ')' before '*' token
  455. code/SDL12/include/SDL_opengl.h:5886: error: expected declaration specifiers or '...' before 'GLenum'
  456. code/SDL12/include/SDL_opengl.h:5886: error: expected declaration specifiers or '...' before 'GLfloat'
  457. code/SDL12/include/SDL_opengl.h:5887: error: expected declaration specifiers or '...' before 'GLenum'
  458. code/SDL12/include/SDL_opengl.h:5889: error: expected ')' before 'array'
  459. code/SDL12/include/SDL_opengl.h:5890: error: expected ')' before 'array'
  460. code/SDL12/include/SDL_opengl.h:5891: error: expected ')' before 'array'
  461. code/SDL12/include/SDL_opengl.h:5892: error: expected declaration specifiers or '...' before 'GLenum'
  462. code/SDL12/include/SDL_opengl.h:5892: error: expected declaration specifiers or '...' before 'GLsizei'
  463. code/SDL12/include/SDL_opengl.h:5893: error: expected declaration specifiers or '...' before 'GLenum'
  464. code/SDL12/include/SDL_opengl.h:5893: error: expected declaration specifiers or '...' before 'GLfloat'
  465. code/SDL12/include/SDL_opengl.h:5894: error: expected declaration specifiers or '...' before 'GLenum'
  466. code/SDL12/include/SDL_opengl.h:5946: error: 'PFNGLGENVERTEXSHADERSEXTPROC' declared as function returning a function
  467. code/SDL12/include/SDL_opengl.h:5948: error: expected ')' before 'op'
  468. code/SDL12/include/SDL_opengl.h:5949: error: expected ')' before 'op'
  469. code/SDL12/include/SDL_opengl.h:5950: error: expected ')' before 'op'
  470. code/SDL12/include/SDL_opengl.h:5951: error: expected declaration specifiers or '...' before 'GLenum'
  471. code/SDL12/include/SDL_opengl.h:5951: error: expected declaration specifiers or '...' before 'GLenum'
  472. code/SDL12/include/SDL_opengl.h:5951: error: expected declaration specifiers or '...' before 'GLenum'
  473. code/SDL12/include/SDL_opengl.h:5951: error: expected declaration specifiers or '...' before 'GLenum'
  474. code/SDL12/include/SDL_opengl.h:5952: error: expected declaration specifiers or '...' before 'GLenum'
  475. code/SDL12/include/SDL_opengl.h:5952: error: expected declaration specifiers or '...' before 'GLenum'
  476. code/SDL12/include/SDL_opengl.h:5952: error: expected declaration specifiers or '...' before 'GLenum'
  477. code/SDL12/include/SDL_opengl.h:5952: error: expected declaration specifiers or '...' before 'GLenum'
  478. code/SDL12/include/SDL_opengl.h:5955: error: expected ')' before 'datatype'
  479. code/SDL12/include/SDL_opengl.h:5956: error: expected declaration specifiers or '...' before 'GLenum'
  480. code/SDL12/include/SDL_opengl.h:5956: warning: type defaults to 'int' in declaration of 'GLvoid'
  481. code/SDL12/include/SDL_opengl.h:5956: error: expected ';', ',' or ')' before '*' token
  482. code/SDL12/include/SDL_opengl.h:5957: error: expected declaration specifiers or '...' before 'GLenum'
  483. code/SDL12/include/SDL_opengl.h:5957: warning: type defaults to 'int' in declaration of 'GLvoid'
  484. code/SDL12/include/SDL_opengl.h:5957: error: expected ';', ',' or ')' before '*' token
  485. code/SDL12/include/SDL_opengl.h:5958: warning: type defaults to 'int' in declaration of 'GLbyte'
  486. code/SDL12/include/SDL_opengl.h:5958: error: expected ';', ',' or ')' before '*' token
  487. code/SDL12/include/SDL_opengl.h:5959: warning: type defaults to 'int' in declaration of 'GLshort'
  488. code/SDL12/include/SDL_opengl.h:5959: error: expected ';', ',' or ')' before '*' token
  489. code/SDL12/include/SDL_opengl.h:5961: warning: type defaults to 'int' in declaration of 'GLfloat'
  490. code/SDL12/include/SDL_opengl.h:5961: error: expected ';', ',' or ')' before '*' token
  491. code/SDL12/include/SDL_opengl.h:5962: warning: type defaults to 'int' in declaration of 'GLdouble'
  492. code/SDL12/include/SDL_opengl.h:5962: error: expected ';', ',' or ')' before '*' token
  493. code/SDL12/include/SDL_opengl.h:5963: warning: type defaults to 'int' in declaration of 'GLubyte'
  494. code/SDL12/include/SDL_opengl.h:5963: error: expected ';', ',' or ')' before '*' token
  495. code/SDL12/include/SDL_opengl.h:5964: warning: type defaults to 'int' in declaration of 'GLushort'
  496. code/SDL12/include/SDL_opengl.h:5964: error: expected ';', ',' or ')' before '*' token
  497. code/SDL12/include/SDL_opengl.h:5966: error: expected declaration specifiers or '...' before 'GLenum'
  498. code/SDL12/include/SDL_opengl.h:5966: warning: type defaults to 'int' in declaration of 'GLvoid'
  499. code/SDL12/include/SDL_opengl.h:5966: error: expected ';', ',' or ')' before '*' token
  500. code/SDL12/include/SDL_opengl.h:5969: error: expected ')' before 'light'
  501. code/SDL12/include/SDL_opengl.h:5970: error: expected ')' before 'face'
  502. code/SDL12/include/SDL_opengl.h:5971: error: expected ')' before 'unit'
  503. code/SDL12/include/SDL_opengl.h:5972: error: expected ')' before 'unit'
  504. code/SDL12/include/SDL_opengl.h:5973: error: expected ')' before 'value'
  505. code/SDL12/include/SDL_opengl.h:5974: error: expected declaration specifiers or '...' before 'GLenum'
  506. code/SDL12/include/SDL_opengl.h:5974: error: 'PFNGLISVARIANTENABLEDEXTPROC' declared as function returning a function
  507. code/SDL12/include/SDL_opengl.h:5975: error: expected declaration specifiers or '...' before 'GLenum'
  508. code/SDL12/include/SDL_opengl.h:5976: error: expected declaration specifiers or '...' before 'GLenum'
  509. code/SDL12/include/SDL_opengl.h:5977: error: expected declaration specifiers or '...' before 'GLenum'
  510. code/SDL12/include/SDL_opengl.h:5977: error: expected declaration specifiers or '...' before 'GLfloat'
  511. code/SDL12/include/SDL_opengl.h:5978: error: expected declaration specifiers or '...' before 'GLenum'
  512. code/SDL12/include/SDL_opengl.h:5978: error: expected declaration specifiers or '...' before 'GLvoid'
  513. code/SDL12/include/SDL_opengl.h:5979: error: expected declaration specifiers or '...' before 'GLenum'
  514. code/SDL12/include/SDL_opengl.h:5980: error: expected declaration specifiers or '...' before 'GLenum'
  515. code/SDL12/include/SDL_opengl.h:5981: error: expected declaration specifiers or '...' before 'GLenum'
  516. code/SDL12/include/SDL_opengl.h:5981: error: expected declaration specifiers or '...' before 'GLfloat'
  517. code/SDL12/include/SDL_opengl.h:5982: error: expected declaration specifiers or '...' before 'GLenum'
  518. code/SDL12/include/SDL_opengl.h:5983: error: expected declaration specifiers or '...' before 'GLenum'
  519. code/SDL12/include/SDL_opengl.h:5984: error: expected declaration specifiers or '...' before 'GLenum'
  520. code/SDL12/include/SDL_opengl.h:5984: error: expected declaration specifiers or '...' before 'GLfloat'
  521. code/SDL12/include/SDL_opengl.h:6036: error: expected ')' before 'stream'
  522. code/SDL12/include/SDL_opengl.h:6037: error: expected ')' before 'stream'
  523. code/SDL12/include/SDL_opengl.h:6038: error: expected ')' before 'stream'
  524. code/SDL12/include/SDL_opengl.h:6039: error: expected ')' before 'stream'
  525. code/SDL12/include/SDL_opengl.h:6040: error: expected ')' before 'stream'
  526. code/SDL12/include/SDL_opengl.h:6041: error: expected ')' before 'stream'
  527. code/SDL12/include/SDL_opengl.h:6042: error: expected ')' before 'stream'
  528. code/SDL12/include/SDL_opengl.h:6043: error: expected ')' before 'stream'
  529. code/SDL12/include/SDL_opengl.h:6044: error: expected ')' before 'stream'
  530. code/SDL12/include/SDL_opengl.h:6045: error: expected ')' before 'stream'
  531. code/SDL12/include/SDL_opengl.h:6046: error: expected ')' before 'stream'
  532. code/SDL12/include/SDL_opengl.h:6047: error: expected ')' before 'stream'
  533. code/SDL12/include/SDL_opengl.h:6048: error: expected ')' before 'stream'
  534. code/SDL12/include/SDL_opengl.h:6049: error: expected ')' before 'stream'
  535. code/SDL12/include/SDL_opengl.h:6050: error: expected ')' before 'stream'
  536. code/SDL12/include/SDL_opengl.h:6051: error: expected ')' before 'stream'
  537. code/SDL12/include/SDL_opengl.h:6052: error: expected ')' before 'stream'
  538. code/SDL12/include/SDL_opengl.h:6053: error: expected ')' before 'stream'
  539. code/SDL12/include/SDL_opengl.h:6054: error: expected ')' before 'stream'
  540. code/SDL12/include/SDL_opengl.h:6055: error: expected ')' before 'stream'
  541. code/SDL12/include/SDL_opengl.h:6056: error: expected ')' before 'stream'
  542. code/SDL12/include/SDL_opengl.h:6057: error: expected ')' before 'stream'
  543. code/SDL12/include/SDL_opengl.h:6058: error: expected ')' before 'stream'
  544. code/SDL12/include/SDL_opengl.h:6059: error: expected ')' before 'stream'
  545. code/SDL12/include/SDL_opengl.h:6060: error: expected ')' before 'stream'
  546. code/SDL12/include/SDL_opengl.h:6061: error: expected ')' before 'stream'
  547. code/SDL12/include/SDL_opengl.h:6062: error: expected ')' before 'stream'
  548. code/SDL12/include/SDL_opengl.h:6063: error: expected ')' before 'stream'
  549. code/SDL12/include/SDL_opengl.h:6064: error: expected ')' before 'stream'
  550. code/SDL12/include/SDL_opengl.h:6065: error: expected ')' before 'stream'
  551. code/SDL12/include/SDL_opengl.h:6066: error: expected ')' before 'stream'
  552. code/SDL12/include/SDL_opengl.h:6067: error: expected ')' before 'stream'
  553. code/SDL12/include/SDL_opengl.h:6068: error: expected ')' before 'stream'
  554. code/SDL12/include/SDL_opengl.h:6069: error: expected ')' before 'stream'
  555. code/SDL12/include/SDL_opengl.h:6070: error: expected ')' before 'stream'
  556. code/SDL12/include/SDL_opengl.h:6071: error: expected ')' before 'stream'
  557. code/SDL12/include/SDL_opengl.h:6072: error: expected ')' before 'stream'
  558. code/SDL12/include/SDL_opengl.h:6073: error: expected ')' before 'stream'
  559. code/SDL12/include/SDL_opengl.h:6074: error: expected ')' before 'stream'
  560. code/SDL12/include/SDL_opengl.h:6075: error: expected ')' before 'stream'
  561. code/SDL12/include/SDL_opengl.h:6076: error: expected ')' before 'stream'
  562. code/SDL12/include/SDL_opengl.h:6077: error: expected ')' before 'stream'
  563. code/SDL12/include/SDL_opengl.h:6078: error: expected ')' before 'stream'
  564. code/SDL12/include/SDL_opengl.h:6079: error: expected ')' before 'pname'
  565. code/SDL12/include/SDL_opengl.h:6080: error: expected ')' before 'pname'
  566. code/SDL12/include/SDL_opengl.h:6090: error: expected ')' before 'type'
  567. code/SDL12/include/SDL_opengl.h:6091: error: expected ')' before 'mode'
  568. code/SDL12/include/SDL_opengl.h:6092: error: expected ')' before 'mode'
  569. code/SDL12/include/SDL_opengl.h:6100: error: expected ')' before 'mode'
  570. code/SDL12/include/SDL_opengl.h:6126: error: expected ')' before 'n'
  571. code/SDL12/include/SDL_opengl.h:6127: error: expected ')' before 'n'
  572. code/SDL12/include/SDL_opengl.h:6128: error: 'PFNGLISOCCLUSIONQUERYNVPROC' declared as function returning a function
  573. code/SDL12/include/SDL_opengl.h:6131: error: expected declaration specifiers or '...' before 'GLenum'
  574. code/SDL12/include/SDL_opengl.h:6132: error: expected declaration specifiers or '...' before 'GLenum'
  575. code/SDL12/include/SDL_opengl.h:6141: error: expected ')' before 'pname'
  576. code/SDL12/include/SDL_opengl.h:6142: error: expected ')' before 'pname'
  577. code/SDL12/include/SDL_opengl.h:6162: error: expected ')' before 'face'
  578. code/SDL12/include/SDL_opengl.h:6182: error: expected ')' before 'type'
  579. code/SDL12/include/SDL_opengl.h:6183: error: expected ')' before 'mode'
  580. code/SDL12/include/SDL_opengl.h:6184: error: expected ')' before 'mode'
  581. code/SDL12/include/SDL_opengl.h:6185: error: expected ')' before 'mode'
  582. code/SDL12/include/SDL_opengl.h:6186: error: expected ')' before 'mode'
  583. code/SDL12/include/SDL_opengl.h:6201: error: expected ')' before 'n'
  584. code/SDL12/include/SDL_opengl.h:6202: error: expected ')' before 'n'
  585. code/SDL12/include/SDL_opengl.h:6204: error: 'PFNGLISFENCEAPPLEPROC' declared as function returning a function
  586. code/SDL12/include/SDL_opengl.h:6205: error: 'PFNGLTESTFENCEAPPLEPROC' declared as function returning a function
  587. code/SDL12/include/SDL_opengl.h:6207: error: expected ')' before 'object'
  588. code/SDL12/include/SDL_opengl.h:6208: error: expected ')' before 'object'
  589. code/SDL12/include/SDL_opengl.h:6220: error: expected ')' before 'n'
  590. code/SDL12/include/SDL_opengl.h:6221: error: expected ')' before 'n'
  591. code/SDL12/include/SDL_opengl.h:6222: error: 'PFNGLISVERTEXARRAYAPPLEPROC' declared as function returning a function
  592. code/SDL12/include/SDL_opengl.h:6232: error: expected ')' before 'length'
  593. code/SDL12/include/SDL_opengl.h:6233: error: expected ')' before 'length'
  594. code/SDL12/include/SDL_opengl.h:6234: error: expected ')' before 'pname'
  595. code/SDL12/include/SDL_opengl.h:6250: error: expected ')' before 'n'
  596. code/SDL12/include/SDL_opengl.h:6283: error: expected declaration specifiers or '...' before 'GLsizei'
  597. code/SDL12/include/SDL_opengl.h:6283: warning: type defaults to 'int' in declaration of 'GLubyte'
  598. code/SDL12/include/SDL_opengl.h:6283: error: expected ';', ',' or ')' before '*' token
  599. code/SDL12/include/SDL_opengl.h:6284: error: expected declaration specifiers or '...' before 'GLsizei'
  600. code/SDL12/include/SDL_opengl.h:6284: warning: type defaults to 'int' in declaration of 'GLubyte'
  601. code/SDL12/include/SDL_opengl.h:6284: error: expected ';', ',' or ')' before '*' token
  602. code/SDL12/include/SDL_opengl.h:6285: error: expected declaration specifiers or '...' before 'GLsizei'
  603. code/SDL12/include/SDL_opengl.h:6285: warning: type defaults to 'int' in declaration of 'GLubyte'
  604. code/SDL12/include/SDL_opengl.h:6285: error: expected ';', ',' or ')' before '*' token
  605. code/SDL12/include/SDL_opengl.h:6286: error: expected declaration specifiers or '...' before 'GLsizei'
  606. code/SDL12/include/SDL_opengl.h:6286: warning: type defaults to 'int' in declaration of 'GLubyte'
  607. code/SDL12/include/SDL_opengl.h:6286: error: expected ';', ',' or ')' before '*' token
  608. code/SDL12/include/SDL_opengl.h:6287: error: expected declaration specifiers or '...' before 'GLsizei'
  609. code/SDL12/include/SDL_opengl.h:6287: warning: type defaults to 'int' in declaration of 'GLubyte'
  610. code/SDL12/include/SDL_opengl.h:6287: error: expected ';', ',' or ')' before '*' token
  611. code/SDL12/include/SDL_opengl.h:6288: error: expected declaration specifiers or '...' before 'GLsizei'
  612. code/SDL12/include/SDL_opengl.h:6288: warning: type defaults to 'int' in declaration of 'GLubyte'
  613. code/SDL12/include/SDL_opengl.h:6288: error: expected ';', ',' or ')' before '*' token
  614. code/SDL12/include/SDL_opengl.h:6361: error: expected ')' before 'target'
  615. code/SDL12/include/SDL_opengl.h:6362: error: expected ')' before 'target'
  616. code/SDL12/include/SDL_opengl.h:6363: error: expected ')' before 'target'
  617. code/SDL12/include/SDL_opengl.h:6364: error: expected ')' before 'target'
  618. code/SDL12/include/SDL_opengl.h:6365: error: expected ')' before 'target'
  619. code/SDL12/include/SDL_opengl.h:6366: error: expected ')' before 'target'
  620. code/SDL12/include/SDL_opengl.h:6367: error: expected ')' before 'target'
  621. code/SDL12/include/SDL_opengl.h:6368: error: expected ')' before 'target'
  622. code/SDL12/include/SDL_opengl.h:6383: error: expected declaration specifiers or '...' before 'GLsizei'
  623. code/SDL12/include/SDL_opengl.h:6384: error: expected declaration specifiers or '...' before 'GLsizei'
  624. code/SDL12/include/SDL_opengl.h:6385: error: expected declaration specifiers or '...' before 'GLsizei'
  625. code/SDL12/include/SDL_opengl.h:6386: error: expected declaration specifiers or '...' before 'GLsizei'
  626. code/SDL12/include/SDL_opengl.h:6395: error: expected ')' before 'target'
  627. code/SDL12/include/SDL_opengl.h:6396: error: expected ')' before 'target'
  628. code/SDL12/include/SDL_opengl.h:6423: error: expected '=', ',', ';', 'asm' or '__attribute__' before '*' token
  629. code/SDL12/include/SDL_opengl.h:6433: error: expected ')' before 'face'
  630. code/SDL12/include/SDL_opengl.h:6434: error: expected ')' before 'frontfunc'
  631. code/SDL12/include/SDL_opengl.h:6444: error: expected declaration specifiers or '...' before 'GLenum'
  632. code/SDL12/include/SDL_opengl.h:6444: error: expected declaration specifiers or '...' before 'GLsizei'
  633. code/SDL12/include/SDL_opengl.h:6445: error: expected declaration specifiers or '...' before 'GLenum'
  634. code/SDL12/include/SDL_opengl.h:6445: error: expected declaration specifiers or '...' before 'GLfloat'
  635. code/SDL12/include/SDL_opengl.h:6446: error: expected declaration specifiers or '...' before 'GLenum'
  636. code/SDL12/include/SDL_opengl.h:6458: error: expected ')' before 'zmin'
  637. code/SDL12/include/SDL_opengl.h:6470: error: expected ')' before 'modeRGB'
  638. code/SDL12/include/SDL_opengl.h:6522: error: 'PFNGLISRENDERBUFFEREXTPROC' declared as function returning a function
  639. code/SDL12/include/SDL_opengl.h:6523: error: expected ')' before 'target'
  640. code/SDL12/include/SDL_opengl.h:6524: error: expected ')' before 'n'
  641. code/SDL12/include/SDL_opengl.h:6525: error: expected ')' before 'n'
  642. code/SDL12/include/SDL_opengl.h:6526: error: expected ')' before 'target'
  643. code/SDL12/include/SDL_opengl.h:6527: error: expected ')' before 'target'
  644. code/SDL12/include/SDL_opengl.h:6528: error: 'PFNGLISFRAMEBUFFEREXTPROC' declared as function returning a function
  645. code/SDL12/include/SDL_opengl.h:6529: error: expected ')' before 'target'
  646. code/SDL12/include/SDL_opengl.h:6530: error: expected ')' before 'n'
  647. code/SDL12/include/SDL_opengl.h:6531: error: expected ')' before 'n'
  648. code/SDL12/include/SDL_opengl.h:6532: error: expected declaration specifiers or '...' before '*' token
  649. code/SDL12/include/SDL_opengl.h:6532: error: expected ')' before 'target'
  650. code/SDL12/include/SDL_opengl.h:6533: error: expected ')' before 'target'
  651. code/SDL12/include/SDL_opengl.h:6534: error: expected ')' before 'target'
  652. code/SDL12/include/SDL_opengl.h:6535: error: expected ')' before 'target'
  653. code/SDL12/include/SDL_opengl.h:6536: error: expected ')' before 'target'
  654. code/SDL12/include/SDL_opengl.h:6537: error: expected ')' before 'target'
  655. code/SDL12/include/SDL_opengl.h:6538: error: expected ')' before 'target'
  656. code/SDL12/include/SDL_opengl.h:6546: error: expected ')' before 'len'
  657. In file included from code/jpeg-6b/../renderer/tr_local.h:31,
  658.                  from code/jpeg-6b/jerror.c:21:
  659. code/jpeg-6b/../renderer/qgl.h:35: error: expected ')' before 'texture'
  660. code/jpeg-6b/../renderer/qgl.h:36: error: expected ')' before 'texture'
  661. code/jpeg-6b/../renderer/qgl.h:37: error: expected ')' before 'target'
  662. code/jpeg-6b/../renderer/qgl.h:39: error: expected declaration specifiers or '...' before 'GLsizei'
  663. code/jpeg-6b/../renderer/qgl.h:43: error: expected declaration specifiers or '...' before '*' token
  664. code/jpeg-6b/../renderer/qgl.h:43: warning: type defaults to 'int' in declaration of 'GLvoid'
  665. code/jpeg-6b/../renderer/qgl.h:43: error: 'GLvoid' declared as function returning a function
  666. code/jpeg-6b/../renderer/qgl.h:43: warning: function declaration isn't a prototype
  667. code/jpeg-6b/../renderer/qgl.h:44: error: expected ')' before 'pname'
  668. code/jpeg-6b/../renderer/qgl.h:45: error: expected declaration specifiers or '...' before '*' token
  669. code/jpeg-6b/../renderer/qgl.h:45: warning: type defaults to 'int' in declaration of 'GLvoid'
  670. code/jpeg-6b/../renderer/qgl.h:45: error: 'GLvoid' declared as function returning a function
  671. code/jpeg-6b/../renderer/qgl.h:45: warning: function declaration isn't a prototype
  672. code/jpeg-6b/../renderer/qgl.h:46: error: expected ')' before 'shaderType'
  673. code/jpeg-6b/../renderer/qgl.h:47: error: expected declaration specifiers or '...' before '*' token
  674. code/jpeg-6b/../renderer/qgl.h:47: error: expected declaration specifiers or '...' before 'GLsizei'
  675. code/jpeg-6b/../renderer/qgl.h:48: warning: type defaults to 'int' in declaration of 'GLvoid'
  676. code/jpeg-6b/../renderer/qgl.h:48: error: 'GLvoid' declared as function returning a function
  677. code/jpeg-6b/../renderer/qgl.h:48: warning: function declaration isn't a prototype
  678. code/jpeg-6b/../renderer/qgl.h:49: error: expected declaration specifiers or '...' before '*' token
  679. code/jpeg-6b/../renderer/qgl.h:49: warning: type defaults to 'int' in declaration of 'GLvoid'
  680. code/jpeg-6b/../renderer/qgl.h:49: error: 'GLvoid' declared as function returning a function
  681. code/jpeg-6b/../renderer/qgl.h:49: warning: function declaration isn't a prototype
  682. code/jpeg-6b/../renderer/qgl.h:51: error: expected declaration specifiers or '...' before '*' token
  683. code/jpeg-6b/../renderer/qgl.h:51: warning: type defaults to 'int' in declaration of 'GLvoid'
  684. code/jpeg-6b/../renderer/qgl.h:51: error: 'GLvoid' declared as function returning a function
  685. code/jpeg-6b/../renderer/qgl.h:51: warning: function declaration isn't a prototype
  686. code/jpeg-6b/../renderer/qgl.h:52: error: expected declaration specifiers or '...' before '*' token
  687. code/jpeg-6b/../renderer/qgl.h:52: warning: type defaults to 'int' in declaration of 'GLvoid'
  688. code/jpeg-6b/../renderer/qgl.h:52: error: 'GLvoid' declared as function returning a function
  689. code/jpeg-6b/../renderer/qgl.h:52: warning: function declaration isn't a prototype
  690. code/jpeg-6b/../renderer/qgl.h:53: error: expected declaration specifiers or '...' before '*' token
  691. code/jpeg-6b/../renderer/qgl.h:53: warning: type defaults to 'int' in declaration of 'GLvoid'
  692. code/jpeg-6b/../renderer/qgl.h:53: error: 'GLvoid' declared as function returning a function
  693. code/jpeg-6b/../renderer/qgl.h:53: warning: function declaration isn't a prototype
  694. code/jpeg-6b/../renderer/qgl.h:54: error: expected declaration specifiers or '...' before '*' token
  695. code/jpeg-6b/../renderer/qgl.h:54: warning: type defaults to 'int' in declaration of 'GLvoid'
  696. code/jpeg-6b/../renderer/qgl.h:54: error: 'GLvoid' declared as function returning a function
  697. code/jpeg-6b/../renderer/qgl.h:54: warning: function declaration isn't a prototype
  698. code/jpeg-6b/../renderer/qgl.h:55: error: expected declaration specifiers or '...' before '*' token
  699. code/jpeg-6b/../renderer/qgl.h:55: error: expected declaration specifiers or '...' before 'GLfloat'
  700. code/jpeg-6b/../renderer/qgl.h:55: warning: type defaults to 'int' in declaration of 'GLvoid'
  701. code/jpeg-6b/../renderer/qgl.h:55: error: 'GLvoid' declared as function returning a function
  702. code/jpeg-6b/../renderer/qgl.h:55: warning: function declaration isn't a prototype
  703. code/jpeg-6b/../renderer/qgl.h:56: error: expected declaration specifiers or '...' before '*' token
  704. code/jpeg-6b/../renderer/qgl.h:56: error: expected declaration specifiers or '...' before 'GLfloat'
  705. code/jpeg-6b/../renderer/qgl.h:56: error: expected declaration specifiers or '...' before 'GLfloat'
  706. code/jpeg-6b/../renderer/qgl.h:56: warning: type defaults to 'int' in declaration of 'GLvoid'
  707. code/jpeg-6b/../renderer/qgl.h:56: error: 'GLvoid' declared as function returning a function
  708. code/jpeg-6b/../renderer/qgl.h:56: warning: function declaration isn't a prototype
  709. code/jpeg-6b/../renderer/qgl.h:57: error: expected declaration specifiers or '...' before '*' token
  710. code/jpeg-6b/../renderer/qgl.h:57: error: expected declaration specifiers or '...' before 'GLfloat'
  711. code/jpeg-6b/../renderer/qgl.h:57: error: expected declaration specifiers or '...' before 'GLfloat'
  712. code/jpeg-6b/../renderer/qgl.h:57: error: expected declaration specifiers or '...' before 'GLfloat'
  713. code/jpeg-6b/../renderer/qgl.h:57: warning: type defaults to 'int' in declaration of 'GLvoid'
  714. code/jpeg-6b/../renderer/qgl.h:57: error: 'GLvoid' declared as function returning a function
  715. code/jpeg-6b/../renderer/qgl.h:57: warning: function declaration isn't a prototype
  716. code/jpeg-6b/../renderer/qgl.h:58: error: expected declaration specifiers or '...' before '*' token
  717. code/jpeg-6b/../renderer/qgl.h:58: error: expected declaration specifiers or '...' before 'GLfloat'
  718. code/jpeg-6b/../renderer/qgl.h:58: error: expected declaration specifiers or '...' before 'GLfloat'
  719. code/jpeg-6b/../renderer/qgl.h:58: error: expected declaration specifiers or '...' before 'GLfloat'
  720. code/jpeg-6b/../renderer/qgl.h:58: error: expected declaration specifiers or '...' before 'GLfloat'
  721. code/jpeg-6b/../renderer/qgl.h:58: warning: type defaults to 'int' in declaration of 'GLvoid'
  722. code/jpeg-6b/../renderer/qgl.h:58: error: 'GLvoid' declared as function returning a function
  723. code/jpeg-6b/../renderer/qgl.h:58: warning: function declaration isn't a prototype
  724. code/jpeg-6b/../renderer/qgl.h:59: error: expected declaration specifiers or '...' before '*' token
  725. code/jpeg-6b/../renderer/qgl.h:59: warning: type defaults to 'int' in declaration of 'GLvoid'
  726. code/jpeg-6b/../renderer/qgl.h:59: error: 'GLvoid' declared as function returning a function
  727. code/jpeg-6b/../renderer/qgl.h:59: warning: function declaration isn't a prototype
  728. code/jpeg-6b/../renderer/qgl.h:60: error: expected declaration specifiers or '...' before '*' token
  729. code/jpeg-6b/../renderer/qgl.h:60: warning: type defaults to 'int' in declaration of 'GLvoid'
  730. code/jpeg-6b/../renderer/qgl.h:60: error: 'GLvoid' declared as function returning a function
  731. code/jpeg-6b/../renderer/qgl.h:60: warning: function declaration isn't a prototype
  732. code/jpeg-6b/../renderer/qgl.h:61: error: expected declaration specifiers or '...' before '*' token
  733. code/jpeg-6b/../renderer/qgl.h:61: warning: type defaults to 'int' in declaration of 'GLvoid'
  734. code/jpeg-6b/../renderer/qgl.h:61: error: 'GLvoid' declared as function returning a function
  735. code/jpeg-6b/../renderer/qgl.h:61: warning: function declaration isn't a prototype
  736. code/jpeg-6b/../renderer/qgl.h:62: error: expected declaration specifiers or '...' before '*' token
  737. code/jpeg-6b/../renderer/qgl.h:62: warning: type defaults to 'int' in declaration of 'GLvoid'
  738. code/jpeg-6b/../renderer/qgl.h:62: error: 'GLvoid' declared as function returning a function
  739. code/jpeg-6b/../renderer/qgl.h:62: warning: function declaration isn't a prototype
  740. code/jpeg-6b/../renderer/qgl.h:63: error: expected declaration specifiers or '...' before '*' token
  741. code/jpeg-6b/../renderer/qgl.h:63: error: expected declaration specifiers or '...' before 'GLsizei'
  742. code/jpeg-6b/../renderer/qgl.h:63: warning: type defaults to 'int' in declaration of 'GLfloat'
  743. code/jpeg-6b/../renderer/qgl.h:63: error: expected ';', ',' or ')' before '*' token
  744. code/jpeg-6b/../renderer/qgl.h:64: error: expected declaration specifiers or '...' before '*' token
  745. code/jpeg-6b/../renderer/qgl.h:64: error: expected declaration specifiers or '...' before 'GLsizei'
  746. code/jpeg-6b/../renderer/qgl.h:64: warning: type defaults to 'int' in declaration of 'GLfloat'
  747. code/jpeg-6b/../renderer/qgl.h:64: error: expected ';', ',' or ')' before '*' token
  748. code/jpeg-6b/../renderer/qgl.h:65: error: expected declaration specifiers or '...' before '*' token
  749. code/jpeg-6b/../renderer/qgl.h:65: error: expected declaration specifiers or '...' before 'GLsizei'
  750. code/jpeg-6b/../renderer/qgl.h:65: warning: type defaults to 'int' in declaration of 'GLfloat'
  751. code/jpeg-6b/../renderer/qgl.h:65: error: expected ';', ',' or ')' before '*' token
  752. code/jpeg-6b/../renderer/qgl.h:66: error: expected declaration specifiers or '...' before '*' token
  753. code/jpeg-6b/../renderer/qgl.h:66: error: expected declaration specifiers or '...' before 'GLsizei'
  754. code/jpeg-6b/../renderer/qgl.h:66: warning: type defaults to 'int' in declaration of 'GLfloat'
  755. code/jpeg-6b/../renderer/qgl.h:66: error: expected ';', ',' or ')' before '*' token
  756. code/jpeg-6b/../renderer/qgl.h:67: error: expected declaration specifiers or '...' before '*' token
  757. code/jpeg-6b/../renderer/qgl.h:67: error: expected declaration specifiers or '...' before 'GLsizei'
  758. code/jpeg-6b/../renderer/qgl.h:67: warning: type defaults to 'int' in declaration of 'GLvoid'
  759. code/jpeg-6b/../renderer/qgl.h:67: error: 'GLvoid' declared as function returning a function
  760. code/jpeg-6b/../renderer/qgl.h:67: warning: function declaration isn't a prototype
  761. code/jpeg-6b/../renderer/qgl.h:68: error: expected declaration specifiers or '...' before '*' token
  762. code/jpeg-6b/../renderer/qgl.h:68: error: expected declaration specifiers or '...' before 'GLsizei'
  763. code/jpeg-6b/../renderer/qgl.h:68: warning: type defaults to 'int' in declaration of 'GLvoid'
  764. code/jpeg-6b/../renderer/qgl.h:68: error: 'GLvoid' declared as function returning a function
  765. code/jpeg-6b/../renderer/qgl.h:68: warning: function declaration isn't a prototype
  766. code/jpeg-6b/../renderer/qgl.h:69: error: expected declaration specifiers or '...' before '*' token
  767. code/jpeg-6b/../renderer/qgl.h:69: error: expected declaration specifiers or '...' before 'GLsizei'
  768. code/jpeg-6b/../renderer/qgl.h:69: warning: type defaults to 'int' in declaration of 'GLvoid'
  769. code/jpeg-6b/../renderer/qgl.h:69: error: 'GLvoid' declared as function returning a function
  770. code/jpeg-6b/../renderer/qgl.h:69: warning: function declaration isn't a prototype
  771. code/jpeg-6b/../renderer/qgl.h:70: error: expected declaration specifiers or '...' before '*' token
  772. code/jpeg-6b/../renderer/qgl.h:70: error: expected declaration specifiers or '...' before 'GLsizei'
  773. code/jpeg-6b/../renderer/qgl.h:70: warning: type defaults to 'int' in declaration of 'GLvoid'
  774. code/jpeg-6b/../renderer/qgl.h:70: error: 'GLvoid' declared as function returning a function
  775. code/jpeg-6b/../renderer/qgl.h:70: warning: function declaration isn't a prototype
  776. code/jpeg-6b/../renderer/qgl.h:71: error: expected declaration specifiers or '...' before '*' token
  777. code/jpeg-6b/../renderer/qgl.h:71: error: expected declaration specifiers or '...' before 'GLsizei'
  778. code/jpeg-6b/../renderer/qgl.h:71: warning: type defaults to 'int' in declaration of 'GLfloat'
  779. code/jpeg-6b/../renderer/qgl.h:71: error: expected ';', ',' or ')' before '*' token
  780. code/jpeg-6b/../renderer/qgl.h:72: error: expected declaration specifiers or '...' before '*' token
  781. code/jpeg-6b/../renderer/qgl.h:72: error: expected declaration specifiers or '...' before 'GLsizei'
  782. code/jpeg-6b/../renderer/qgl.h:72: warning: type defaults to 'int' in declaration of 'GLfloat'
  783. code/jpeg-6b/../renderer/qgl.h:72: error: expected ';', ',' or ')' before '*' token
  784. code/jpeg-6b/../renderer/qgl.h:73: error: expected declaration specifiers or '...' before '*' token
  785. code/jpeg-6b/../renderer/qgl.h:73: error: expected declaration specifiers or '...' before 'GLsizei'
  786. code/jpeg-6b/../renderer/qgl.h:73: warning: type defaults to 'int' in declaration of 'GLfloat'
  787. code/jpeg-6b/../renderer/qgl.h:73: error: expected ';', ',' or ')' before '*' token
  788. code/jpeg-6b/../renderer/qgl.h:74: error: expected declaration specifiers or '...' before '*' token
  789. code/jpeg-6b/../renderer/qgl.h:74: error: expected declaration specifiers or '...' before 'GLenum'
  790. code/jpeg-6b/../renderer/qgl.h:74: error: expected declaration specifiers or '...' before 'GLfloat'
  791. code/jpeg-6b/../renderer/qgl.h:74: warning: type defaults to 'int' in declaration of 'GLvoid'
  792. code/jpeg-6b/../renderer/qgl.h:74: error: 'GLvoid' declared as function returning a function
  793. code/jpeg-6b/../renderer/qgl.h:74: warning: function declaration isn't a prototype
  794. code/jpeg-6b/../renderer/qgl.h:75: error: expected declaration specifiers or '...' before '*' token
  795. code/jpeg-6b/../renderer/qgl.h:75: error: expected declaration specifiers or '...' before 'GLenum'
  796. code/jpeg-6b/../renderer/qgl.h:75: warning: type defaults to 'int' in declaration of 'GLvoid'
  797. code/jpeg-6b/../renderer/qgl.h:75: error: 'GLvoid' declared as function returning a function
  798. code/jpeg-6b/../renderer/qgl.h:75: warning: function declaration isn't a prototype
  799. code/jpeg-6b/../renderer/qgl.h:76: error: expected declaration specifiers or '...' before '*' token
  800. code/jpeg-6b/../renderer/qgl.h:76: error: expected declaration specifiers or '...' before 'GLsizei'
  801. code/jpeg-6b/../renderer/qgl.h:76: error: expected declaration specifiers or '...' before 'GLsizei'
  802. code/jpeg-6b/../renderer/qgl.h:76: warning: type defaults to 'int' in declaration of 'GLvoid'
  803. code/jpeg-6b/../renderer/qgl.h:76: error: 'GLvoid' declared as function returning a function
  804. code/jpeg-6b/../renderer/qgl.h:76: warning: function declaration isn't a prototype
  805. code/jpeg-6b/../renderer/qgl.h:77: error: expected declaration specifiers or '...' before '*' token
  806. code/jpeg-6b/../renderer/qgl.h:77: error: expected declaration specifiers or '...' before 'GLsizei'
  807. code/jpeg-6b/../renderer/qgl.h:77: error: expected declaration specifiers or '...' before 'GLsizei'
  808. code/jpeg-6b/../renderer/qgl.h:78: warning: type defaults to 'int' in declaration of 'GLvoid'
  809. code/jpeg-6b/../renderer/qgl.h:78: error: 'GLvoid' declared as function returning a function
  810. code/jpeg-6b/../renderer/qgl.h:78: warning: function declaration isn't a prototype
  811. code/jpeg-6b/../renderer/qgl.h:79: error: 'qglGetUniformLocationARB' declared as function returning a function
  812. code/jpeg-6b/../renderer/qgl.h:80: error: expected declaration specifiers or '...' before '*' token
  813. code/jpeg-6b/../renderer/qgl.h:80: error: expected declaration specifiers or '...' before 'GLsizei'
  814. code/jpeg-6b/../renderer/qgl.h:81: error: expected declaration specifiers or '...' before 'GLsizei'
  815. code/jpeg-6b/../renderer/qgl.h:81: error: expected declaration specifiers or '...' before 'GLenum'
  816. code/jpeg-6b/../renderer/qgl.h:81: warning: type defaults to 'int' in declaration of 'GLvoid'
  817. code/jpeg-6b/../renderer/qgl.h:81: error: 'GLvoid' declared as function returning a function
  818. code/jpeg-6b/../renderer/qgl.h:81: warning: function declaration isn't a prototype
  819. code/jpeg-6b/../renderer/qgl.h:82: error: expected declaration specifiers or '...' before '*' token
  820. code/jpeg-6b/../renderer/qgl.h:82: error: expected declaration specifiers or '...' before 'GLfloat'
  821. code/jpeg-6b/../renderer/qgl.h:82: warning: type defaults to 'int' in declaration of 'GLvoid'
  822. code/jpeg-6b/../renderer/qgl.h:82: error: 'GLvoid' declared as function returning a function
  823. code/jpeg-6b/../renderer/qgl.h:82: warning: function declaration isn't a prototype
  824. code/jpeg-6b/../renderer/qgl.h:83: error: expected declaration specifiers or '...' before '*' token
  825. code/jpeg-6b/../renderer/qgl.h:83: warning: type defaults to 'int' in declaration of 'GLvoid'
  826. code/jpeg-6b/../renderer/qgl.h:83: error: 'GLvoid' declared as function returning a function
  827. code/jpeg-6b/../renderer/qgl.h:83: warning: function declaration isn't a prototype
  828. code/jpeg-6b/../renderer/qgl.h:84: error: expected declaration specifiers or '...' before '*' token
  829. code/jpeg-6b/../renderer/qgl.h:84: error: expected declaration specifiers or '...' before 'GLsizei'
  830. code/jpeg-6b/../renderer/qgl.h:84: error: expected declaration specifiers or '...' before 'GLsizei'
  831. code/jpeg-6b/../renderer/qgl.h:85: warning: type defaults to 'int' in declaration of 'GLvoid'
  832. code/jpeg-6b/../renderer/qgl.h:85: error: 'GLvoid' declared as function returning a function
  833. code/jpeg-6b/../renderer/qgl.h:85: warning: function declaration isn't a prototype
  834. code/jpeg-6b/../renderer/qgl.h:86: error: expected declaration specifiers or '...' before '*' token
  835. code/jpeg-6b/../renderer/qgl.h:86: error: expected declaration specifiers or '...' before 'GLfloat'
  836. code/jpeg-6b/../renderer/qgl.h:86: warning: type defaults to 'int' in declaration of 'GLvoid'
  837. code/jpeg-6b/../renderer/qgl.h:86: error: 'GLvoid' declared as function returning a function
  838. code/jpeg-6b/../renderer/qgl.h:86: warning: function declaration isn't a prototype
  839. code/jpeg-6b/../renderer/qgl.h:87: error: expected declaration specifiers or '...' before '*' token
  840. code/jpeg-6b/../renderer/qgl.h:87: error: expected declaration specifiers or '...' before 'GLshort'
  841. code/jpeg-6b/../renderer/qgl.h:87: warning: type defaults to 'int' in declaration of 'GLvoid'
  842. code/jpeg-6b/../renderer/qgl.h:87: error: 'GLvoid' declared as function returning a function
  843. code/jpeg-6b/../renderer/qgl.h:87: warning: function declaration isn't a prototype
  844. code/jpeg-6b/../renderer/qgl.h:88: error: expected declaration specifiers or '...' before '*' token
  845. code/jpeg-6b/../renderer/qgl.h:88: error: expected declaration specifiers or '...' before 'GLdouble'
  846. code/jpeg-6b/../renderer/qgl.h:88: warning: type defaults to 'int' in declaration of 'GLvoid'
  847. code/jpeg-6b/../renderer/qgl.h:88: error: 'GLvoid' declared as function returning a function
  848. code/jpeg-6b/../renderer/qgl.h:88: warning: function declaration isn't a prototype
  849. code/jpeg-6b/../renderer/qgl.h:89: error: expected declaration specifiers or '...' before '*' token
  850. code/jpeg-6b/../renderer/qgl.h:89: error: expected declaration specifiers or '...' before 'GLfloat'
  851. code/jpeg-6b/../renderer/qgl.h:89: error: expected declaration specifiers or '...' before 'GLfloat'
  852. code/jpeg-6b/../renderer/qgl.h:89: warning: type defaults to 'int' in declaration of 'GLvoid'
  853. code/jpeg-6b/../renderer/qgl.h:89: error: 'GLvoid' declared as function returning a function
  854. code/jpeg-6b/../renderer/qgl.h:89: warning: function declaration isn't a prototype
  855. code/jpeg-6b/../renderer/qgl.h:90: error: expected declaration specifiers or '...' before '*' token
  856. code/jpeg-6b/../renderer/qgl.h:90: error: expected declaration specifiers or '...' before 'GLshort'
  857. code/jpeg-6b/../renderer/qgl.h:90: error: expected declaration specifiers or '...' before 'GLshort'
  858. code/jpeg-6b/../renderer/qgl.h:90: warning: type defaults to 'int' in declaration of 'GLvoid'
  859. code/jpeg-6b/../renderer/qgl.h:90: error: 'GLvoid' declared as function returning a function
  860. code/jpeg-6b/../renderer/qgl.h:90: warning: function declaration isn't a prototype
  861. code/jpeg-6b/../renderer/qgl.h:91: error: expected declaration specifiers or '...' before '*' token
  862. code/jpeg-6b/../renderer/qgl.h:91: error: expected declaration specifiers or '...' before 'GLdouble'
  863. code/jpeg-6b/../renderer/qgl.h:91: error: expected declaration specifiers or '...' before 'GLdouble'
  864. code/jpeg-6b/../renderer/qgl.h:91: warning: type defaults to 'int' in declaration of 'GLvoid'
  865. code/jpeg-6b/../renderer/qgl.h:91: error: 'GLvoid' declared as function returning a function
  866. code/jpeg-6b/../renderer/qgl.h:91: warning: function declaration isn't a prototype
  867. code/jpeg-6b/../renderer/qgl.h:92: error: expected declaration specifiers or '...' before '*' token
  868. code/jpeg-6b/../renderer/qgl.h:92: error: expected declaration specifiers or '...' before 'GLfloat'
  869. code/jpeg-6b/../renderer/qgl.h:92: error: expected declaration specifiers or '...' before 'GLfloat'
  870. code/jpeg-6b/../renderer/qgl.h:92: error: expected declaration specifiers or '...' before 'GLfloat'
  871. code/jpeg-6b/../renderer/qgl.h:92: warning: type defaults to 'int' in declaration of 'GLvoid'
  872. code/jpeg-6b/../renderer/qgl.h:92: error: 'GLvoid' declared as function returning a function
  873. code/jpeg-6b/../renderer/qgl.h:92: warning: function declaration isn't a prototype
  874. code/jpeg-6b/../renderer/qgl.h:93: error: expected declaration specifiers or '...' before '*' token
  875. code/jpeg-6b/../renderer/qgl.h:93: error: expected declaration specifiers or '...' before 'GLshort'
  876. code/jpeg-6b/../renderer/qgl.h:93: error: expected declaration specifiers or '...' before 'GLshort'
  877. code/jpeg-6b/../renderer/qgl.h:93: error: expected declaration specifiers or '...' before 'GLshort'
  878. code/jpeg-6b/../renderer/qgl.h:93: warning: type defaults to 'int' in declaration of 'GLvoid'
  879. code/jpeg-6b/../renderer/qgl.h:93: error: 'GLvoid' declared as function returning a function
  880. code/jpeg-6b/../renderer/qgl.h:93: warning: function declaration isn't a prototype
  881. code/jpeg-6b/../renderer/qgl.h:94: error: expected declaration specifiers or '...' before '*' token
  882. code/jpeg-6b/../renderer/qgl.h:94: error: expected declaration specifiers or '...' before 'GLdouble'
  883. code/jpeg-6b/../renderer/qgl.h:94: error: expected declaration specifiers or '...' before 'GLdouble'
  884. code/jpeg-6b/../renderer/qgl.h:94: error: expected declaration specifiers or '...' before 'GLdouble'
  885. code/jpeg-6b/../renderer/qgl.h:94: warning: type defaults to 'int' in declaration of 'GLvoid'
  886. code/jpeg-6b/../renderer/qgl.h:94: error: 'GLvoid' declared as function returning a function
  887. code/jpeg-6b/../renderer/qgl.h:94: warning: function declaration isn't a prototype
  888. code/jpeg-6b/../renderer/qgl.h:95: error: expected declaration specifiers or '...' before '*' token
  889. code/jpeg-6b/../renderer/qgl.h:95: error: expected declaration specifiers or '...' before 'GLfloat'
  890. code/jpeg-6b/../renderer/qgl.h:95: error: expected declaration specifiers or '...' before 'GLfloat'
  891. code/jpeg-6b/../renderer/qgl.h:95: error: expected declaration specifiers or '...' before 'GLfloat'
  892. code/jpeg-6b/../renderer/qgl.h:95: error: expected declaration specifiers or '...' before 'GLfloat'
  893. code/jpeg-6b/../renderer/qgl.h:95: warning: type defaults to 'int' in declaration of 'GLvoid'
  894. code/jpeg-6b/../renderer/qgl.h:95: error: 'GLvoid' declared as function returning a function
  895. code/jpeg-6b/../renderer/qgl.h:95: warning: function declaration isn't a prototype
  896. code/jpeg-6b/../renderer/qgl.h:96: error: expected declaration specifiers or '...' before '*' token
  897. code/jpeg-6b/../renderer/qgl.h:96: error: expected declaration specifiers or '...' before 'GLshort'
  898. code/jpeg-6b/../renderer/qgl.h:96: error: expected declaration specifiers or '...' before 'GLshort'
  899. code/jpeg-6b/../renderer/qgl.h:96: error: expected declaration specifiers or '...' before 'GLshort'
  900. code/jpeg-6b/../renderer/qgl.h:96: error: expected declaration specifiers or '...' before 'GLshort'
  901. code/jpeg-6b/../renderer/qgl.h:96: warning: type defaults to 'int' in declaration of 'GLvoid'
  902. code/jpeg-6b/../renderer/qgl.h:96: error: 'GLvoid' declared as function returning a function
  903. code/jpeg-6b/../renderer/qgl.h:96: warning: function declaration isn't a prototype
  904. code/jpeg-6b/../renderer/qgl.h:97: error: expected declaration specifiers or '...' before '*' token
  905. code/jpeg-6b/../renderer/qgl.h:97: error: expected declaration specifiers or '...' before 'GLdouble'
  906. code/jpeg-6b/../renderer/qgl.h:97: error: expected declaration specifiers or '...' before 'GLdouble'
  907. code/jpeg-6b/../renderer/qgl.h:97: error: expected declaration specifiers or '...' before 'GLdouble'
  908. code/jpeg-6b/../renderer/qgl.h:97: error: expected declaration specifiers or '...' before 'GLdouble'
  909. code/jpeg-6b/../renderer/qgl.h:97: warning: type defaults to 'int' in declaration of 'GLvoid'
  910. code/jpeg-6b/../renderer/qgl.h:97: error: 'GLvoid' declared as function returning a function
  911. code/jpeg-6b/../renderer/qgl.h:97: warning: function declaration isn't a prototype
  912. code/jpeg-6b/../renderer/qgl.h:98: error: expected declaration specifiers or '...' before '*' token
  913. code/jpeg-6b/../renderer/qgl.h:98: error: expected declaration specifiers or '...' before 'GLubyte'
  914. code/jpeg-6b/../renderer/qgl.h:98: error: expected declaration specifiers or '...' before 'GLubyte'
  915. code/jpeg-6b/../renderer/qgl.h:98: error: expected declaration specifiers or '...' before 'GLubyte'
  916. code/jpeg-6b/../renderer/qgl.h:98: error: expected declaration specifiers or '...' before 'GLubyte'
  917. code/jpeg-6b/../renderer/qgl.h:98: warning: type defaults to 'int' in declaration of 'GLvoid'
  918. code/jpeg-6b/../renderer/qgl.h:98: error: 'GLvoid' declared as function returning a function
  919. code/jpeg-6b/../renderer/qgl.h:98: warning: function declaration isn't a prototype
  920. code/jpeg-6b/../renderer/qgl.h:99: error: expected declaration specifiers or '...' before '*' token
  921. code/jpeg-6b/../renderer/qgl.h:99: error: expected declaration specifiers or '...' before 'GLfloat'
  922. code/jpeg-6b/../renderer/qgl.h:99: warning: type defaults to 'int' in declaration of 'GLvoid'
  923. code/jpeg-6b/../renderer/qgl.h:99: error: 'GLvoid' declared as function returning a function
  924. code/jpeg-6b/../renderer/qgl.h:99: warning: function declaration isn't a prototype
  925. code/jpeg-6b/../renderer/qgl.h:100: error: expected declaration specifiers or '...' before '*' token
  926. code/jpeg-6b/../renderer/qgl.h:100: error: expected declaration specifiers or '...' before 'GLshort'
  927. code/jpeg-6b/../renderer/qgl.h:100: warning: type defaults to 'int' in declaration of 'GLvoid'
  928. code/jpeg-6b/../renderer/qgl.h:100: error: 'GLvoid' declared as function returning a function
  929. code/jpeg-6b/../renderer/qgl.h:100: warning: function declaration isn't a prototype
  930. code/jpeg-6b/../renderer/qgl.h:101: error: expected declaration specifiers or '...' before '*' token
  931. code/jpeg-6b/../renderer/qgl.h:101: error: expected declaration specifiers or '...' before 'GLdouble'
  932. code/jpeg-6b/../renderer/qgl.h:101: warning: type defaults to 'int' in declaration of 'GLvoid'
  933. code/jpeg-6b/../renderer/qgl.h:101: error: 'GLvoid' declared as function returning a function
  934. code/jpeg-6b/../renderer/qgl.h:101: warning: function declaration isn't a prototype
  935. code/jpeg-6b/../renderer/qgl.h:102: error: expected declaration specifiers or '...' before '*' token
  936. code/jpeg-6b/../renderer/qgl.h:102: error: expected declaration specifiers or '...' before 'GLfloat'
  937. code/jpeg-6b/../renderer/qgl.h:102: warning: type defaults to 'int' in declaration of 'GLvoid'
  938. code/jpeg-6b/../renderer/qgl.h:102: error: 'GLvoid' declared as function returning a function
  939. code/jpeg-6b/../renderer/qgl.h:102: warning: function declaration isn't a prototype
  940. code/jpeg-6b/../renderer/qgl.h:103: error: expected declaration specifiers or '...' before '*' token
  941. code/jpeg-6b/../renderer/qgl.h:103: error: expected declaration specifiers or '...' before 'GLshort'
  942. code/jpeg-6b/../renderer/qgl.h:103: warning: type defaults to 'int' in declaration of 'GLvoid'
  943. code/jpeg-6b/../renderer/qgl.h:103: error: 'GLvoid' declared as function returning a function
  944. code/jpeg-6b/../renderer/qgl.h:103: warning: function declaration isn't a prototype
  945. code/jpeg-6b/../renderer/qgl.h:104: error: expected declaration specifiers or '...' before '*' token
  946. code/jpeg-6b/../renderer/qgl.h:104: error: expected declaration specifiers or '...' before 'GLdouble'
  947. code/jpeg-6b/../renderer/qgl.h:104: warning: type defaults to 'int' in declaration of 'GLvoid'
  948. code/jpeg-6b/../renderer/qgl.h:104: error: 'GLvoid' declared as function returning a function
  949. code/jpeg-6b/../renderer/qgl.h:104: warning: function declaration isn't a prototype
  950. code/jpeg-6b/../renderer/qgl.h:105: error: expected declaration specifiers or '...' before '*' token
  951. code/jpeg-6b/../renderer/qgl.h:105: error: expected declaration specifiers or '...' before 'GLfloat'
  952. code/jpeg-6b/../renderer/qgl.h:105: warning: type defaults to 'int' in declaration of 'GLvoid'
  953. code/jpeg-6b/../renderer/qgl.h:105: error: 'GLvoid' declared as function returning a function
  954. code/jpeg-6b/../renderer/qgl.h:105: warning: function declaration isn't a prototype
  955. code/jpeg-6b/../renderer/qgl.h:106: error: expected declaration specifiers or '...' before '*' token
  956. code/jpeg-6b/../renderer/qgl.h:106: error: expected declaration specifiers or '...' before 'GLshort'
  957. code/jpeg-6b/../renderer/qgl.h:106: warning: type defaults to 'int' in declaration of 'GLvoid'
  958. code/jpeg-6b/../renderer/qgl.h:106: error: 'GLvoid' declared as function returning a function
  959. code/jpeg-6b/../renderer/qgl.h:106: warning: function declaration isn't a prototype
  960. code/jpeg-6b/../renderer/qgl.h:107: error: expected declaration specifiers or '...' before '*' token
  961. code/jpeg-6b/../renderer/qgl.h:107: error: expected declaration specifiers or '...' before 'GLdouble'
  962. code/jpeg-6b/../renderer/qgl.h:107: warning: type defaults to 'int' in declaration of 'GLvoid'
  963. code/jpeg-6b/../renderer/qgl.h:107: error: 'GLvoid' declared as function returning a function
  964. code/jpeg-6b/../renderer/qgl.h:107: warning: function declaration isn't a prototype
  965. code/jpeg-6b/../renderer/qgl.h:108: error: expected declaration specifiers or '...' before '*' token
  966. code/jpeg-6b/../renderer/qgl.h:108: error: expected declaration specifiers or '...' before 'GLfloat'
  967. code/jpeg-6b/../renderer/qgl.h:108: warning: type defaults to 'int' in declaration of 'GLvoid'
  968. code/jpeg-6b/../renderer/qgl.h:108: error: 'GLvoid' declared as function returning a function
  969. code/jpeg-6b/../renderer/qgl.h:108: warning: function declaration isn't a prototype
  970. code/jpeg-6b/../renderer/qgl.h:109: error: expected declaration specifiers or '...' before '*' token
  971. code/jpeg-6b/../renderer/qgl.h:109: error: expected declaration specifiers or '...' before 'GLshort'
  972. code/jpeg-6b/../renderer/qgl.h:109: warning: type defaults to 'int' in declaration of 'GLvoid'
  973. code/jpeg-6b/../renderer/qgl.h:109: error: 'GLvoid' declared as function returning a function
  974. code/jpeg-6b/../renderer/qgl.h:109: warning: function declaration isn't a prototype
  975. code/jpeg-6b/../renderer/qgl.h:110: error: expected declaration specifiers or '...' before '*' token
  976. code/jpeg-6b/../renderer/qgl.h:110: error: expected declaration specifiers or '...' before 'GLdouble'
  977. code/jpeg-6b/../renderer/qgl.h:110: warning: type defaults to 'int' in declaration of 'GLvoid'
  978. code/jpeg-6b/../renderer/qgl.h:110: error: 'GLvoid' declared as function returning a function
  979. code/jpeg-6b/../renderer/qgl.h:110: warning: function declaration isn't a prototype
  980. code/jpeg-6b/../renderer/qgl.h:111: error: expected declaration specifiers or '...' before '*' token
  981. code/jpeg-6b/../renderer/qgl.h:111: warning: type defaults to 'int' in declaration of 'GLvoid'
  982. code/jpeg-6b/../renderer/qgl.h:111: error: 'GLvoid' declared as function returning a function
  983. code/jpeg-6b/../renderer/qgl.h:111: warning: function declaration isn't a prototype
  984. code/jpeg-6b/../renderer/qgl.h:112: error: expected declaration specifiers or '...' before '*' token
  985. code/jpeg-6b/../renderer/qgl.h:112: error: expected declaration specifiers or '...' before 'GLbyte'
  986. code/jpeg-6b/../renderer/qgl.h:112: warning: type defaults to 'int' in declaration of 'GLvoid'
  987. code/jpeg-6b/../renderer/qgl.h:112: error: 'GLvoid' declared as function returning a function
  988. code/jpeg-6b/../renderer/qgl.h:112: warning: function declaration isn't a prototype
  989. code/jpeg-6b/../renderer/qgl.h:113: error: expected declaration specifiers or '...' before '*' token
  990. code/jpeg-6b/../renderer/qgl.h:113: error: expected declaration specifiers or '...' before 'GLubyte'
  991. code/jpeg-6b/../renderer/qgl.h:113: warning: type defaults to 'int' in declaration of 'GLvoid'
  992. code/jpeg-6b/../renderer/qgl.h:113: error: 'GLvoid' declared as function returning a function
  993. code/jpeg-6b/../renderer/qgl.h:113: warning: function declaration isn't a prototype
  994. code/jpeg-6b/../renderer/qgl.h:114: error: expected declaration specifiers or '...' before '*' token
  995. code/jpeg-6b/../renderer/qgl.h:114: error: expected declaration specifiers or '...' before 'GLushort'
  996. code/jpeg-6b/../renderer/qgl.h:114: warning: type defaults to 'int' in declaration of 'GLvoid'
  997. code/jpeg-6b/../renderer/qgl.h:114: error: 'GLvoid' declared as function returning a function
  998. code/jpeg-6b/../renderer/qgl.h:114: warning: function declaration isn't a prototype
  999. code/jpeg-6b/../renderer/qgl.h:115: error: expected declaration specifiers or '...' before '*' token
  1000. code/jpeg-6b/../renderer/qgl.h:115: warning: type defaults to 'int' in declaration of 'GLvoid'
  1001. code/jpeg-6b/../renderer/qgl.h:115: error: 'GLvoid' declared as function returning a function
  1002. code/jpeg-6b/../renderer/qgl.h:115: warning: function declaration isn't a prototype
  1003. code/jpeg-6b/../renderer/qgl.h:116: error: expected declaration specifiers or '...' before '*' token
  1004. code/jpeg-6b/../renderer/qgl.h:116: warning: type defaults to 'int' in declaration of 'GLbyte'
  1005. code/jpeg-6b/../renderer/qgl.h:116: error: expected ';', ',' or ')' before '*' token
  1006. code/jpeg-6b/../renderer/qgl.h:117: error: expected declaration specifiers or '...' before '*' token
  1007. code/jpeg-6b/../renderer/qgl.h:117: warning: type defaults to 'int' in declaration of 'GLshort'
  1008. code/jpeg-6b/../renderer/qgl.h:117: error: expected ';', ',' or ')' before '*' token
  1009. code/jpeg-6b/../renderer/qgl.h:118: error: expected declaration specifiers or '...' before '*' token
  1010. code/jpeg-6b/../renderer/qgl.h:118: warning: type defaults to 'int' in declaration of 'GLvoid'
  1011. code/jpeg-6b/../renderer/qgl.h:118: error: 'GLvoid' declared as function returning a function
  1012. code/jpeg-6b/../renderer/qgl.h:118: warning: function declaration isn't a prototype
  1013. code/jpeg-6b/../renderer/qgl.h:119: error: expected declaration specifiers or '...' before '*' token
  1014. code/jpeg-6b/../renderer/qgl.h:119: warning: type defaults to 'int' in declaration of 'GLubyte'
  1015. code/jpeg-6b/../renderer/qgl.h:119: error: expected ';', ',' or ')' before '*' token
  1016. code/jpeg-6b/../renderer/qgl.h:120: error: expected declaration specifiers or '...' before '*' token
  1017. code/jpeg-6b/../renderer/qgl.h:120: warning: type defaults to 'int' in declaration of 'GLushort'
  1018. code/jpeg-6b/../renderer/qgl.h:120: error: expected ';', ',' or ')' before '*' token
  1019. code/jpeg-6b/../renderer/qgl.h:121: error: expected declaration specifiers or '...' before '*' token
  1020. code/jpeg-6b/../renderer/qgl.h:121: warning: type defaults to 'int' in declaration of 'GLvoid'
  1021. code/jpeg-6b/../renderer/qgl.h:121: error: 'GLvoid' declared as function returning a function
  1022. code/jpeg-6b/../renderer/qgl.h:121: warning: function declaration isn't a prototype
  1023. code/jpeg-6b/../renderer/qgl.h:122: error: expected declaration specifiers or '...' before '*' token
  1024. code/jpeg-6b/../renderer/qgl.h:122: error: expected declaration specifiers or '...' before 'GLenum'
  1025. code/jpeg-6b/../renderer/qgl.h:123: error: expected declaration specifiers or '...' before 'GLsizei'
  1026. code/jpeg-6b/../renderer/qgl.h:123: warning: type defaults to 'int' in declaration of 'GLvoid'
  1027. code/jpeg-6b/../renderer/qgl.h:123: error: expected ';', ',' or ')' before '*' token
  1028. code/jpeg-6b/../renderer/qgl.h:124: error: expected declaration specifiers or '...' before '*' token
  1029. code/jpeg-6b/../renderer/qgl.h:124: warning: type defaults to 'int' in declaration of 'GLvoid'
  1030. code/jpeg-6b/../renderer/qgl.h:124: error: 'GLvoid' declared as function returning a function
  1031. code/jpeg-6b/../renderer/qgl.h:124: warning: function declaration isn't a prototype
  1032. code/jpeg-6b/../renderer/qgl.h:125: error: expected declaration specifiers or '...' before '*' token
  1033. code/jpeg-6b/../renderer/qgl.h:125: warning: type defaults to 'int' in declaration of 'GLvoid'
  1034. code/jpeg-6b/../renderer/qgl.h:125: error: 'GLvoid' declared as function returning a function
  1035. code/jpeg-6b/../renderer/qgl.h:125: warning: function declaration isn't a prototype
  1036. code/jpeg-6b/../renderer/qgl.h:126: error: expected declaration specifiers or '...' before '*' token
  1037. code/jpeg-6b/../renderer/qgl.h:126: warning: type defaults to 'int' in declaration of 'GLvoid'
  1038. code/jpeg-6b/../renderer/qgl.h:126: error: 'GLvoid' declared as function returning a function
  1039. code/jpeg-6b/../renderer/qgl.h:126: warning: function declaration isn't a prototype
  1040. code/jpeg-6b/../renderer/qgl.h:127: error: expected declaration specifiers or '...' before '*' token
  1041. code/jpeg-6b/../renderer/qgl.h:127: error: expected declaration specifiers or '...' before 'GLsizei'
  1042. code/jpeg-6b/../renderer/qgl.h:128: error: expected declaration specifiers or '...' before 'GLsizei'
  1043. code/jpeg-6b/../renderer/qgl.h:128: error: expected declaration specifiers or '...' before 'GLenum'
  1044. code/jpeg-6b/../renderer/qgl.h:128: warning: type defaults to 'int' in declaration of 'GLvoid'
  1045. code/jpeg-6b/../renderer/qgl.h:128: error: 'GLvoid' declared as function returning a function
  1046. code/jpeg-6b/../renderer/qgl.h:128: warning: function declaration isn't a prototype
  1047. code/jpeg-6b/../renderer/qgl.h:129: error: 'qglGetAttribLocationARB' declared as function returning a function
  1048. code/jpeg-6b/../renderer/qgl.h:130: error: expected declaration specifiers or '...' before '*' token
  1049. code/jpeg-6b/../renderer/qgl.h:130: error: expected declaration specifiers or '...' before 'GLenum'
  1050. code/jpeg-6b/../renderer/qgl.h:130: error: expected declaration specifiers or '...' before 'GLdouble'
  1051. code/jpeg-6b/../renderer/qgl.h:130: warning: type defaults to 'int' in declaration of 'GLvoid'
  1052. code/jpeg-6b/../renderer/qgl.h:130: error: 'GLvoid' declared as function returning a function
  1053. code/jpeg-6b/../renderer/qgl.h:130: warning: function declaration isn't a prototype
  1054. code/jpeg-6b/../renderer/qgl.h:131: error: expected declaration specifiers or '...' before '*' token
  1055. code/jpeg-6b/../renderer/qgl.h:131: error: expected declaration specifiers or '...' before 'GLenum'
  1056. code/jpeg-6b/../renderer/qgl.h:131: error: expected declaration specifiers or '...' before 'GLfloat'
  1057. code/jpeg-6b/../renderer/qgl.h:131: warning: type defaults to 'int' in declaration of 'GLvoid'
  1058. code/jpeg-6b/../renderer/qgl.h:131: error: 'GLvoid' declared as function returning a function
  1059. code/jpeg-6b/../renderer/qgl.h:131: warning: function declaration isn't a prototype
  1060. code/jpeg-6b/../renderer/qgl.h:132: error: expected declaration specifiers or '...' before '*' token
  1061. code/jpeg-6b/../renderer/qgl.h:132: error: expected declaration specifiers or '...' before 'GLenum'
  1062. code/jpeg-6b/../renderer/qgl.h:132: warning: type defaults to 'int' in declaration of 'GLvoid'
  1063. code/jpeg-6b/../renderer/qgl.h:132: error: 'GLvoid' declared as function returning a function
  1064. code/jpeg-6b/../renderer/qgl.h:132: warning: function declaration isn't a prototype
  1065. code/jpeg-6b/../renderer/qgl.h:133: error: expected declaration specifiers or '...' before '*' token
  1066. code/jpeg-6b/../renderer/qgl.h:133: error: expected declaration specifiers or '...' before 'GLenum'
  1067. code/jpeg-6b/../renderer/qgl.h:133: error: expected declaration specifiers or '...' before 'GLvoid'
  1068. code/jpeg-6b/../renderer/qgl.h:133: warning: type defaults to 'int' in declaration of 'GLvoid'
  1069. code/jpeg-6b/../renderer/qgl.h:133: error: 'GLvoid' declared as function returning a function
  1070. code/jpeg-6b/../renderer/qgl.h:133: warning: function declaration isn't a prototype
  1071. In file included from code/jpeg-6b/jerror.c:21:
  1072. code/jpeg-6b/../renderer/tr_local.h:99: error: field 'texnum' declared as a function
  1073. code/jpeg-6b/../renderer/tr_local.h:760: error: field 'u_AlphaGen' declared as a function
  1074. code/jpeg-6b/../renderer/tr_local.h:763: error: field 'u_AmbientLight' declared as a function
  1075. code/jpeg-6b/../renderer/tr_local.h:766: error: field 'u_DynamicLight' declared as a function
  1076. code/jpeg-6b/../renderer/tr_local.h:769: error: field 'u_LightDistance' declared as a function
  1077. code/jpeg-6b/../renderer/tr_local.h:772: error: field 'u_ColorGen' declared as a function
  1078. code/jpeg-6b/../renderer/tr_local.h:775: error: field 'u_ConstantColor' declared as a function
  1079. code/jpeg-6b/../renderer/tr_local.h:778: error: field 'u_DirectedLight' declared as a function
  1080. code/jpeg-6b/../renderer/tr_local.h:781: error: field 'u_EntityColor' declared as a function
  1081. code/jpeg-6b/../renderer/tr_local.h:784: error: field 'u_FogColor' declared as a function
  1082. code/jpeg-6b/../renderer/tr_local.h:787: error: field 'u_Greyscale' declared as a function
  1083. code/jpeg-6b/../renderer/tr_local.h:790: error: field 'u_IdentityLight' declared as a function
  1084. code/jpeg-6b/../renderer/tr_local.h:793: error: field 'u_LightDirection' declared as a function
  1085. code/jpeg-6b/../renderer/tr_local.h:796: error: field 'u_ModelViewMatrix' declared as a function
  1086. code/jpeg-6b/../renderer/tr_local.h:799: error: field 'u_ModelViewProjectionMatrix' declared as a function
  1087. code/jpeg-6b/../renderer/tr_local.h:802: error: field 'u_ProjectionMatrix' declared as a function
  1088. code/jpeg-6b/../renderer/tr_local.h:805: error: field 'u_TCGen0' declared as a function
  1089. code/jpeg-6b/../renderer/tr_local.h:808: error: field 'u_TCGen1' declared as a function
  1090. code/jpeg-6b/../renderer/tr_local.h:811: error: field 'u_TexEnv' declared as a function
  1091. code/jpeg-6b/../renderer/tr_local.h:814: error: field 'u_Texture0' declared as a function
  1092. code/jpeg-6b/../renderer/tr_local.h:815: error: field 'u_Texture1' declared as a function
  1093. code/jpeg-6b/../renderer/tr_local.h:816: error: field 'u_Texture2' declared as a function
  1094. code/jpeg-6b/../renderer/tr_local.h:817: error: field 'u_Texture3' declared as a function
  1095. code/jpeg-6b/../renderer/tr_local.h:818: error: field 'u_Texture4' declared as a function
  1096. code/jpeg-6b/../renderer/tr_local.h:819: error: field 'u_Texture5' declared as a function
  1097. code/jpeg-6b/../renderer/tr_local.h:820: error: field 'u_Texture6' declared as a function
  1098. code/jpeg-6b/../renderer/tr_local.h:821: error: field 'u_Texture7' declared as a function
  1099. code/jpeg-6b/../renderer/tr_local.h:823: error: field 'u_Time' declared as a function
  1100. code/jpeg-6b/../renderer/tr_local.h:826: error: field 'u_ViewOrigin' declared as a function
  1101. code/jpeg-6b/../renderer/tr_local.h:830: error: field 'u_ScreenSizeX' declared as a function
  1102. code/jpeg-6b/../renderer/tr_local.h:831: error: field 'u_ScreenSizeY' declared as a function
  1103. code/jpeg-6b/../renderer/tr_local.h:832: error: expected specifier-qualifier-list before 'GLfloat'
  1104. In file included from code/jpeg-6b/jerror.c:21:
  1105. code/jpeg-6b/../renderer/tr_local.h: In function 'R_GLSL_SetUniform_AlphaGen':
  1106. code/jpeg-6b/../renderer/tr_local.h:1527: warning: implicit declaration of function 'qglUniform1iARB'
  1107. code/jpeg-6b/../renderer/tr_local.h: In function 'R_GLSL_SetUniform_AmbientLight':
  1108. code/jpeg-6b/../renderer/tr_local.h:1535: warning: implicit declaration of function 'qglUniform3fARB'
  1109. code/jpeg-6b/../renderer/tr_local.h: In function 'R_GLSL_SetUniform_LightDistance':
  1110. code/jpeg-6b/../renderer/tr_local.h:1551: warning: implicit declaration of function 'qglUniform1fARB'
  1111. code/jpeg-6b/../renderer/tr_local.h: In function 'R_GLSL_SetUniform_ConstantColor':
  1112. code/jpeg-6b/../renderer/tr_local.h:1573: warning: implicit declaration of function 'qglUniform4fARB'
  1113. code/jpeg-6b/../renderer/tr_local.h: In function 'R_GLSL_SetUniform_ModelViewMatrix':
  1114. code/jpeg-6b/../renderer/tr_local.h:1639: warning: implicit declaration of function 'qglUniformMatrix4fvARB'
  1115. code/jpeg-6b/../renderer/tr_local.h:1639: error: 'GL_FALSE' undeclared (first use in this function)
  1116. code/jpeg-6b/../renderer/tr_local.h:1639: error: (Each undeclared identifier is reported only once
  1117. code/jpeg-6b/../renderer/tr_local.h:1639: error: for each function it appears in.)
  1118. code/jpeg-6b/../renderer/tr_local.h: In function 'R_GLSL_SetUniform_ModelViewProjectionMatrix':
  1119. code/jpeg-6b/../renderer/tr_local.h:1647: error: 'GL_FALSE' undeclared (first use in this function)
  1120. code/jpeg-6b/../renderer/tr_local.h: In function 'R_GLSL_SetUniform_ProjectionMatrix':
  1121. code/jpeg-6b/../renderer/tr_local.h:1655: error: 'GL_FALSE' undeclared (first use in this function)
  1122. code/jpeg-6b/../renderer/tr_local.h: In function 'R_GLSL_SetUniform_TexEnv':
  1123. code/jpeg-6b/../renderer/tr_local.h:1676: error: 'GL_REPLACE' undeclared (first use in this function)
  1124. code/jpeg-6b/../renderer/tr_local.h:1679: error: 'GL_MODULATE' undeclared (first use in this function)
  1125. code/jpeg-6b/../renderer/tr_local.h:1682: error: 'GL_DECAL' undeclared (first use in this function)
  1126. code/jpeg-6b/../renderer/tr_local.h:1685: error: 'GL_ADD' undeclared (first use in this function)
  1127. code/jpeg-6b/../renderer/tr_local.h: At top level:
  1128. code/jpeg-6b/../renderer/tr_local.h:1756: error: expected declaration specifiers or '...' before 'GLfloat'
  1129. code/jpeg-6b/../renderer/tr_local.h: In function 'R_GLSL_SetUniform_u_ScreenToNextPixelX':
  1130. code/jpeg-6b/../renderer/tr_local.h:1757: error: 'glslProgram_t' has no member named 'u_ScreenToNextPixelX'
  1131. code/jpeg-6b/../renderer/tr_local.h:1757: error: 'value' undeclared (first use in this function)
  1132. code/jpeg-6b/../renderer/tr_local.h: At top level:
  1133. code/jpeg-6b/../renderer/tr_local.h:1760: error: expected declaration specifiers or '...' before 'GLfloat'
  1134. code/jpeg-6b/../renderer/tr_local.h: In function 'R_GLSL_SetUniform_u_ScreenToNextPixelY':
  1135. code/jpeg-6b/../renderer/tr_local.h:1761: error: 'glslProgram_t' has no member named 'u_ScreenToNextPixelY'
  1136. code/jpeg-6b/../renderer/tr_local.h:1761: error: 'value' undeclared (first use in this function)
  1137. code/jpeg-6b/../renderer/tr_local.h: At top level:
  1138. code/jpeg-6b/../renderer/tr_local.h:1764: error: expected declaration specifiers or '...' before 'GLfloat'
  1139. code/jpeg-6b/../renderer/tr_local.h: In function 'R_GLSL_SetUniform_u_zFar':
  1140. code/jpeg-6b/../renderer/tr_local.h:1765: error: 'glslProgram_t' has no member named 'u_zFar'
  1141. code/jpeg-6b/../renderer/tr_local.h:1765: error: 'value' undeclared (first use in this function)
  1142. code/jpeg-6b/../renderer/tr_local.h: At top level:
  1143. code/jpeg-6b/../renderer/tr_local.h:2041: error: declaration of 'rgba' as array of functions
  1144. make[2]: *** [build/release-linux-i386/client/jerror.o] Error 1
  1145. make[2]: Leaving directory `/root/openarena/openarena'
  1146. make[1]: *** [targets] Error 2
  1147. make[1]: Leaving directory `/root/openarena/openarena'
  1148. make: *** [release] Error 2
RAW Paste Data
We use cookies for various purposes including analytics. By continuing to use Pastebin, you agree to our use of cookies as described in the Cookies Policy. OK, I Understand
 
Top