daily pastebin goal
61%
SHARE
TWEET

Untitled

a guest Jan 23rd, 2018 54 Never
Not a member of Pastebin yet? Sign Up, it unlocks many cool features!
  1. C:\DOCUME~1\XPMUser\Desktop\MP2_SO~1\MP2>make
  2. gpp -nostartfiles -nostdlib -fno-rtti -fno-exceptions   -c -o page_table.o page
  3. table.C
  4. page_table.C:4:31: error: 'static' may not be used when defining (as opposed to
  5. declaring) a static data member [-fpermissive]
  6. page_table.C:5:32: error: 'static' may not be used when defining (as opposed to
  7. declaring) a static data member [-fpermissive]
  8. page_table.C:6:31: error: 'static' may not be used when defining (as opposed to
  9. declaring) a static data member [-fpermissive]
  10. page_table.C:7:31: error: 'static' may not be used when defining (as opposed to
  11. declaring) a static data member [-fpermissive]
  12. page_table.C:8:33: error: 'static' may not be used when defining (as opposed to
  13. declaring) a static data member [-fpermissive]
  14. page_table.C:8:33: error: 'long unsigned int PageTable::hared_size' is not a st
  15. tic member of 'class PageTable'
  16. make.exe: *** [page_table.o] Error 1
RAW Paste Data
Top