Guest User

Untitled

a guest
Mar 31st, 2019
120
Never
Not a member of Pastebin yet? Sign Up, it unlocks many cool features!
  1. emojier.vala:526.17-526.48: error: The name `copy_deep' does not exist in the context of `GLib.SList<string>'
  2. data.get_annotations().copy_deep(GLib.strdup);
  3. ^^^^^^^^^^^^^^^^^^^^^^^^^^^^^^^^
  4. emojier.vala:552.34-552.54: error: The name `copy_deep' does not exist in the context of `GLib.SList<string>?'
  5. data.set_annotations(annotations.copy_deep(GLib.strdup));
  6. ^^^^^^^^^^^^^^^^^^^^^
  7. emojier.vala:585.37-585.57: error: The name `copy_deep' does not exist in the context of `GLib.SList<string>?'
  8. en_data.set_annotations(annotations.copy_deep(GLib.strdup));
  9. ^^^^^^^^^^^^^^^^^^^^^
  10. emojier.vala:464.21-464.76: error: The name `copy_deep' does not exist in the context of `GLib.SList<string>'
  11. m_annotation_to_emojis_dict.lookup(annotation).copy_deep(
  12. ^^^^^^^^^^^^^^^^^^^^^^^^^^^^^^^^^^^^^^^^^^^^^^^^^^^^^^^^
  13. emojier.vala:476.25-476.38: error: The name `copy_deep' does not exist in the context of `GLib.SList<string>?'
  14. hits.copy_deep(GLib.strdup));
  15. ^^^^^^^^^^^^^^
  16. emojier.vala:616.25-617.53: error: The name `copy_deep' does not exist in the context of `GLib.SList<string>'
  17. emojier.vala:624.29-624.46: error: The name `copy_deep' does not exist in the context of `GLib.SList<string>?'
  18. variants.copy_deep(GLib.strdup));
  19. ^^^^^^^^^^^^^^^^^^
  20. emojier.vala:630.21-630.72: error: The name `copy_deep' does not exist in the context of `GLib.SList<string>'
  21. m_category_to_emojis_dict.lookup(category).copy_deep(
  22. ^^^^^^^^^^^^^^^^^^^^^^^^^^^^^^^^^^^^^^^^^^^^^^^^^^^^
  23. emojier.vala:641.51-641.64: error: The name `copy_deep' does not exist in the context of `GLib.SList<string>?'
  24. hits.copy_deep(GLib.strdup));
  25. ^^^^^^^^^^^^^^
  26. emojier.vala:1417.22-1417.41: warning: Gdk.Display.list_devices has been deprecated since 3.0
  27. Compilation failed: 9 error(s), 1 warning(s)
  28. make[3]: *** [Makefile:872: ibus_ui_gtk3_vala.stamp] Error 1
  29. rm ibus-emoji.7
  30. make[3]: Leaving directory '/var/tmp/portage/app-i18n/ibus-1.5.17-r1/work/ibus-1.5.17/ui/gtk3'
  31. make[2]: *** [Makefile:510: all-recursive] Error 1
  32. make[2]: Leaving directory '/var/tmp/portage/app-i18n/ibus-1.5.17-r1/work/ibus-1.5.17/ui'
  33. make[1]: *** [Makefile:683: all-recursive] Error 1
  34. make[1]: Leaving directory '/var/tmp/portage/app-i18n/ibus-1.5.17-r1/work/ibus-1.5.17'
  35. make: *** [Makefile:590: all] Error 2
  36. * ERROR: app-i18n/ibus-1.5.17-r1::dantrell-gnome failed (compile phase):
  37. * emake failed
  38. *
  39. * If you need support, post the output of `emerge --info '=app-i18n/ibus-1.5.17-r1::dantrell-gnome'`,
  40. * the complete build log and the output of `emerge -pqv '=app-i18n/ibus-1.5.17-r1::dantrell-gnome'`.
  41. * The complete build log is located at '/var/tmp/portage/app-i18n/ibus-1.5.17-r1/temp/build.log'.
  42. * The ebuild environment file is located at '/var/tmp/portage/app-i18n/ibus-1.5.17-r1/temp/environment'.
  43. * Working directory: '/var/tmp/portage/app-i18n/ibus-1.5.17-r1/work/ibus-1.5.17'
  44. * S: '/var/tmp/portage/app-i18n/ibus-1.5.17-r1/work/ibus-1.5.17'
  45.  
  46. >>> Failed to emerge app-i18n/ibus-1.5.17-r1, Log file:
RAW Paste Data