SHARE
TWEET

Untitled

a guest Jan 11th, 2019 71 Never
Not a member of Pastebin yet? Sign Up, it unlocks many cool features!
  1. https://launchpad.net/~build.snapcraft.io/+snap/9bc23507e335fb54c4484719e01a72a0-xenial/+build/428701
  2. RUN: /usr/share/launchpad-buildd/slavebin/slave-prep
  3. Forking launchpad-buildd slave process...
  4. Kernel version: Linux bos02-s390x-008 4.4.0-141-generic #167-Ubuntu SMP Wed Dec 5 10:32:22 UTC 2018 s390x
  5. Buildd toolchain package versions: launchpad-buildd_165 python-lpbuildd_165 sbuild_0.67.0-2ubuntu7.1 bzr-builder_0.7.3+bzr174~ppa13~ubuntu14.10.1 bzr_2.7.0-2ubuntu3.1 git-build-recipe_0.3.4~git201611291343.dcee459~ubuntu16.04.1 git_1:2.7.4-0ubuntu1.6 dpkg-dev_1.18.4ubuntu1.5 python-debian_0.1.27ubuntu2.
  6. Syncing the system clock with the buildd NTP service...
  7. 10 Jan 20:38:37 ntpdate[1760]: adjust time server 10.211.37.1 offset 0.020443 sec
  8. RUN: /usr/share/launchpad-buildd/slavebin/in-target unpack-chroot --backend=lxd --series=xenial --arch=s390x SNAPBUILD-428701 /home/buildd/filecache-default/6ebd04ed8f7e62463114d6bfae2b476de7c4f6fc
  9. Creating target for build SNAPBUILD-428701
  10. RUN: /usr/share/launchpad-buildd/slavebin/in-target mount-chroot --backend=lxd --series=xenial --arch=s390x SNAPBUILD-428701
  11. Starting target for build SNAPBUILD-428701
  12. /usr/lib/python2.7/dist-packages/pylxd/model.py:116: UserWarning: Attempted to set unknown attribute "used_by" on instance of "Profile"
  13.   key, self.__class__.__name__
  14. /usr/lib/python2.7/dist-packages/pylxd/model.py:116: UserWarning: Attempted to set unknown attribute "description" on instance of "Container"
  15.   key, self.__class__.__name__
  16. RUN: /usr/share/launchpad-buildd/slavebin/in-target override-sources-list --backend=lxd --series=xenial --arch=s390x SNAPBUILD-428701 'deb http://ppa.launchpad.net/snappy-dev/tools/ubuntu xenial main' 'deb http://ftpmaster.internal/ubuntu xenial main restricted universe multiverse' 'deb http://ftpmaster.internal/ubuntu xenial-security main restricted universe multiverse' 'deb http://ftpmaster.internal/ubuntu xenial-updates main restricted universe multiverse'
  17. Overriding sources.list in build-SNAPBUILD-428701
  18. /usr/lib/python2.7/dist-packages/pylxd/model.py:116: UserWarning: Attempted to set unknown attribute "description" on instance of "Container"
  19.   key, self.__class__.__name__
  20. RUN: /usr/share/launchpad-buildd/slavebin/in-target add-trusted-keys --backend=lxd --series=xenial --arch=s390x SNAPBUILD-428701
  21. Adding trusted keys to build-SNAPBUILD-428701
  22. OK
  23. /etc/apt/trusted.gpg
  24. --------------------
  25. pub   1024D/437D05B5 2004-09-12
  26. uid                  Ubuntu Archive Automatic Signing Key <ftpmaster@ubuntu.com>
  27. sub   2048g/79164387 2004-09-12
  28.  
  29. pub   1024D/FBB75451 2004-12-30
  30. uid                  Ubuntu CD Image Automatic Signing Key <cdimage@ubuntu.com>
  31.  
  32. pub   4096R/C0B21F32 2012-05-11
  33. uid                  Ubuntu Archive Automatic Signing Key (2012) <ftpmaster@ubuntu.com>
  34.  
  35. pub   4096R/EFE21092 2012-05-11
  36. uid                  Ubuntu CD Image Automatic Signing Key (2012) <cdimage@ubuntu.com>
  37.  
  38. pub   4096R/FC42E99D 2014-11-20
  39. uid                  Launchpad PPA for Snappy Developers
  40.  
  41. RUN: /usr/share/launchpad-buildd/slavebin/in-target update-debian-chroot --backend=lxd --series=xenial --arch=s390x SNAPBUILD-428701
  42. Updating target for build SNAPBUILD-428701
  43. Hit:1 http://ftpmaster.internal/ubuntu xenial InRelease
  44. Get:2 http://ppa.launchpad.net/snappy-dev/tools/ubuntu xenial InRelease [18.1 kB]
  45. Get:3 http://ftpmaster.internal/ubuntu xenial-security InRelease [107 kB]
  46. Get:4 http://ftpmaster.internal/ubuntu xenial-updates InRelease [109 kB]
  47. Get:5 http://ppa.launchpad.net/snappy-dev/tools/ubuntu xenial/main s390x Packages [692 B]
  48. Get:6 http://ftpmaster.internal/ubuntu xenial-security/main s390x Packages [413 kB]
  49. Get:7 http://ppa.launchpad.net/snappy-dev/tools/ubuntu xenial/main Translation-en [496 B]
  50. Get:8 http://ftpmaster.internal/ubuntu xenial-security/main Translation-en [248 kB]
  51. Get:9 http://ftpmaster.internal/ubuntu xenial-security/restricted s390x Packages [64 B]
  52. Get:10 http://ftpmaster.internal/ubuntu xenial-security/restricted Translation-en [2152 B]
  53. Get:11 http://ftpmaster.internal/ubuntu xenial-security/universe s390x Packages [320 kB]
  54. Get:12 http://ftpmaster.internal/ubuntu xenial-security/universe Translation-en [161 kB]
  55. Get:13 http://ftpmaster.internal/ubuntu xenial-security/multiverse s390x Packages [936 B]
  56. Get:14 http://ftpmaster.internal/ubuntu xenial-security/multiverse Translation-en [1844 B]
  57. Get:15 http://ftpmaster.internal/ubuntu xenial-updates/main s390x Packages [656 kB]
  58. Get:16 http://ftpmaster.internal/ubuntu xenial-updates/main Translation-en [364 kB]
  59. Get:17 http://ftpmaster.internal/ubuntu xenial-updates/restricted s390x Packages [64 B]
  60. Get:18 http://ftpmaster.internal/ubuntu xenial-updates/restricted Translation-en [2272 B]
  61. Get:19 http://ftpmaster.internal/ubuntu xenial-updates/universe s390x Packages [587 kB]
  62. Get:20 http://ftpmaster.internal/ubuntu xenial-updates/universe Translation-en [294 kB]
  63. Get:21 http://ftpmaster.internal/ubuntu xenial-updates/multiverse s390x Packages [10.9 kB]
  64. Get:22 http://ftpmaster.internal/ubuntu xenial-updates/multiverse Translation-en [8440 B]
  65. Fetched 3304 kB in 2s (1344 kB/s)
  66. Reading package lists...
  67. Reading package lists...
  68. Building dependency tree...
  69. Reading state information...
  70. Calculating upgrade...
  71. The following packages will be upgraded:
  72.   advancecomp apt apt-transport-https base-files bash binutils bsdutils
  73.   ca-certificates coreutils cpp-5 dpkg dpkg-dev g++-5 gcc-5 gcc-5-base gnupg
  74.   gpgv grep init init-system-helpers libapparmor1 libapt-pkg5.0
  75.   libasn1-8-heimdal libatomic1 libaudit-common libaudit1 libblkid1 libc-bin
  76.   libc-dev-bin libc6 libc6-dev libcc1-0 libcryptsetup4 libcurl3-gnutls
  77.   libdb5.3 libdpkg-perl libfdisk1 libgcc-5-dev libgcrypt20 libgnutls30
  78.   libgomp1 libgssapi-krb5-2 libgssapi3-heimdal libhcrypto4-heimdal
  79.   libheimbase1-heimdal libheimntlm0-heimdal libhogweed4 libhx509-5-heimdal
  80.   libidn11 libitm1 libk5crypto3 libkmod2 libkrb5-26-heimdal libkrb5-3
  81.   libkrb5support0 libldap-2.4-2 libmount1 libnettle6 libp11-kit0
  82.   libpam-modules libpam-modules-bin libpam-runtime libpam0g libperl5.22
  83.   libpng12-0 libprocps4 libroken18-heimdal librtmp1 libsasl2-2
  84.   libsasl2-modules-db libseccomp2 libslang2 libsmartcols1 libssl1.0.0
  85.   libstdc++-5-dev libstdc++6 libsystemd0 libtasn1-6 libudev1 libuuid1
  86.   libwind0-heimdal linux-libc-dev login lsb-base mount multiarch-support
  87.   openssl optipng passwd patch perl perl-base perl-modules-5.22 procps
  88.   sensible-utils systemd systemd-sysv tar tzdata util-linux zlib1g
  89. 101 upgraded, 0 newly installed, 0 to remove and 0 not upgraded.
  90. Need to get 56.8 MB of archives.
  91. After this operation, 602 kB of additional disk space will be used.
  92. Get:1 http://ftpmaster.internal/ubuntu xenial-updates/main s390x base-files s390x 9.4ubuntu4.7 [64.7 kB]
  93. Get:2 http://ftpmaster.internal/ubuntu xenial-security/main s390x bash s390x 4.3-14ubuntu1.2 [574 kB]
  94. Get:3 http://ftpmaster.internal/ubuntu xenial-updates/main s390x bsdutils s390x 1:2.27.1-6ubuntu3.6 [50.7 kB]
  95. Get:4 http://ftpmaster.internal/ubuntu xenial-updates/main s390x coreutils s390x 8.25-2ubuntu3~16.04 [1189 kB]
  96. Get:5 http://ftpmaster.internal/ubuntu xenial-updates/main s390x dpkg s390x 1.18.4ubuntu1.5 [2113 kB]
  97. Get:6 http://ftpmaster.internal/ubuntu xenial-updates/main s390x grep s390x 2.25-1~16.04.1 [147 kB]
  98. Get:7 http://ftpmaster.internal/ubuntu xenial-security/main s390x libperl5.22 s390x 5.22.1-9ubuntu0.6 [3273 kB]
  99. Get:8 http://ftpmaster.internal/ubuntu xenial-security/main s390x perl s390x 5.22.1-9ubuntu0.6 [237 kB]
  100. Get:9 http://ftpmaster.internal/ubuntu xenial-security/main s390x perl-base s390x 5.22.1-9ubuntu0.6 [1250 kB]
  101. Get:10 http://ftpmaster.internal/ubuntu xenial-security/main s390x perl-modules-5.22 all 5.22.1-9ubuntu0.6 [2629 kB]
  102. Get:11 http://ftpmaster.internal/ubuntu xenial-security/main s390x libc6-dev s390x 2.23-0ubuntu10 [1848 kB]
  103. Get:12 http://ftpmaster.internal/ubuntu xenial-security/main s390x libc-dev-bin s390x 2.23-0ubuntu10 [62.8 kB]
  104. Get:13 http://ftpmaster.internal/ubuntu xenial-security/main s390x linux-libc-dev s390x 4.4.0-141.167 [843 kB]
  105. Get:14 http://ftpmaster.internal/ubuntu xenial-security/main s390x libc6 s390x 2.23-0ubuntu10 [2308 kB]
  106. Get:15 http://ftpmaster.internal/ubuntu xenial-security/main s390x libdb5.3 s390x 5.3.28-11ubuntu0.1 [617 kB]
  107. Get:16 http://ftpmaster.internal/ubuntu xenial-updates/main s390x zlib1g s390x 1:1.2.8.dfsg-2ubuntu4.1 [51.5 kB]
  108. Get:17 http://ftpmaster.internal/ubuntu xenial-updates/main s390x init-system-helpers all 1.29ubuntu4 [32.3 kB]
  109. Get:18 http://ftpmaster.internal/ubuntu xenial-updates/main s390x init s390x 1.29ubuntu4 [4628 B]
  110. Get:19 http://ftpmaster.internal/ubuntu xenial-security/main s390x login s390x 1:4.2-3.1ubuntu5.3 [302 kB]
  111. Get:20 http://ftpmaster.internal/ubuntu xenial-security/main s390x libsystemd0 s390x 229-4ubuntu21.10 [187 kB]
  112. Get:21 http://ftpmaster.internal/ubuntu xenial-security/main s390x systemd s390x 229-4ubuntu21.10 [3429 kB]
  113. Get:22 http://ftpmaster.internal/ubuntu xenial-security/main s390x libapparmor1 s390x 2.10.95-0ubuntu2.10 [29.6 kB]
  114. Get:23 http://ftpmaster.internal/ubuntu xenial-updates/main s390x libaudit-common all 1:2.4.5-1ubuntu2.1 [3924 B]
  115. Get:24 http://ftpmaster.internal/ubuntu xenial-updates/main s390x libaudit1 s390x 1:2.4.5-1ubuntu2.1 [34.8 kB]
  116. Get:25 http://ftpmaster.internal/ubuntu xenial-updates/main s390x libpam0g s390x 1.1.8-3.2ubuntu2.1 [53.9 kB]
  117. Get:26 http://ftpmaster.internal/ubuntu xenial-updates/main s390x libpam-modules-bin s390x 1.1.8-3.2ubuntu2.1 [35.5 kB]
  118. Get:27 http://ftpmaster.internal/ubuntu xenial-updates/main s390x libpam-modules s390x 1.1.8-3.2ubuntu2.1 [235 kB]
  119. Get:28 http://ftpmaster.internal/ubuntu xenial-security/main s390x passwd s390x 1:4.2-3.1ubuntu5.3 [767 kB]
  120. Get:29 http://ftpmaster.internal/ubuntu xenial-updates/main s390x libuuid1 s390x 2.27.1-6ubuntu3.6 [15.2 kB]
  121. Get:30 http://ftpmaster.internal/ubuntu xenial-updates/main s390x libblkid1 s390x 2.27.1-6ubuntu3.6 [101 kB]
  122. Get:31 http://ftpmaster.internal/ubuntu xenial-security/main s390x libgcrypt20 s390x 1.6.5-2ubuntu0.5 [296 kB]
  123. Get:32 http://ftpmaster.internal/ubuntu xenial-updates/main s390x libcryptsetup4 s390x 2:1.6.6-5ubuntu2.1 [67.8 kB]
  124. Get:33 http://ftpmaster.internal/ubuntu xenial-updates/main s390x libkmod2 s390x 22-1ubuntu5.1 [36.7 kB]
  125. Get:34 http://ftpmaster.internal/ubuntu xenial-updates/main s390x libmount1 s390x 2.27.1-6ubuntu3.6 [108 kB]
  126. Get:35 http://ftpmaster.internal/ubuntu xenial-updates/main s390x libseccomp2 s390x 2.3.1-2.1ubuntu2~16.04.1 [38.2 kB]
  127. Get:36 http://ftpmaster.internal/ubuntu xenial-updates/main s390x lsb-base all 9.20160110ubuntu0.2 [13.7 kB]
  128. Get:37 http://ftpmaster.internal/ubuntu xenial-updates/main s390x util-linux s390x 2.27.1-6ubuntu3.6 [842 kB]
  129. Get:38 http://ftpmaster.internal/ubuntu xenial-updates/main s390x mount s390x 2.27.1-6ubuntu3.6 [119 kB]
  130. Get:39 http://ftpmaster.internal/ubuntu xenial-security/main s390x tar s390x 1.28-2.1ubuntu0.1 [209 kB]
  131. Get:40 http://ftpmaster.internal/ubuntu xenial-security/main s390x libc-bin s390x 2.23-0ubuntu10 [554 kB]
  132. Get:41 http://ftpmaster.internal/ubuntu xenial-updates/main s390x libgomp1 s390x 5.4.0-6ubuntu1~16.04.11 [53.7 kB]
  133. Get:42 http://ftpmaster.internal/ubuntu xenial-updates/main s390x libitm1 s390x 5.4.0-6ubuntu1~16.04.11 [26.6 kB]
  134. Get:43 http://ftpmaster.internal/ubuntu xenial-updates/main s390x libatomic1 s390x 5.4.0-6ubuntu1~16.04.11 [7960 B]
  135. Get:44 http://ftpmaster.internal/ubuntu xenial-updates/main s390x g++-5 s390x 5.4.0-6ubuntu1~16.04.11 [6796 kB]
  136. Get:45 http://ftpmaster.internal/ubuntu xenial-updates/main s390x gcc-5 s390x 5.4.0-6ubuntu1~16.04.11 [6940 kB]
  137. Get:46 http://ftpmaster.internal/ubuntu xenial-updates/main s390x cpp-5 s390x 5.4.0-6ubuntu1~16.04.11 [6193 kB]
  138. Get:47 http://ftpmaster.internal/ubuntu xenial-updates/main s390x libcc1-0 s390x 5.4.0-6ubuntu1~16.04.11 [38.5 kB]
  139. Get:48 http://ftpmaster.internal/ubuntu xenial-updates/main s390x binutils s390x 2.26.1-1ubuntu1~16.04.7 [1056 kB]
  140. Get:49 http://ftpmaster.internal/ubuntu xenial-updates/main s390x libstdc++-5-dev s390x 5.4.0-6ubuntu1~16.04.11 [1376 kB]
  141. Get:50 http://ftpmaster.internal/ubuntu xenial-updates/main s390x libgcc-5-dev s390x 5.4.0-6ubuntu1~16.04.11 [246 kB]
  142. Get:51 http://ftpmaster.internal/ubuntu xenial-updates/main s390x gcc-5-base s390x 5.4.0-6ubuntu1~16.04.11 [17.4 kB]
  143. Get:52 http://ftpmaster.internal/ubuntu xenial-updates/main s390x libstdc++6 s390x 5.4.0-6ubuntu1~16.04.11 [398 kB]
  144. Get:53 http://ftpmaster.internal/ubuntu xenial-updates/main s390x libapt-pkg5.0 s390x 1.2.29 [666 kB]
  145. Get:54 http://ftpmaster.internal/ubuntu xenial-security/main s390x gpgv s390x 1.4.20-1ubuntu3.3 [160 kB]
  146. Get:55 http://ftpmaster.internal/ubuntu xenial-security/main s390x gnupg s390x 1.4.20-1ubuntu3.3 [607 kB]
  147. Get:56 http://ftpmaster.internal/ubuntu xenial-updates/main s390x apt s390x 1.2.29 [1026 kB]
  148. Get:57 http://ftpmaster.internal/ubuntu xenial-security/main s390x systemd-sysv s390x 229-4ubuntu21.10 [11.2 kB]
  149. Get:58 http://ftpmaster.internal/ubuntu xenial-updates/main s390x libfdisk1 s390x 2.27.1-6ubuntu3.6 [129 kB]
  150. Get:59 http://ftpmaster.internal/ubuntu xenial-updates/main s390x libpam-runtime all 1.1.8-3.2ubuntu2.1 [37.9 kB]
  151. Get:60 http://ftpmaster.internal/ubuntu xenial-updates/main s390x libsmartcols1 s390x 2.27.1-6ubuntu3.6 [59.9 kB]
  152. Get:61 http://ftpmaster.internal/ubuntu xenial-security/main s390x libudev1 s390x 229-4ubuntu21.10 [50.4 kB]
  153. Get:62 http://ftpmaster.internal/ubuntu xenial-security/main s390x multiarch-support s390x 2.23-0ubuntu10 [6826 B]
  154. Get:63 http://ftpmaster.internal/ubuntu xenial-security/main s390x sensible-utils all 0.0.9ubuntu0.16.04.1 [10.0 kB]
  155. Get:64 http://ftpmaster.internal/ubuntu xenial-security/main s390x libprocps4 s390x 2:3.3.10-4ubuntu2.4 [32.0 kB]
  156. Get:65 http://ftpmaster.internal/ubuntu xenial-security/main s390x procps s390x 2:3.3.10-4ubuntu2.4 [223 kB]
  157. Get:66 http://ftpmaster.internal/ubuntu xenial-security/main s390x tzdata all 2018i-0ubuntu0.16.04 [168 kB]
  158. Get:67 http://ftpmaster.internal/ubuntu xenial-security/main s390x libhogweed4 s390x 3.2-1ubuntu0.16.04.1 [135 kB]
  159. Get:68 http://ftpmaster.internal/ubuntu xenial-security/main s390x libnettle6 s390x 3.2-1ubuntu0.16.04.1 [104 kB]
  160. Get:69 http://ftpmaster.internal/ubuntu xenial-security/main s390x libidn11 s390x 1.32-3ubuntu1.2 [44.6 kB]
  161. Get:70 http://ftpmaster.internal/ubuntu xenial-updates/main s390x libp11-kit0 s390x 0.23.2-5~ubuntu16.04.1 [97.8 kB]
  162. Get:71 http://ftpmaster.internal/ubuntu xenial-security/main s390x libtasn1-6 s390x 4.7-3ubuntu0.16.04.3 [41.9 kB]
  163. Get:72 http://ftpmaster.internal/ubuntu xenial-updates/main s390x libgnutls30 s390x 3.4.10-4ubuntu1.4 [490 kB]
  164. Get:73 http://ftpmaster.internal/ubuntu xenial-security/main s390x libpng12-0 s390x 1.2.54-1ubuntu1.1 [113 kB]
  165. Get:74 http://ftpmaster.internal/ubuntu xenial-updates/main s390x libslang2 s390x 2.3.0-2ubuntu1.1 [407 kB]
  166. Get:75 http://ftpmaster.internal/ubuntu xenial-security/main s390x libssl1.0.0 s390x 1.0.2g-1ubuntu4.14 [782 kB]
  167. Get:76 http://ftpmaster.internal/ubuntu xenial-updates/main s390x libgssapi-krb5-2 s390x 1.13.2+dfsg-5ubuntu2 [110 kB]
  168. Get:77 http://ftpmaster.internal/ubuntu xenial-updates/main s390x libkrb5-3 s390x 1.13.2+dfsg-5ubuntu2 [260 kB]
  169. Get:78 http://ftpmaster.internal/ubuntu xenial-updates/main s390x libkrb5support0 s390x 1.13.2+dfsg-5ubuntu2 [30.2 kB]
  170. Get:79 http://ftpmaster.internal/ubuntu xenial-updates/main s390x libk5crypto3 s390x 1.13.2+dfsg-5ubuntu2 [81.0 kB]
  171. Get:80 http://ftpmaster.internal/ubuntu xenial-security/main s390x libroken18-heimdal s390x 1.7~git20150920+dfsg-4ubuntu1.16.04.1 [39.6 kB]
  172. Get:81 http://ftpmaster.internal/ubuntu xenial-security/main s390x libasn1-8-heimdal s390x 1.7~git20150920+dfsg-4ubuntu1.16.04.1 [147 kB]
  173. Get:82 http://ftpmaster.internal/ubuntu xenial-security/main s390x libhcrypto4-heimdal s390x 1.7~git20150920+dfsg-4ubuntu1.16.04.1 [81.5 kB]
  174. Get:83 http://ftpmaster.internal/ubuntu xenial-security/main s390x libheimbase1-heimdal s390x 1.7~git20150920+dfsg-4ubuntu1.16.04.1 [27.5 kB]
  175. Get:84 http://ftpmaster.internal/ubuntu xenial-security/main s390x libwind0-heimdal s390x 1.7~git20150920+dfsg-4ubuntu1.16.04.1 [48.2 kB]
  176. Get:85 http://ftpmaster.internal/ubuntu xenial-security/main s390x libhx509-5-heimdal s390x 1.7~git20150920+dfsg-4ubuntu1.16.04.1 [99.3 kB]
  177. Get:86 http://ftpmaster.internal/ubuntu xenial-security/main s390x libkrb5-26-heimdal s390x 1.7~git20150920+dfsg-4ubuntu1.16.04.1 [187 kB]
  178. Get:87 http://ftpmaster.internal/ubuntu xenial-security/main s390x libheimntlm0-heimdal s390x 1.7~git20150920+dfsg-4ubuntu1.16.04.1 [14.7 kB]
  179. Get:88 http://ftpmaster.internal/ubuntu xenial-security/main s390x libgssapi3-heimdal s390x 1.7~git20150920+dfsg-4ubuntu1.16.04.1 [88.4 kB]
  180. Get:89 http://ftpmaster.internal/ubuntu xenial-updates/main s390x libsasl2-modules-db s390x 2.1.26.dfsg1-14ubuntu0.1 [14.0 kB]
  181. Get:90 http://ftpmaster.internal/ubuntu xenial-updates/main s390x libsasl2-2 s390x 2.1.26.dfsg1-14ubuntu0.1 [46.8 kB]
  182. Get:91 http://ftpmaster.internal/ubuntu xenial-updates/main s390x libldap-2.4-2 s390x 2.4.42+dfsg-2ubuntu3.4 [151 kB]
  183. Get:92 http://ftpmaster.internal/ubuntu xenial-security/main s390x librtmp1 s390x 2.4+20151223.gitfa8646d-1ubuntu0.1 [51.9 kB]
  184. Get:93 http://ftpmaster.internal/ubuntu xenial-security/main s390x libcurl3-gnutls s390x 7.47.0-1ubuntu2.11 [174 kB]
  185. Get:94 http://ftpmaster.internal/ubuntu xenial-updates/main s390x apt-transport-https s390x 1.2.29 [25.0 kB]
  186. Get:95 http://ftpmaster.internal/ubuntu xenial-security/main s390x openssl s390x 1.0.2g-1ubuntu4.14 [478 kB]
  187. Get:96 http://ftpmaster.internal/ubuntu xenial-updates/main s390x ca-certificates all 20170717~16.04.2 [167 kB]
  188. Get:97 http://ftpmaster.internal/ubuntu xenial-security/main s390x advancecomp s390x 1.20-1ubuntu0.1 [156 kB]
  189. Get:98 http://ftpmaster.internal/ubuntu xenial-updates/main s390x dpkg-dev all 1.18.4ubuntu1.5 [584 kB]
  190. Get:99 http://ftpmaster.internal/ubuntu xenial-updates/main s390x libdpkg-perl all 1.18.4ubuntu1.5 [195 kB]
  191. Get:100 http://ftpmaster.internal/ubuntu xenial-security/main s390x patch s390x 2.7.5-1ubuntu0.16.04.1 [92.5 kB]
  192. Get:101 http://ftpmaster.internal/ubuntu xenial-security/main s390x optipng s390x 0.7.6-1ubuntu0.16.04.1 [82.2 kB]
  193. debconf: delaying package configuration, since apt-utils is not installed
  194. Fetched 56.8 MB in 5s (9704 kB/s)
  195. (Reading database ...
  196. (Reading database ... 5%
  197. (Reading database ... 10%
  198. (Reading database ... 15%
  199. (Reading database ... 20%
  200. (Reading database ... 25%
  201. (Reading database ... 30%
  202. (Reading database ... 35%
  203. (Reading database ... 40%
  204. (Reading database ... 45%
  205. (Reading database ... 50%
  206. (Reading database ... 55%
  207. (Reading database ... 60%
  208. (Reading database ... 65%
  209. (Reading database ... 70%
  210. (Reading database ... 75%
  211. (Reading database ... 80%
  212. (Reading database ... 85%
  213. (Reading database ... 90%
  214. (Reading database ... 95%
  215. (Reading database ... 100%
  216. (Reading database ... 11908 files and directories currently installed.)
  217. Preparing to unpack .../base-files_9.4ubuntu4.7_s390x.deb ...
  218. Unpacking base-files (9.4ubuntu4.7) over (9.4ubuntu4) ...
  219. Setting up base-files (9.4ubuntu4.7) ...
  220. Installing new version of config file /etc/issue ...
  221. Installing new version of config file /etc/issue.net ...
  222. Installing new version of config file /etc/lsb-release ...
  223. Installing new version of config file /etc/update-motd.d/10-help-text ...
  224. (Reading database ...
  225. (Reading database ... 5%
  226. (Reading database ... 10%
  227. (Reading database ... 15%
  228. (Reading database ... 20%
  229. (Reading database ... 25%
  230. (Reading database ... 30%
  231. (Reading database ... 35%
  232. (Reading database ... 40%
  233. (Reading database ... 45%
  234. (Reading database ... 50%
  235. (Reading database ... 55%
  236. (Reading database ... 60%
  237. (Reading database ... 65%
  238. (Reading database ... 70%
  239. (Reading database ... 75%
  240. (Reading database ... 80%
  241. (Reading database ... 85%
  242. (Reading database ... 90%
  243. (Reading database ... 95%
  244. (Reading database ... 100%
  245. (Reading database ... 11908 files and directories currently installed.)
  246. Preparing to unpack .../bash_4.3-14ubuntu1.2_s390x.deb ...
  247. Unpacking bash (4.3-14ubuntu1.2) over (4.3-14ubuntu1) ...
  248. Setting up bash (4.3-14ubuntu1.2) ...
  249. Installing new version of config file /etc/skel/.profile ...
  250. update-alternatives: using /usr/share/man/man7/bash-builtins.7.gz to provide /usr/share/man/man7/builtins.7.gz (builtins.7.gz) in auto mode
  251. (Reading database ...
  252. (Reading database ... 5%
  253. (Reading database ... 10%
  254. (Reading database ... 15%
  255. (Reading database ... 20%
  256. (Reading database ... 25%
  257. (Reading database ... 30%
  258. (Reading database ... 35%
  259. (Reading database ... 40%
  260. (Reading database ... 45%
  261. (Reading database ... 50%
  262. (Reading database ... 55%
  263. (Reading database ... 60%
  264. (Reading database ... 65%
  265. (Reading database ... 70%
  266. (Reading database ... 75%
  267. (Reading database ... 80%
  268. (Reading database ... 85%
  269. (Reading database ... 90%
  270. (Reading database ... 95%
  271. (Reading database ... 100%
  272. (Reading database ... 11908 files and directories currently installed.)
  273. Preparing to unpack .../bsdutils_1%3a2.27.1-6ubuntu3.6_s390x.deb ...
  274. Unpacking bsdutils (1:2.27.1-6ubuntu3.6) over (1:2.27.1-6ubuntu3) ...
  275. Setting up bsdutils (1:2.27.1-6ubuntu3.6) ...
  276. (Reading database ...
  277. (Reading database ... 5%
  278. (Reading database ... 10%
  279. (Reading database ... 15%
  280. (Reading database ... 20%
  281. (Reading database ... 25%
  282. (Reading database ... 30%
  283. (Reading database ... 35%
  284. (Reading database ... 40%
  285. (Reading database ... 45%
  286. (Reading database ... 50%
  287. (Reading database ... 55%
  288. (Reading database ... 60%
  289. (Reading database ... 65%
  290. (Reading database ... 70%
  291. (Reading database ... 75%
  292. (Reading database ... 80%
  293. (Reading database ... 85%
  294. (Reading database ... 90%
  295. (Reading database ... 95%
  296. (Reading database ... 100%
  297. (Reading database ... 11908 files and directories currently installed.)
  298. Preparing to unpack .../coreutils_8.25-2ubuntu3~16.04_s390x.deb ...
  299. Unpacking coreutils (8.25-2ubuntu3~16.04) over (8.25-2ubuntu2) ...
  300. Setting up coreutils (8.25-2ubuntu3~16.04) ...
  301. (Reading database ...
  302. (Reading database ... 5%
  303. (Reading database ... 10%
  304. (Reading database ... 15%
  305. (Reading database ... 20%
  306. (Reading database ... 25%
  307. (Reading database ... 30%
  308. (Reading database ... 35%
  309. (Reading database ... 40%
  310. (Reading database ... 45%
  311. (Reading database ... 50%
  312. (Reading database ... 55%
  313. (Reading database ... 60%
  314. (Reading database ... 65%
  315. (Reading database ... 70%
  316. (Reading database ... 75%
  317. (Reading database ... 80%
  318. (Reading database ... 85%
  319. (Reading database ... 90%
  320. (Reading database ... 95%
  321. (Reading database ... 100%
  322. (Reading database ... 11908 files and directories currently installed.)
  323. Preparing to unpack .../dpkg_1.18.4ubuntu1.5_s390x.deb ...
  324. Unpacking dpkg (1.18.4ubuntu1.5) over (1.18.4ubuntu1) ...
  325. Setting up dpkg (1.18.4ubuntu1.5) ...
  326. (Reading database ...
  327. (Reading database ... 5%
  328. (Reading database ... 10%
  329. (Reading database ... 15%
  330. (Reading database ... 20%
  331. (Reading database ... 25%
  332. (Reading database ... 30%
  333. (Reading database ... 35%
  334. (Reading database ... 40%
  335. (Reading database ... 45%
  336. (Reading database ... 50%
  337. (Reading database ... 55%
  338. (Reading database ... 60%
  339. (Reading database ... 65%
  340. (Reading database ... 70%
  341. (Reading database ... 75%
  342. (Reading database ... 80%
  343. (Reading database ... 85%
  344. (Reading database ... 90%
  345. (Reading database ... 95%
  346. (Reading database ... 100%
  347. (Reading database ... 11908 files and directories currently installed.)
  348. Preparing to unpack .../grep_2.25-1~16.04.1_s390x.deb ...
  349. Unpacking grep (2.25-1~16.04.1) over (2.24-1) ...
  350. Setting up grep (2.25-1~16.04.1) ...
  351. (Reading database ...
  352. (Reading database ... 5%
  353. (Reading database ... 10%
  354. (Reading database ... 15%
  355. (Reading database ... 20%
  356. (Reading database ... 25%
  357. (Reading database ... 30%
  358. (Reading database ... 35%
  359. (Reading database ... 40%
  360. (Reading database ... 45%
  361. (Reading database ... 50%
  362. (Reading database ... 55%
  363. (Reading database ... 60%
  364. (Reading database ... 65%
  365. (Reading database ... 70%
  366. (Reading database ... 75%
  367. (Reading database ... 80%
  368. (Reading database ... 85%
  369. (Reading database ... 90%
  370. (Reading database ... 95%
  371. (Reading database ... 100%
  372. (Reading database ... 11908 files and directories currently installed.)
  373. Preparing to unpack .../libperl5.22_5.22.1-9ubuntu0.6_s390x.deb ...
  374. Unpacking libperl5.22:s390x (5.22.1-9ubuntu0.6) over (5.22.1-9) ...
  375. Preparing to unpack .../perl_5.22.1-9ubuntu0.6_s390x.deb ...
  376. Unpacking perl (5.22.1-9ubuntu0.6) over (5.22.1-9) ...
  377. Preparing to unpack .../perl-base_5.22.1-9ubuntu0.6_s390x.deb ...
  378. Unpacking perl-base (5.22.1-9ubuntu0.6) over (5.22.1-9) ...
  379. Setting up perl-base (5.22.1-9ubuntu0.6) ...
  380. (Reading database ...
  381. (Reading database ... 5%
  382. (Reading database ... 10%
  383. (Reading database ... 15%
  384. (Reading database ... 20%
  385. (Reading database ... 25%
  386. (Reading database ... 30%
  387. (Reading database ... 35%
  388. (Reading database ... 40%
  389. (Reading database ... 45%
  390. (Reading database ... 50%
  391. (Reading database ... 55%
  392. (Reading database ... 60%
  393. (Reading database ... 65%
  394. (Reading database ... 70%
  395. (Reading database ... 75%
  396. (Reading database ... 80%
  397. (Reading database ... 85%
  398. (Reading database ... 90%
  399. (Reading database ... 95%
  400. (Reading database ... 100%
  401. (Reading database ... 11908 files and directories currently installed.)
  402. Preparing to unpack .../perl-modules-5.22_5.22.1-9ubuntu0.6_all.deb ...
  403. Unpacking perl-modules-5.22 (5.22.1-9ubuntu0.6) over (5.22.1-9) ...
  404. Preparing to unpack .../libc6-dev_2.23-0ubuntu10_s390x.deb ...
  405. Unpacking libc6-dev:s390x (2.23-0ubuntu10) over (2.23-0ubuntu3) ...
  406. Preparing to unpack .../libc-dev-bin_2.23-0ubuntu10_s390x.deb ...
  407. Unpacking libc-dev-bin (2.23-0ubuntu10) over (2.23-0ubuntu3) ...
  408. Preparing to unpack .../linux-libc-dev_4.4.0-141.167_s390x.deb ...
  409. Unpacking linux-libc-dev:s390x (4.4.0-141.167) over (4.4.0-21.37) ...
  410. Preparing to unpack .../libc6_2.23-0ubuntu10_s390x.deb ...
  411. Unpacking libc6:s390x (2.23-0ubuntu10) over (2.23-0ubuntu3) ...
  412. Setting up libc6:s390x (2.23-0ubuntu10) ...
  413. Processing triggers for libc-bin (2.23-0ubuntu3) ...
  414. (Reading database ...
  415. (Reading database ... 5%
  416. (Reading database ... 10%
  417. (Reading database ... 15%
  418. (Reading database ... 20%
  419. (Reading database ... 25%
  420. (Reading database ... 30%
  421. (Reading database ... 35%
  422. (Reading database ... 40%
  423. (Reading database ... 45%
  424. (Reading database ... 50%
  425. (Reading database ... 55%
  426. (Reading database ... 60%
  427. (Reading database ... 65%
  428. (Reading database ... 70%
  429. (Reading database ... 75%
  430. (Reading database ... 80%
  431. (Reading database ... 85%
  432. (Reading database ... 90%
  433. (Reading database ... 95%
  434. (Reading database ... 100%
  435. (Reading database ... 11908 files and directories currently installed.)
  436. Preparing to unpack .../libdb5.3_5.3.28-11ubuntu0.1_s390x.deb ...
  437. Unpacking libdb5.3:s390x (5.3.28-11ubuntu0.1) over (5.3.28-11) ...
  438. Processing triggers for libc-bin (2.23-0ubuntu3) ...
  439. Setting up libdb5.3:s390x (5.3.28-11ubuntu0.1) ...
  440. Processing triggers for libc-bin (2.23-0ubuntu3) ...
  441. (Reading database ...
  442. (Reading database ... 5%
  443. (Reading database ... 10%
  444. (Reading database ... 15%
  445. (Reading database ... 20%
  446. (Reading database ... 25%
  447. (Reading database ... 30%
  448. (Reading database ... 35%
  449. (Reading database ... 40%
  450. (Reading database ... 45%
  451. (Reading database ... 50%
  452. (Reading database ... 55%
  453. (Reading database ... 60%
  454. (Reading database ... 65%
  455. (Reading database ... 70%
  456. (Reading database ... 75%
  457. (Reading database ... 80%
  458. (Reading database ... 85%
  459. (Reading database ... 90%
  460. (Reading database ... 95%
  461. (Reading database ... 100%
  462. (Reading database ... 11908 files and directories currently installed.)
  463. Preparing to unpack .../zlib1g_1%3a1.2.8.dfsg-2ubuntu4.1_s390x.deb ...
  464. Unpacking zlib1g:s390x (1:1.2.8.dfsg-2ubuntu4.1) over (1:1.2.8.dfsg-2ubuntu4) ...
  465. Processing triggers for libc-bin (2.23-0ubuntu3) ...
  466. Setting up zlib1g:s390x (1:1.2.8.dfsg-2ubuntu4.1) ...
  467. Processing triggers for libc-bin (2.23-0ubuntu3) ...
  468. (Reading database ...
  469. (Reading database ... 5%
  470. (Reading database ... 10%
  471. (Reading database ... 15%
  472. (Reading database ... 20%
  473. (Reading database ... 25%
  474. (Reading database ... 30%
  475. (Reading database ... 35%
  476. (Reading database ... 40%
  477. (Reading database ... 45%
  478. (Reading database ... 50%
  479. (Reading database ... 55%
  480. (Reading database ... 60%
  481. (Reading database ... 65%
  482. (Reading database ... 70%
  483. (Reading database ... 75%
  484. (Reading database ... 80%
  485. (Reading database ... 85%
  486. (Reading database ... 90%
  487. (Reading database ... 95%
  488. (Reading database ... 100%
  489. (Reading database ... 11908 files and directories currently installed.)
  490. Preparing to unpack .../init-system-helpers_1.29ubuntu4_all.deb ...
  491. Unpacking init-system-helpers (1.29ubuntu4) over (1.29ubuntu1) ...
  492. Setting up init-system-helpers (1.29ubuntu4) ...
  493. (Reading database ...
  494. (Reading database ... 5%
  495. (Reading database ... 10%
  496. (Reading database ... 15%
  497. (Reading database ... 20%
  498. (Reading database ... 25%
  499. (Reading database ... 30%
  500. (Reading database ... 35%
  501. (Reading database ... 40%
  502. (Reading database ... 45%
  503. (Reading database ... 50%
  504. (Reading database ... 55%
  505. (Reading database ... 60%
  506. (Reading database ... 65%
  507. (Reading database ... 70%
  508. (Reading database ... 75%
  509. (Reading database ... 80%
  510. (Reading database ... 85%
  511. (Reading database ... 90%
  512. (Reading database ... 95%
  513. (Reading database ... 100%
  514. (Reading database ... 11908 files and directories currently installed.)
  515. Preparing to unpack .../init_1.29ubuntu4_s390x.deb ...
  516. Unpacking init (1.29ubuntu4) over (1.29ubuntu1) ...
  517. Setting up init (1.29ubuntu4) ...
  518. (Reading database ...
  519. (Reading database ... 5%
  520. (Reading database ... 10%
  521. (Reading database ... 15%
  522. (Reading database ... 20%
  523. (Reading database ... 25%
  524. (Reading database ... 30%
  525. (Reading database ... 35%
  526. (Reading database ... 40%
  527. (Reading database ... 45%
  528. (Reading database ... 50%
  529. (Reading database ... 55%
  530. (Reading database ... 60%
  531. (Reading database ... 65%
  532. (Reading database ... 70%
  533. (Reading database ... 75%
  534. (Reading database ... 80%
  535. (Reading database ... 85%
  536. (Reading database ... 90%
  537. (Reading database ... 95%
  538. (Reading database ... 100%
  539. (Reading database ... 11908 files and directories currently installed.)
  540. Preparing to unpack .../login_1%3a4.2-3.1ubuntu5.3_s390x.deb ...
  541. Unpacking login (1:4.2-3.1ubuntu5.3) over (1:4.2-3.1ubuntu5) ...
  542. Setting up login (1:4.2-3.1ubuntu5.3) ...
  543. (Reading database ...
  544. (Reading database ... 5%
  545. (Reading database ... 10%
  546. (Reading database ... 15%
  547. (Reading database ... 20%
  548. (Reading database ... 25%
  549. (Reading database ... 30%
  550. (Reading database ... 35%
  551. (Reading database ... 40%
  552. (Reading database ... 45%
  553. (Reading database ... 50%
  554. (Reading database ... 55%
  555. (Reading database ... 60%
  556. (Reading database ... 65%
  557. (Reading database ... 70%
  558. (Reading database ... 75%
  559. (Reading database ... 80%
  560. (Reading database ... 85%
  561. (Reading database ... 90%
  562. (Reading database ... 95%
  563. (Reading database ... 100%
  564. (Reading database ... 11908 files and directories currently installed.)
  565. Preparing to unpack .../libsystemd0_229-4ubuntu21.10_s390x.deb ...
  566. Unpacking libsystemd0:s390x (229-4ubuntu21.10) over (229-4ubuntu4) ...
  567. Processing triggers for libc-bin (2.23-0ubuntu3) ...
  568. Setting up libsystemd0:s390x (229-4ubuntu21.10) ...
  569. Processing triggers for libc-bin (2.23-0ubuntu3) ...
  570. (Reading database ...
  571. (Reading database ... 5%
  572. (Reading database ... 10%
  573. (Reading database ... 15%
  574. (Reading database ... 20%
  575. (Reading database ... 25%
  576. (Reading database ... 30%
  577. (Reading database ... 35%
  578. (Reading database ... 40%
  579. (Reading database ... 45%
  580. (Reading database ... 50%
  581. (Reading database ... 55%
  582. (Reading database ... 60%
  583. (Reading database ... 65%
  584. (Reading database ... 70%
  585. (Reading database ... 75%
  586. (Reading database ... 80%
  587. (Reading database ... 85%
  588. (Reading database ... 90%
  589. (Reading database ... 95%
  590. (Reading database ... 100%
  591. (Reading database ... 11908 files and directories currently installed.)
  592. Preparing to unpack .../systemd_229-4ubuntu21.10_s390x.deb ...
  593. Unpacking systemd (229-4ubuntu21.10) over (229-4ubuntu4) ...
  594. Setting up systemd (229-4ubuntu21.10) ...
  595. Installing new version of config file /etc/systemd/system.conf ...
  596. addgroup: The group `systemd-journal' already exists as a system group. Exiting.
  597. (Reading database ...
  598. (Reading database ... 5%
  599. (Reading database ... 10%
  600. (Reading database ... 15%
  601. (Reading database ... 20%
  602. (Reading database ... 25%
  603. (Reading database ... 30%
  604. (Reading database ... 35%
  605. (Reading database ... 40%
  606. (Reading database ... 45%
  607. (Reading database ... 50%
  608. (Reading database ... 55%
  609. (Reading database ... 60%
  610. (Reading database ... 65%
  611. (Reading database ... 70%
  612. (Reading database ... 75%
  613. (Reading database ... 80%
  614. (Reading database ... 85%
  615. (Reading database ... 90%
  616. (Reading database ... 95%
  617. (Reading database ... 100%
  618. (Reading database ... 11901 files and directories currently installed.)
  619. Preparing to unpack .../libapparmor1_2.10.95-0ubuntu2.10_s390x.deb ...
  620. Unpacking libapparmor1:s390x (2.10.95-0ubuntu2.10) over (2.10.95-0ubuntu2) ...
  621. Processing triggers for libc-bin (2.23-0ubuntu3) ...
  622. Setting up libapparmor1:s390x (2.10.95-0ubuntu2.10) ...
  623. Processing triggers for libc-bin (2.23-0ubuntu3) ...
  624. (Reading database ...
  625. (Reading database ... 5%
  626. (Reading database ... 10%
  627. (Reading database ... 15%
  628. (Reading database ... 20%
  629. (Reading database ... 25%
  630. (Reading database ... 30%
  631. (Reading database ... 35%
  632. (Reading database ... 40%
  633. (Reading database ... 45%
  634. (Reading database ... 50%
  635. (Reading database ... 55%
  636. (Reading database ... 60%
  637. (Reading database ... 65%
  638. (Reading database ... 70%
  639. (Reading database ... 75%
  640. (Reading database ... 80%
  641. (Reading database ... 85%
  642. (Reading database ... 90%
  643. (Reading database ... 95%
  644. (Reading database ... 100%
  645. (Reading database ... 11901 files and directories currently installed.)
  646. Preparing to unpack .../libaudit-common_1%3a2.4.5-1ubuntu2.1_all.deb ...
  647. Unpacking libaudit-common (1:2.4.5-1ubuntu2.1) over (1:2.4.5-1ubuntu2) ...
  648. Setting up libaudit-common (1:2.4.5-1ubuntu2.1) ...
  649. (Reading database ...
  650. (Reading database ... 5%
  651. (Reading database ... 10%
  652. (Reading database ... 15%
  653. (Reading database ... 20%
  654. (Reading database ... 25%
  655. (Reading database ... 30%
  656. (Reading database ... 35%
  657. (Reading database ... 40%
  658. (Reading database ... 45%
  659. (Reading database ... 50%
  660. (Reading database ... 55%
  661. (Reading database ... 60%
  662. (Reading database ... 65%
  663. (Reading database ... 70%
  664. (Reading database ... 75%
  665. (Reading database ... 80%
  666. (Reading database ... 85%
  667. (Reading database ... 90%
  668. (Reading database ... 95%
  669. (Reading database ... 100%
  670. (Reading database ... 11901 files and directories currently installed.)
  671. Preparing to unpack .../libaudit1_1%3a2.4.5-1ubuntu2.1_s390x.deb ...
  672. Unpacking libaudit1:s390x (1:2.4.5-1ubuntu2.1) over (1:2.4.5-1ubuntu2) ...
  673. Processing triggers for libc-bin (2.23-0ubuntu3) ...
  674. Setting up libaudit1:s390x (1:2.4.5-1ubuntu2.1) ...
  675. Processing triggers for libc-bin (2.23-0ubuntu3) ...
  676. (Reading database ...
  677. (Reading database ... 5%
  678. (Reading database ... 10%
  679. (Reading database ... 15%
  680. (Reading database ... 20%
  681. (Reading database ... 25%
  682. (Reading database ... 30%
  683. (Reading database ... 35%
  684. (Reading database ... 40%
  685. (Reading database ... 45%
  686. (Reading database ... 50%
  687. (Reading database ... 55%
  688. (Reading database ... 60%
  689. (Reading database ... 65%
  690. (Reading database ... 70%
  691. (Reading database ... 75%
  692. (Reading database ... 80%
  693. (Reading database ... 85%
  694. (Reading database ... 90%
  695. (Reading database ... 95%
  696. (Reading database ... 100%
  697. (Reading database ... 11901 files and directories currently installed.)
  698. Preparing to unpack .../libpam0g_1.1.8-3.2ubuntu2.1_s390x.deb ...
  699. Unpacking libpam0g:s390x (1.1.8-3.2ubuntu2.1) over (1.1.8-3.2ubuntu2) ...
  700. Processing triggers for libc-bin (2.23-0ubuntu3) ...
  701. Setting up libpam0g:s390x (1.1.8-3.2ubuntu2.1) ...
  702. Processing triggers for libc-bin (2.23-0ubuntu3) ...
  703. (Reading database ...
  704. (Reading database ... 5%
  705. (Reading database ... 10%
  706. (Reading database ... 15%
  707. (Reading database ... 20%
  708. (Reading database ... 25%
  709. (Reading database ... 30%
  710. (Reading database ... 35%
  711. (Reading database ... 40%
  712. (Reading database ... 45%
  713. (Reading database ... 50%
  714. (Reading database ... 55%
  715. (Reading database ... 60%
  716. (Reading database ... 65%
  717. (Reading database ... 70%
  718. (Reading database ... 75%
  719. (Reading database ... 80%
  720. (Reading database ... 85%
  721. (Reading database ... 90%
  722. (Reading database ... 95%
  723. (Reading database ... 100%
  724. (Reading database ... 11901 files and directories currently installed.)
  725. Preparing to unpack .../libpam-modules-bin_1.1.8-3.2ubuntu2.1_s390x.deb ...
  726. Unpacking libpam-modules-bin (1.1.8-3.2ubuntu2.1) over (1.1.8-3.2ubuntu2) ...
  727. Setting up libpam-modules-bin (1.1.8-3.2ubuntu2.1) ...
  728. (Reading database ...
  729. (Reading database ... 5%
  730. (Reading database ... 10%
  731. (Reading database ... 15%
  732. (Reading database ... 20%
  733. (Reading database ... 25%
  734. (Reading database ... 30%
  735. (Reading database ... 35%
  736. (Reading database ... 40%
  737. (Reading database ... 45%
  738. (Reading database ... 50%
  739. (Reading database ... 55%
  740. (Reading database ... 60%
  741. (Reading database ... 65%
  742. (Reading database ... 70%
  743. (Reading database ... 75%
  744. (Reading database ... 80%
  745. (Reading database ... 85%
  746. (Reading database ... 90%
  747. (Reading database ... 95%
  748. (Reading database ... 100%
  749. (Reading database ... 11901 files and directories currently installed.)
  750. Preparing to unpack .../libpam-modules_1.1.8-3.2ubuntu2.1_s390x.deb ...
  751. Unpacking libpam-modules:s390x (1.1.8-3.2ubuntu2.1) over (1.1.8-3.2ubuntu2) ...
  752. Setting up libpam-modules:s390x (1.1.8-3.2ubuntu2.1) ...
  753. (Reading database ...
  754. (Reading database ... 5%
  755. (Reading database ... 10%
  756. (Reading database ... 15%
  757. (Reading database ... 20%
  758. (Reading database ... 25%
  759. (Reading database ... 30%
  760. (Reading database ... 35%
  761. (Reading database ... 40%
  762. (Reading database ... 45%
  763. (Reading database ... 50%
  764. (Reading database ... 55%
  765. (Reading database ... 60%
  766. (Reading database ... 65%
  767. (Reading database ... 70%
  768. (Reading database ... 75%
  769. (Reading database ... 80%
  770. (Reading database ... 85%
  771. (Reading database ... 90%
  772. (Reading database ... 95%
  773. (Reading database ... 100%
  774. (Reading database ... 11901 files and directories currently installed.)
  775. Preparing to unpack .../passwd_1%3a4.2-3.1ubuntu5.3_s390x.deb ...
  776. Unpacking passwd (1:4.2-3.1ubuntu5.3) over (1:4.2-3.1ubuntu5) ...
  777. Setting up passwd (1:4.2-3.1ubuntu5.3) ...
  778. (Reading database ...
  779. (Reading database ... 5%
  780. (Reading database ... 10%
  781. (Reading database ... 15%
  782. (Reading database ... 20%
  783. (Reading database ... 25%
  784. (Reading database ... 30%
  785. (Reading database ... 35%
  786. (Reading database ... 40%
  787. (Reading database ... 45%
  788. (Reading database ... 50%
  789. (Reading database ... 55%
  790. (Reading database ... 60%
  791. (Reading database ... 65%
  792. (Reading database ... 70%
  793. (Reading database ... 75%
  794. (Reading database ... 80%
  795. (Reading database ... 85%
  796. (Reading database ... 90%
  797. (Reading database ... 95%
  798. (Reading database ... 100%
  799. (Reading database ... 11901 files and directories currently installed.)
  800. Preparing to unpack .../libuuid1_2.27.1-6ubuntu3.6_s390x.deb ...
  801. Unpacking libuuid1:s390x (2.27.1-6ubuntu3.6) over (2.27.1-6ubuntu3) ...
  802. Processing triggers for libc-bin (2.23-0ubuntu3) ...
  803. Setting up libuuid1:s390x (2.27.1-6ubuntu3.6) ...
  804. Processing triggers for libc-bin (2.23-0ubuntu3) ...
  805. (Reading database ...
  806. (Reading database ... 5%
  807. (Reading database ... 10%
  808. (Reading database ... 15%
  809. (Reading database ... 20%
  810. (Reading database ... 25%
  811. (Reading database ... 30%
  812. (Reading database ... 35%
  813. (Reading database ... 40%
  814. (Reading database ... 45%
  815. (Reading database ... 50%
  816. (Reading database ... 55%
  817. (Reading database ... 60%
  818. (Reading database ... 65%
  819. (Reading database ... 70%
  820. (Reading database ... 75%
  821. (Reading database ... 80%
  822. (Reading database ... 85%
  823. (Reading database ... 90%
  824. (Reading database ... 95%
  825. (Reading database ... 100%
  826. (Reading database ... 11901 files and directories currently installed.)
  827. Preparing to unpack .../libblkid1_2.27.1-6ubuntu3.6_s390x.deb ...
  828. Unpacking libblkid1:s390x (2.27.1-6ubuntu3.6) over (2.27.1-6ubuntu3) ...
  829. Processing triggers for libc-bin (2.23-0ubuntu3) ...
  830. Setting up libblkid1:s390x (2.27.1-6ubuntu3.6) ...
  831. Processing triggers for libc-bin (2.23-0ubuntu3) ...
  832. (Reading database ...
  833. (Reading database ... 5%
  834. (Reading database ... 10%
  835. (Reading database ... 15%
  836. (Reading database ... 20%
  837. (Reading database ... 25%
  838. (Reading database ... 30%
  839. (Reading database ... 35%
  840. (Reading database ... 40%
  841. (Reading database ... 45%
  842. (Reading database ... 50%
  843. (Reading database ... 55%
  844. (Reading database ... 60%
  845. (Reading database ... 65%
  846. (Reading database ... 70%
  847. (Reading database ... 75%
  848. (Reading database ... 80%
  849. (Reading database ... 85%
  850. (Reading database ... 90%
  851. (Reading database ... 95%
  852. (Reading database ... 100%
  853. (Reading database ... 11901 files and directories currently installed.)
  854. Preparing to unpack .../libgcrypt20_1.6.5-2ubuntu0.5_s390x.deb ...
  855. Unpacking libgcrypt20:s390x (1.6.5-2ubuntu0.5) over (1.6.5-2) ...
  856. Processing triggers for libc-bin (2.23-0ubuntu3) ...
  857. Setting up libgcrypt20:s390x (1.6.5-2ubuntu0.5) ...
  858. Processing triggers for libc-bin (2.23-0ubuntu3) ...
  859. (Reading database ...
  860. (Reading database ... 5%
  861. (Reading database ... 10%
  862. (Reading database ... 15%
  863. (Reading database ... 20%
  864. (Reading database ... 25%
  865. (Reading database ... 30%
  866. (Reading database ... 35%
  867. (Reading database ... 40%
  868. (Reading database ... 45%
  869. (Reading database ... 50%
  870. (Reading database ... 55%
  871. (Reading database ... 60%
  872. (Reading database ... 65%
  873. (Reading database ... 70%
  874. (Reading database ... 75%
  875. (Reading database ... 80%
  876. (Reading database ... 85%
  877. (Reading database ... 90%
  878. (Reading database ... 95%
  879. (Reading database ... 100%
  880. (Reading database ... 11901 files and directories currently installed.)
  881. Preparing to unpack .../libcryptsetup4_2%3a1.6.6-5ubuntu2.1_s390x.deb ...
  882. Unpacking libcryptsetup4:s390x (2:1.6.6-5ubuntu2.1) over (2:1.6.6-5ubuntu2) ...
  883. Processing triggers for libc-bin (2.23-0ubuntu3) ...
  884. Setting up libcryptsetup4:s390x (2:1.6.6-5ubuntu2.1) ...
  885. Processing triggers for libc-bin (2.23-0ubuntu3) ...
  886. (Reading database ...
  887. (Reading database ... 5%
  888. (Reading database ... 10%
  889. (Reading database ... 15%
  890. (Reading database ... 20%
  891. (Reading database ... 25%
  892. (Reading database ... 30%
  893. (Reading database ... 35%
  894. (Reading database ... 40%
  895. (Reading database ... 45%
  896. (Reading database ... 50%
  897. (Reading database ... 55%
  898. (Reading database ... 60%
  899. (Reading database ... 65%
  900. (Reading database ... 70%
  901. (Reading database ... 75%
  902. (Reading database ... 80%
  903. (Reading database ... 85%
  904. (Reading database ... 90%
  905. (Reading database ... 95%
  906. (Reading database ... 100%
  907. (Reading database ... 11901 files and directories currently installed.)
  908. Preparing to unpack .../libkmod2_22-1ubuntu5.1_s390x.deb ...
  909. Unpacking libkmod2:s390x (22-1ubuntu5.1) over (22-1ubuntu4) ...
  910. Processing triggers for libc-bin (2.23-0ubuntu3) ...
  911. Setting up libkmod2:s390x (22-1ubuntu5.1) ...
  912. Processing triggers for libc-bin (2.23-0ubuntu3) ...
  913. (Reading database ...
  914. (Reading database ... 5%
  915. (Reading database ... 10%
  916. (Reading database ... 15%
  917. (Reading database ... 20%
  918. (Reading database ... 25%
  919. (Reading database ... 30%
  920. (Reading database ... 35%
  921. (Reading database ... 40%
  922. (Reading database ... 45%
  923. (Reading database ... 50%
  924. (Reading database ... 55%
  925. (Reading database ... 60%
  926. (Reading database ... 65%
  927. (Reading database ... 70%
  928. (Reading database ... 75%
  929. (Reading database ... 80%
  930. (Reading database ... 85%
  931. (Reading database ... 90%
  932. (Reading database ... 95%
  933. (Reading database ... 100%
  934. (Reading database ... 11901 files and directories currently installed.)
  935. Preparing to unpack .../libmount1_2.27.1-6ubuntu3.6_s390x.deb ...
  936. Unpacking libmount1:s390x (2.27.1-6ubuntu3.6) over (2.27.1-6ubuntu3) ...
  937. Processing triggers for libc-bin (2.23-0ubuntu3) ...
  938. Setting up libmount1:s390x (2.27.1-6ubuntu3.6) ...
  939. Processing triggers for libc-bin (2.23-0ubuntu3) ...
  940. (Reading database ...
  941. (Reading database ... 5%
  942. (Reading database ... 10%
  943. (Reading database ... 15%
  944. (Reading database ... 20%
  945. (Reading database ... 25%
  946. (Reading database ... 30%
  947. (Reading database ... 35%
  948. (Reading database ... 40%
  949. (Reading database ... 45%
  950. (Reading database ... 50%
  951. (Reading database ... 55%
  952. (Reading database ... 60%
  953. (Reading database ... 65%
  954. (Reading database ... 70%
  955. (Reading database ... 75%
  956. (Reading database ... 80%
  957. (Reading database ... 85%
  958. (Reading database ... 90%
  959. (Reading database ... 95%
  960. (Reading database ... 100%
  961. (Reading database ... 11901 files and directories currently installed.)
  962. Preparing to unpack .../libseccomp2_2.3.1-2.1ubuntu2~16.04.1_s390x.deb ...
  963. Unpacking libseccomp2:s390x (2.3.1-2.1ubuntu2~16.04.1) over (2.2.3-3ubuntu3) ...
  964. Processing triggers for libc-bin (2.23-0ubuntu3) ...
  965. Setting up libseccomp2:s390x (2.3.1-2.1ubuntu2~16.04.1) ...
  966. Processing triggers for libc-bin (2.23-0ubuntu3) ...
  967. (Reading database ...
  968. (Reading database ... 5%
  969. (Reading database ... 10%
  970. (Reading database ... 15%
  971. (Reading database ... 20%
  972. (Reading database ... 25%
  973. (Reading database ... 30%
  974. (Reading database ... 35%
  975. (Reading database ... 40%
  976. (Reading database ... 45%
  977. (Reading database ... 50%
  978. (Reading database ... 55%
  979. (Reading database ... 60%
  980. (Reading database ... 65%
  981. (Reading database ... 70%
  982. (Reading database ... 75%
  983. (Reading database ... 80%
  984. (Reading database ... 85%
  985. (Reading database ... 90%
  986. (Reading database ... 95%
  987. (Reading database ... 100%
  988. (Reading database ... 11901 files and directories currently installed.)
  989. Preparing to unpack .../lsb-base_9.20160110ubuntu0.2_all.deb ...
  990. Unpacking lsb-base (9.20160110ubuntu0.2) over (9.20160110) ...
  991. Setting up lsb-base (9.20160110ubuntu0.2) ...
  992. (Reading database ...
  993. (Reading database ... 5%
  994. (Reading database ... 10%
  995. (Reading database ... 15%
  996. (Reading database ... 20%
  997. (Reading database ... 25%
  998. (Reading database ... 30%
  999. (Reading database ... 35%
  1000. (Reading database ... 40%
  1001. (Reading database ... 45%
  1002. (Reading database ... 50%
  1003. (Reading database ... 55%
  1004. (Reading database ... 60%
  1005. (Reading database ... 65%
  1006. (Reading database ... 70%
  1007. (Reading database ... 75%
  1008. (Reading database ... 80%
  1009. (Reading database ... 85%
  1010. (Reading database ... 90%
  1011. (Reading database ... 95%
  1012. (Reading database ... 100%
  1013. (Reading database ... 11901 files and directories currently installed.)
  1014. Preparing to unpack .../util-linux_2.27.1-6ubuntu3.6_s390x.deb ...
  1015. Unpacking util-linux (2.27.1-6ubuntu3.6) over (2.27.1-6ubuntu3) ...
  1016. Setting up util-linux (2.27.1-6ubuntu3.6) ...
  1017. Processing triggers for systemd (229-4ubuntu21.10) ...
  1018. (Reading database ...
  1019. (Reading database ... 5%
  1020. (Reading database ... 10%
  1021. (Reading database ... 15%
  1022. (Reading database ... 20%
  1023. (Reading database ... 25%
  1024. (Reading database ... 30%
  1025. (Reading database ... 35%
  1026. (Reading database ... 40%
  1027. (Reading database ... 45%
  1028. (Reading database ... 50%
  1029. (Reading database ... 55%
  1030. (Reading database ... 60%
  1031. (Reading database ... 65%
  1032. (Reading database ... 70%
  1033. (Reading database ... 75%
  1034. (Reading database ... 80%
  1035. (Reading database ... 85%
  1036. (Reading database ... 90%
  1037. (Reading database ... 95%
  1038. (Reading database ... 100%
  1039. (Reading database ... 11901 files and directories currently installed.)
  1040. Preparing to unpack .../mount_2.27.1-6ubuntu3.6_s390x.deb ...
  1041. Unpacking mount (2.27.1-6ubuntu3.6) over (2.27.1-6ubuntu3) ...
  1042. Setting up mount (2.27.1-6ubuntu3.6) ...
  1043. (Reading database ...
  1044. (Reading database ... 5%
  1045. (Reading database ... 10%
  1046. (Reading database ... 15%
  1047. (Reading database ... 20%
  1048. (Reading database ... 25%
  1049. (Reading database ... 30%
  1050. (Reading database ... 35%
  1051. (Reading database ... 40%
  1052. (Reading database ... 45%
  1053. (Reading database ... 50%
  1054. (Reading database ... 55%
  1055. (Reading database ... 60%
  1056. (Reading database ... 65%
  1057. (Reading database ... 70%
  1058. (Reading database ... 75%
  1059. (Reading database ... 80%
  1060. (Reading database ... 85%
  1061. (Reading database ... 90%
  1062. (Reading database ... 95%
  1063. (Reading database ... 100%
  1064. (Reading database ... 11901 files and directories currently installed.)
  1065. Preparing to unpack .../tar_1.28-2.1ubuntu0.1_s390x.deb ...
  1066. Unpacking tar (1.28-2.1ubuntu0.1) over (1.28-2.1) ...
  1067. Setting up tar (1.28-2.1ubuntu0.1) ...
  1068. (Reading database ...
  1069. (Reading database ... 5%
  1070. (Reading database ... 10%
  1071. (Reading database ... 15%
  1072. (Reading database ... 20%
  1073. (Reading database ... 25%
  1074. (Reading database ... 30%
  1075. (Reading database ... 35%
  1076. (Reading database ... 40%
  1077. (Reading database ... 45%
  1078. (Reading database ... 50%
  1079. (Reading database ... 55%
  1080. (Reading database ... 60%
  1081. (Reading database ... 65%
  1082. (Reading database ... 70%
  1083. (Reading database ... 75%
  1084. (Reading database ... 80%
  1085. (Reading database ... 85%
  1086. (Reading database ... 90%
  1087. (Reading database ... 95%
  1088. (Reading database ... 100%
  1089. (Reading database ... 11901 files and directories currently installed.)
  1090. Preparing to unpack .../libc-bin_2.23-0ubuntu10_s390x.deb ...
  1091. Unpacking libc-bin (2.23-0ubuntu10) over (2.23-0ubuntu3) ...
  1092. Setting up libc-bin (2.23-0ubuntu10) ...
  1093. (Reading database ...
  1094. (Reading database ... 5%
  1095. (Reading database ... 10%
  1096. (Reading database ... 15%
  1097. (Reading database ... 20%
  1098. (Reading database ... 25%
  1099. (Reading database ... 30%
  1100. (Reading database ... 35%
  1101. (Reading database ... 40%
  1102. (Reading database ... 45%
  1103. (Reading database ... 50%
  1104. (Reading database ... 55%
  1105. (Reading database ... 60%
  1106. (Reading database ... 65%
  1107. (Reading database ... 70%
  1108. (Reading database ... 75%
  1109. (Reading database ... 80%
  1110. (Reading database ... 85%
  1111. (Reading database ... 90%
  1112. (Reading database ... 95%
  1113. (Reading database ... 100%
  1114. (Reading database ... 11901 files and directories currently installed.)
  1115. Preparing to unpack .../libgomp1_5.4.0-6ubuntu1~16.04.11_s390x.deb ...
  1116. Unpacking libgomp1:s390x (5.4.0-6ubuntu1~16.04.11) over (5.3.1-14ubuntu2) ...
  1117. Preparing to unpack .../libitm1_5.4.0-6ubuntu1~16.04.11_s390x.deb ...
  1118. Unpacking libitm1:s390x (5.4.0-6ubuntu1~16.04.11) over (5.3.1-14ubuntu2) ...
  1119. Preparing to unpack .../libatomic1_5.4.0-6ubuntu1~16.04.11_s390x.deb ...
  1120. Unpacking libatomic1:s390x (5.4.0-6ubuntu1~16.04.11) over (5.3.1-14ubuntu2) ...
  1121. Preparing to unpack .../g++-5_5.4.0-6ubuntu1~16.04.11_s390x.deb ...
  1122. Unpacking g++-5 (5.4.0-6ubuntu1~16.04.11) over (5.3.1-14ubuntu2) ...
  1123. Preparing to unpack .../gcc-5_5.4.0-6ubuntu1~16.04.11_s390x.deb ...
  1124. Unpacking gcc-5 (5.4.0-6ubuntu1~16.04.11) over (5.3.1-14ubuntu2) ...
  1125. Preparing to unpack .../cpp-5_5.4.0-6ubuntu1~16.04.11_s390x.deb ...
  1126. Unpacking cpp-5 (5.4.0-6ubuntu1~16.04.11) over (5.3.1-14ubuntu2) ...
  1127. Preparing to unpack .../libcc1-0_5.4.0-6ubuntu1~16.04.11_s390x.deb ...
  1128. Unpacking libcc1-0:s390x (5.4.0-6ubuntu1~16.04.11) over (5.3.1-14ubuntu2) ...
  1129. Preparing to unpack .../binutils_2.26.1-1ubuntu1~16.04.7_s390x.deb ...
  1130. Unpacking binutils (2.26.1-1ubuntu1~16.04.7) over (2.26-8ubuntu2) ...
  1131. Preparing to unpack .../libstdc++-5-dev_5.4.0-6ubuntu1~16.04.11_s390x.deb ...
  1132. Unpacking libstdc++-5-dev:s390x (5.4.0-6ubuntu1~16.04.11) over (5.3.1-14ubuntu2) ...
  1133. Preparing to unpack .../libgcc-5-dev_5.4.0-6ubuntu1~16.04.11_s390x.deb ...
  1134. Unpacking libgcc-5-dev:s390x (5.4.0-6ubuntu1~16.04.11) over (5.3.1-14ubuntu2) ...
  1135. Preparing to unpack .../gcc-5-base_5.4.0-6ubuntu1~16.04.11_s390x.deb ...
  1136. Unpacking gcc-5-base:s390x (5.4.0-6ubuntu1~16.04.11) over (5.3.1-14ubuntu2) ...
  1137. Processing triggers for libc-bin (2.23-0ubuntu10) ...
  1138. Setting up gcc-5-base:s390x (5.4.0-6ubuntu1~16.04.11) ...
  1139. (Reading database ...
  1140. (Reading database ... 5%
  1141. (Reading database ... 10%
  1142. (Reading database ... 15%
  1143. (Reading database ... 20%
  1144. (Reading database ... 25%
  1145. (Reading database ... 30%
  1146. (Reading database ... 35%
  1147. (Reading database ... 40%
  1148. (Reading database ... 45%
  1149. (Reading database ... 50%
  1150. (Reading database ... 55%
  1151. (Reading database ... 60%
  1152. (Reading database ... 65%
  1153. (Reading database ... 70%
  1154. (Reading database ... 75%
  1155. (Reading database ... 80%
  1156. (Reading database ... 85%
  1157. (Reading database ... 90%
  1158. (Reading database ... 95%
  1159. (Reading database ... 100%
  1160. (Reading database ... 11904 files and directories currently installed.)
  1161. Preparing to unpack .../libstdc++6_5.4.0-6ubuntu1~16.04.11_s390x.deb ...
  1162. Unpacking libstdc++6:s390x (5.4.0-6ubuntu1~16.04.11) over (5.3.1-14ubuntu2) ...
  1163. Processing triggers for libc-bin (2.23-0ubuntu10) ...
  1164. Setting up libstdc++6:s390x (5.4.0-6ubuntu1~16.04.11) ...
  1165. Processing triggers for libc-bin (2.23-0ubuntu10) ...
  1166. (Reading database ...
  1167. (Reading database ... 5%
  1168. (Reading database ... 10%
  1169. (Reading database ... 15%
  1170. (Reading database ... 20%
  1171. (Reading database ... 25%
  1172. (Reading database ... 30%
  1173. (Reading database ... 35%
  1174. (Reading database ... 40%
  1175. (Reading database ... 45%
  1176. (Reading database ... 50%
  1177. (Reading database ... 55%
  1178. (Reading database ... 60%
  1179. (Reading database ... 65%
  1180. (Reading database ... 70%
  1181. (Reading database ... 75%
  1182. (Reading database ... 80%
  1183. (Reading database ... 85%
  1184. (Reading database ... 90%
  1185. (Reading database ... 95%
  1186. (Reading database ... 100%
  1187. (Reading database ... 11904 files and directories currently installed.)
  1188. Preparing to unpack .../libapt-pkg5.0_1.2.29_s390x.deb ...
  1189. Unpacking libapt-pkg5.0:s390x (1.2.29) over (1.2.10ubuntu1) ...
  1190. Processing triggers for libc-bin (2.23-0ubuntu10) ...
  1191. Setting up libapt-pkg5.0:s390x (1.2.29) ...
  1192. Processing triggers for libc-bin (2.23-0ubuntu10) ...
  1193. (Reading database ...
  1194. (Reading database ... 5%
  1195. (Reading database ... 10%
  1196. (Reading database ... 15%
  1197. (Reading database ... 20%
  1198. (Reading database ... 25%
  1199. (Reading database ... 30%
  1200. (Reading database ... 35%
  1201. (Reading database ... 40%
  1202. (Reading database ... 45%
  1203. (Reading database ... 50%
  1204. (Reading database ... 55%
  1205. (Reading database ... 60%
  1206. (Reading database ... 65%
  1207. (Reading database ... 70%
  1208. (Reading database ... 75%
  1209. (Reading database ... 80%
  1210. (Reading database ... 85%
  1211. (Reading database ... 90%
  1212. (Reading database ... 95%
  1213. (Reading database ... 100%
  1214. (Reading database ... 11904 files and directories currently installed.)
  1215. Preparing to unpack .../gpgv_1.4.20-1ubuntu3.3_s390x.deb ...
  1216. Unpacking gpgv (1.4.20-1ubuntu3.3) over (1.4.20-1ubuntu3) ...
  1217. Setting up gpgv (1.4.20-1ubuntu3.3) ...
  1218. (Reading database ...
  1219. (Reading database ... 5%
  1220. (Reading database ... 10%
  1221. (Reading database ... 15%
  1222. (Reading database ... 20%
  1223. (Reading database ... 25%
  1224. (Reading database ... 30%
  1225. (Reading database ... 35%
  1226. (Reading database ... 40%
  1227. (Reading database ... 45%
  1228. (Reading database ... 50%
  1229. (Reading database ... 55%
  1230. (Reading database ... 60%
  1231. (Reading database ... 65%
  1232. (Reading database ... 70%
  1233. (Reading database ... 75%
  1234. (Reading database ... 80%
  1235. (Reading database ... 85%
  1236. (Reading database ... 90%
  1237. (Reading database ... 95%
  1238. (Reading database ... 100%
  1239. (Reading database ... 11904 files and directories currently installed.)
  1240. Preparing to unpack .../gnupg_1.4.20-1ubuntu3.3_s390x.deb ...
  1241. Unpacking gnupg (1.4.20-1ubuntu3.3) over (1.4.20-1ubuntu3) ...
  1242. Setting up gnupg (1.4.20-1ubuntu3.3) ...
  1243. (Reading database ...
  1244. (Reading database ... 5%
  1245. (Reading database ... 10%
  1246. (Reading database ... 15%
  1247. (Reading database ... 20%
  1248. (Reading database ... 25%
  1249. (Reading database ... 30%
  1250. (Reading database ... 35%
  1251. (Reading database ... 40%
  1252. (Reading database ... 45%
  1253. (Reading database ... 50%
  1254. (Reading database ... 55%
  1255. (Reading database ... 60%
  1256. (Reading database ... 65%
  1257. (Reading database ... 70%
  1258. (Reading database ... 75%
  1259. (Reading database ... 80%
  1260. (Reading database ... 85%
  1261. (Reading database ... 90%
  1262. (Reading database ... 95%
  1263. (Reading database ... 100%
  1264. (Reading database ... 11904 files and directories currently installed.)
  1265. Preparing to unpack .../archives/apt_1.2.29_s390x.deb ...
  1266. /usr/sbin/policy-rc.d returned 101, not running 'stop apt-daily.timer'
  1267. Unpacking apt (1.2.29) over (1.2.10ubuntu1) ...
  1268. Processing triggers for libc-bin (2.23-0ubuntu10) ...
  1269. Setting up apt (1.2.29) ...
  1270. Installing new version of config file /etc/apt/apt.conf.d/01autoremove ...
  1271. Installing new version of config file /etc/cron.daily/apt-compat ...
  1272. Installing new version of config file /etc/kernel/postinst.d/apt-auto-removal ...
  1273. /usr/sbin/policy-rc.d returned 101, not running 'start apt-daily-upgrade.timer apt-daily.timer'
  1274. Processing triggers for libc-bin (2.23-0ubuntu10) ...
  1275. (Reading database ...
  1276. (Reading database ... 5%
  1277. (Reading database ... 10%
  1278. (Reading database ... 15%
  1279. (Reading database ... 20%
  1280. (Reading database ... 25%
  1281. (Reading database ... 30%
  1282. (Reading database ... 35%
  1283. (Reading database ... 40%
  1284. (Reading database ... 45%
  1285. (Reading database ... 50%
  1286. (Reading database ... 55%
  1287. (Reading database ... 60%
  1288. (Reading database ... 65%
  1289. (Reading database ... 70%
  1290. (Reading database ... 75%
  1291. (Reading database ... 80%
  1292. (Reading database ... 85%
  1293. (Reading database ... 90%
  1294. (Reading database ... 95%
  1295. (Reading database ... 100%
  1296. (Reading database ... 11906 files and directories currently installed.)
  1297. Preparing to unpack .../systemd-sysv_229-4ubuntu21.10_s390x.deb ...
  1298. Unpacking systemd-sysv (229-4ubuntu21.10) over (229-4ubuntu4) ...
  1299. Setting up systemd-sysv (229-4ubuntu21.10) ...
  1300. (Reading database ...
  1301. (Reading database ... 5%
  1302. (Reading database ... 10%
  1303. (Reading database ... 15%
  1304. (Reading database ... 20%
  1305. (Reading database ... 25%
  1306. (Reading database ... 30%
  1307. (Reading database ... 35%
  1308. (Reading database ... 40%
  1309. (Reading database ... 45%
  1310. (Reading database ... 50%
  1311. (Reading database ... 55%
  1312. (Reading database ... 60%
  1313. (Reading database ... 65%
  1314. (Reading database ... 70%
  1315. (Reading database ... 75%
  1316. (Reading database ... 80%
  1317. (Reading database ... 85%
  1318. (Reading database ... 90%
  1319. (Reading database ... 95%
  1320. (Reading database ... 100%
  1321. (Reading database ... 11906 files and directories currently installed.)
  1322. Preparing to unpack .../libfdisk1_2.27.1-6ubuntu3.6_s390x.deb ...
  1323. Unpacking libfdisk1:s390x (2.27.1-6ubuntu3.6) over (2.27.1-6ubuntu3) ...
  1324. Processing triggers for libc-bin (2.23-0ubuntu10) ...
  1325. Setting up libfdisk1:s390x (2.27.1-6ubuntu3.6) ...
  1326. Processing triggers for libc-bin (2.23-0ubuntu10) ...
  1327. (Reading database ...
  1328. (Reading database ... 5%
  1329. (Reading database ... 10%
  1330. (Reading database ... 15%
  1331. (Reading database ... 20%
  1332. (Reading database ... 25%
  1333. (Reading database ... 30%
  1334. (Reading database ... 35%
  1335. (Reading database ... 40%
  1336. (Reading database ... 45%
  1337. (Reading database ... 50%
  1338. (Reading database ... 55%
  1339. (Reading database ... 60%
  1340. (Reading database ... 65%
  1341. (Reading database ... 70%
  1342. (Reading database ... 75%
  1343. (Reading database ... 80%
  1344. (Reading database ... 85%
  1345. (Reading database ... 90%
  1346. (Reading database ... 95%
  1347. (Reading database ... 100%
  1348. (Reading database ... 11906 files and directories currently installed.)
  1349. Preparing to unpack .../libpam-runtime_1.1.8-3.2ubuntu2.1_all.deb ...
  1350. Unpacking libpam-runtime (1.1.8-3.2ubuntu2.1) over (1.1.8-3.2ubuntu2) ...
  1351. Setting up libpam-runtime (1.1.8-3.2ubuntu2.1) ...
  1352. (Reading database ...
  1353. (Reading database ... 5%
  1354. (Reading database ... 10%
  1355. (Reading database ... 15%
  1356. (Reading database ... 20%
  1357. (Reading database ... 25%
  1358. (Reading database ... 30%
  1359. (Reading database ... 35%
  1360. (Reading database ... 40%
  1361. (Reading database ... 45%
  1362. (Reading database ... 50%
  1363. (Reading database ... 55%
  1364. (Reading database ... 60%
  1365. (Reading database ... 65%
  1366. (Reading database ... 70%
  1367. (Reading database ... 75%
  1368. (Reading database ... 80%
  1369. (Reading database ... 85%
  1370. (Reading database ... 90%
  1371. (Reading database ... 95%
  1372. (Reading database ... 100%
  1373. (Reading database ... 11906 files and directories currently installed.)
  1374. Preparing to unpack .../libsmartcols1_2.27.1-6ubuntu3.6_s390x.deb ...
  1375. Unpacking libsmartcols1:s390x (2.27.1-6ubuntu3.6) over (2.27.1-6ubuntu3) ...
  1376. Processing triggers for libc-bin (2.23-0ubuntu10) ...
  1377. Setting up libsmartcols1:s390x (2.27.1-6ubuntu3.6) ...
  1378. Processing triggers for libc-bin (2.23-0ubuntu10) ...
  1379. (Reading database ...
  1380. (Reading database ... 5%
  1381. (Reading database ... 10%
  1382. (Reading database ... 15%
  1383. (Reading database ... 20%
  1384. (Reading database ... 25%
  1385. (Reading database ... 30%
  1386. (Reading database ... 35%
  1387. (Reading database ... 40%
  1388. (Reading database ... 45%
  1389. (Reading database ... 50%
  1390. (Reading database ... 55%
  1391. (Reading database ... 60%
  1392. (Reading database ... 65%
  1393. (Reading database ... 70%
  1394. (Reading database ... 75%
  1395. (Reading database ... 80%
  1396. (Reading database ... 85%
  1397. (Reading database ... 90%
  1398. (Reading database ... 95%
  1399. (Reading database ... 100%
  1400. (Reading database ... 11906 files and directories currently installed.)
  1401. Preparing to unpack .../libudev1_229-4ubuntu21.10_s390x.deb ...
  1402. Unpacking libudev1:s390x (229-4ubuntu21.10) over (229-4ubuntu4) ...
  1403. Processing triggers for libc-bin (2.23-0ubuntu10) ...
  1404. Setting up libudev1:s390x (229-4ubuntu21.10) ...
  1405. Processing triggers for libc-bin (2.23-0ubuntu10) ...
  1406. (Reading database ...
  1407. (Reading database ... 5%
  1408. (Reading database ... 10%
  1409. (Reading database ... 15%
  1410. (Reading database ... 20%
  1411. (Reading database ... 25%
  1412. (Reading database ... 30%
  1413. (Reading database ... 35%
  1414. (Reading database ... 40%
  1415. (Reading database ... 45%
  1416. (Reading database ... 50%
  1417. (Reading database ... 55%
  1418. (Reading database ... 60%
  1419. (Reading database ... 65%
  1420. (Reading database ... 70%
  1421. (Reading database ... 75%
  1422. (Reading database ... 80%
  1423. (Reading database ... 85%
  1424. (Reading database ... 90%
  1425. (Reading database ... 95%
  1426. (Reading database ... 100%
  1427. (Reading database ... 11906 files and directories currently installed.)
  1428. Preparing to unpack .../multiarch-support_2.23-0ubuntu10_s390x.deb ...
  1429. Unpacking multiarch-support (2.23-0ubuntu10) over (2.23-0ubuntu3) ...
  1430. Setting up multiarch-support (2.23-0ubuntu10) ...
  1431. (Reading database ...
  1432. (Reading database ... 5%
  1433. (Reading database ... 10%
  1434. (Reading database ... 15%
  1435. (Reading database ... 20%
  1436. (Reading database ... 25%
  1437. (Reading database ... 30%
  1438. (Reading database ... 35%
  1439. (Reading database ... 40%
  1440. (Reading database ... 45%
  1441. (Reading database ... 50%
  1442. (Reading database ... 55%
  1443. (Reading database ... 60%
  1444. (Reading database ... 65%
  1445. (Reading database ... 70%
  1446. (Reading database ... 75%
  1447. (Reading database ... 80%
  1448. (Reading database ... 85%
  1449. (Reading database ... 90%
  1450. (Reading database ... 95%
  1451. (Reading database ... 100%
  1452. (Reading database ... 11906 files and directories currently installed.)
  1453. Preparing to unpack .../sensible-utils_0.0.9ubuntu0.16.04.1_all.deb ...
  1454. Unpacking sensible-utils (0.0.9ubuntu0.16.04.1) over (0.0.9) ...
  1455. Setting up sensible-utils (0.0.9ubuntu0.16.04.1) ...
  1456. (Reading database ...
  1457. (Reading database ... 5%
  1458. (Reading database ... 10%
  1459. (Reading database ... 15%
  1460. (Reading database ... 20%
  1461. (Reading database ... 25%
  1462. (Reading database ... 30%
  1463. (Reading database ... 35%
  1464. (Reading database ... 40%
  1465. (Reading database ... 45%
  1466. (Reading database ... 50%
  1467. (Reading database ... 55%
  1468. (Reading database ... 60%
  1469. (Reading database ... 65%
  1470. (Reading database ... 70%
  1471. (Reading database ... 75%
  1472. (Reading database ... 80%
  1473. (Reading database ... 85%
  1474. (Reading database ... 90%
  1475. (Reading database ... 95%
  1476. (Reading database ... 100%
  1477. (Reading database ... 11906 files and directories currently installed.)
  1478. Preparing to unpack .../libprocps4_2%3a3.3.10-4ubuntu2.4_s390x.deb ...
  1479. Unpacking libprocps4:s390x (2:3.3.10-4ubuntu2.4) over (2:3.3.10-4ubuntu2) ...
  1480. Preparing to unpack .../procps_2%3a3.3.10-4ubuntu2.4_s390x.deb ...
  1481. invoke-rc.d: policy-rc.d denied execution of stop.
  1482. Unpacking procps (2:3.3.10-4ubuntu2.4) over (2:3.3.10-4ubuntu2) ...
  1483. Preparing to unpack .../tzdata_2018i-0ubuntu0.16.04_all.deb ...
  1484. Unpacking tzdata (2018i-0ubuntu0.16.04) over (2016d-0ubuntu0.16.04) ...
  1485. Preparing to unpack .../libhogweed4_3.2-1ubuntu0.16.04.1_s390x.deb ...
  1486. Unpacking libhogweed4:s390x (3.2-1ubuntu0.16.04.1) over (3.2-1) ...
  1487. Preparing to unpack .../libnettle6_3.2-1ubuntu0.16.04.1_s390x.deb ...
  1488. Unpacking libnettle6:s390x (3.2-1ubuntu0.16.04.1) over (3.2-1) ...
  1489. Preparing to unpack .../libidn11_1.32-3ubuntu1.2_s390x.deb ...
  1490. Unpacking libidn11:s390x (1.32-3ubuntu1.2) over (1.32-3ubuntu1) ...
  1491. Preparing to unpack .../libp11-kit0_0.23.2-5~ubuntu16.04.1_s390x.deb ...
  1492. Unpacking libp11-kit0:s390x (0.23.2-5~ubuntu16.04.1) over (0.23.2-3) ...
  1493. Preparing to unpack .../libtasn1-6_4.7-3ubuntu0.16.04.3_s390x.deb ...
  1494. Unpacking libtasn1-6:s390x (4.7-3ubuntu0.16.04.3) over (4.7-3) ...
  1495. Preparing to unpack .../libgnutls30_3.4.10-4ubuntu1.4_s390x.deb ...
  1496. Unpacking libgnutls30:s390x (3.4.10-4ubuntu1.4) over (3.4.10-4ubuntu1) ...
  1497. Preparing to unpack .../libpng12-0_1.2.54-1ubuntu1.1_s390x.deb ...
  1498. Unpacking libpng12-0:s390x (1.2.54-1ubuntu1.1) over (1.2.54-1ubuntu1) ...
  1499. Preparing to unpack .../libslang2_2.3.0-2ubuntu1.1_s390x.deb ...
  1500. Unpacking libslang2:s390x (2.3.0-2ubuntu1.1) over (2.3.0-2ubuntu1) ...
  1501. Preparing to unpack .../libssl1.0.0_1.0.2g-1ubuntu4.14_s390x.deb ...
  1502. Unpacking libssl1.0.0:s390x (1.0.2g-1ubuntu4.14) over (1.0.2g-1ubuntu4) ...
  1503. Preparing to unpack .../libgssapi-krb5-2_1.13.2+dfsg-5ubuntu2_s390x.deb ...
  1504. Unpacking libgssapi-krb5-2:s390x (1.13.2+dfsg-5ubuntu2) over (1.13.2+dfsg-5) ...
  1505. Preparing to unpack .../libkrb5-3_1.13.2+dfsg-5ubuntu2_s390x.deb ...
  1506. Unpacking libkrb5-3:s390x (1.13.2+dfsg-5ubuntu2) over (1.13.2+dfsg-5) ...
  1507. Preparing to unpack .../libkrb5support0_1.13.2+dfsg-5ubuntu2_s390x.deb ...
  1508. Unpacking libkrb5support0:s390x (1.13.2+dfsg-5ubuntu2) over (1.13.2+dfsg-5) ...
  1509. Preparing to unpack .../libk5crypto3_1.13.2+dfsg-5ubuntu2_s390x.deb ...
  1510. Unpacking libk5crypto3:s390x (1.13.2+dfsg-5ubuntu2) over (1.13.2+dfsg-5) ...
  1511. Preparing to unpack .../libroken18-heimdal_1.7~git20150920+dfsg-4ubuntu1.16.04.1_s390x.deb ...
  1512. Unpacking libroken18-heimdal:s390x (1.7~git20150920+dfsg-4ubuntu1.16.04.1) over (1.7~git20150920+dfsg-4ubuntu1) ...
  1513. Preparing to unpack .../libasn1-8-heimdal_1.7~git20150920+dfsg-4ubuntu1.16.04.1_s390x.deb ...
  1514. Unpacking libasn1-8-heimdal:s390x (1.7~git20150920+dfsg-4ubuntu1.16.04.1) over (1.7~git20150920+dfsg-4ubuntu1) ...
  1515. Preparing to unpack .../libhcrypto4-heimdal_1.7~git20150920+dfsg-4ubuntu1.16.04.1_s390x.deb ...
  1516. Unpacking libhcrypto4-heimdal:s390x (1.7~git20150920+dfsg-4ubuntu1.16.04.1) over (1.7~git20150920+dfsg-4ubuntu1) ...
  1517. Preparing to unpack .../libheimbase1-heimdal_1.7~git20150920+dfsg-4ubuntu1.16.04.1_s390x.deb ...
  1518. Unpacking libheimbase1-heimdal:s390x (1.7~git20150920+dfsg-4ubuntu1.16.04.1) over (1.7~git20150920+dfsg-4ubuntu1) ...
  1519. Preparing to unpack .../libwind0-heimdal_1.7~git20150920+dfsg-4ubuntu1.16.04.1_s390x.deb ...
  1520. Unpacking libwind0-heimdal:s390x (1.7~git20150920+dfsg-4ubuntu1.16.04.1) over (1.7~git20150920+dfsg-4ubuntu1) ...
  1521. Preparing to unpack .../libhx509-5-heimdal_1.7~git20150920+dfsg-4ubuntu1.16.04.1_s390x.deb ...
  1522. Unpacking libhx509-5-heimdal:s390x (1.7~git20150920+dfsg-4ubuntu1.16.04.1) over (1.7~git20150920+dfsg-4ubuntu1) ...
  1523. Preparing to unpack .../libkrb5-26-heimdal_1.7~git20150920+dfsg-4ubuntu1.16.04.1_s390x.deb ...
  1524. Unpacking libkrb5-26-heimdal:s390x (1.7~git20150920+dfsg-4ubuntu1.16.04.1) over (1.7~git20150920+dfsg-4ubuntu1) ...
  1525. Preparing to unpack .../libheimntlm0-heimdal_1.7~git20150920+dfsg-4ubuntu1.16.04.1_s390x.deb ...
  1526. Unpacking libheimntlm0-heimdal:s390x (1.7~git20150920+dfsg-4ubuntu1.16.04.1) over (1.7~git20150920+dfsg-4ubuntu1) ...
  1527. Preparing to unpack .../libgssapi3-heimdal_1.7~git20150920+dfsg-4ubuntu1.16.04.1_s390x.deb ...
  1528. Unpacking libgssapi3-heimdal:s390x (1.7~git20150920+dfsg-4ubuntu1.16.04.1) over (1.7~git20150920+dfsg-4ubuntu1) ...
  1529. Preparing to unpack .../libsasl2-modules-db_2.1.26.dfsg1-14ubuntu0.1_s390x.deb ...
  1530. Unpacking libsasl2-modules-db:s390x (2.1.26.dfsg1-14ubuntu0.1) over (2.1.26.dfsg1-14build1) ...
  1531. Preparing to unpack .../libsasl2-2_2.1.26.dfsg1-14ubuntu0.1_s390x.deb ...
  1532. Unpacking libsasl2-2:s390x (2.1.26.dfsg1-14ubuntu0.1) over (2.1.26.dfsg1-14build1) ...
  1533. Preparing to unpack .../libldap-2.4-2_2.4.42+dfsg-2ubuntu3.4_s390x.deb ...
  1534. Unpacking libldap-2.4-2:s390x (2.4.42+dfsg-2ubuntu3.4) over (2.4.42+dfsg-2ubuntu3) ...
  1535. Preparing to unpack .../librtmp1_2.4+20151223.gitfa8646d-1ubuntu0.1_s390x.deb ...
  1536. Unpacking librtmp1:s390x (2.4+20151223.gitfa8646d-1ubuntu0.1) over (2.4+20151223.gitfa8646d-1build1) ...
  1537. Preparing to unpack .../libcurl3-gnutls_7.47.0-1ubuntu2.11_s390x.deb ...
  1538. Unpacking libcurl3-gnutls:s390x (7.47.0-1ubuntu2.11) over (7.47.0-1ubuntu2) ...
  1539. Preparing to unpack .../apt-transport-https_1.2.29_s390x.deb ...
  1540. Unpacking apt-transport-https (1.2.29) over (1.2.10ubuntu1) ...
  1541. Preparing to unpack .../openssl_1.0.2g-1ubuntu4.14_s390x.deb ...
  1542. Unpacking openssl (1.0.2g-1ubuntu4.14) over (1.0.2g-1ubuntu4) ...
  1543. Preparing to unpack .../ca-certificates_20170717~16.04.2_all.deb ...
  1544. Unpacking ca-certificates (20170717~16.04.2) over (20160104ubuntu1) ...
  1545. Preparing to unpack .../advancecomp_1.20-1ubuntu0.1_s390x.deb ...
  1546. Unpacking advancecomp (1.20-1ubuntu0.1) over (1.20-1) ...
  1547. Preparing to unpack .../dpkg-dev_1.18.4ubuntu1.5_all.deb ...
  1548. Unpacking dpkg-dev (1.18.4ubuntu1.5) over (1.18.4ubuntu1) ...
  1549. Preparing to unpack .../libdpkg-perl_1.18.4ubuntu1.5_all.deb ...
  1550. Unpacking libdpkg-perl (1.18.4ubuntu1.5) over (1.18.4ubuntu1) ...
  1551. Preparing to unpack .../patch_2.7.5-1ubuntu0.16.04.1_s390x.deb ...
  1552. Unpacking patch (2.7.5-1ubuntu0.16.04.1) over (2.7.5-1) ...
  1553. Preparing to unpack .../optipng_0.7.6-1ubuntu0.16.04.1_s390x.deb ...
  1554. Unpacking optipng (0.7.6-1ubuntu0.16.04.1) over (0.7.6-1) ...
  1555. Processing triggers for libc-bin (2.23-0ubuntu10) ...
  1556. Processing triggers for systemd (229-4ubuntu21.10) ...
  1557. Setting up perl-modules-5.22 (5.22.1-9ubuntu0.6) ...
  1558. Setting up libperl5.22:s390x (5.22.1-9ubuntu0.6) ...
  1559. Setting up perl (5.22.1-9ubuntu0.6) ...
  1560. Setting up libc-dev-bin (2.23-0ubuntu10) ...
  1561. Setting up linux-libc-dev:s390x (4.4.0-141.167) ...
  1562. Setting up libc6-dev:s390x (2.23-0ubuntu10) ...
  1563. Setting up libgomp1:s390x (5.4.0-6ubuntu1~16.04.11) ...
  1564. Setting up libitm1:s390x (5.4.0-6ubuntu1~16.04.11) ...
  1565. Setting up libatomic1:s390x (5.4.0-6ubuntu1~16.04.11) ...
  1566. Setting up cpp-5 (5.4.0-6ubuntu1~16.04.11) ...
  1567. Setting up libcc1-0:s390x (5.4.0-6ubuntu1~16.04.11) ...
  1568. Setting up binutils (2.26.1-1ubuntu1~16.04.7) ...
  1569. Setting up libgcc-5-dev:s390x (5.4.0-6ubuntu1~16.04.11) ...
  1570. Setting up gcc-5 (5.4.0-6ubuntu1~16.04.11) ...
  1571. Setting up libstdc++-5-dev:s390x (5.4.0-6ubuntu1~16.04.11) ...
  1572. Setting up g++-5 (5.4.0-6ubuntu1~16.04.11) ...
  1573. Setting up libprocps4:s390x (2:3.3.10-4ubuntu2.4) ...
  1574. Setting up procps (2:3.3.10-4ubuntu2.4) ...
  1575. update-rc.d: warning: start and stop actions are no longer supported; falling back to defaults
  1576. Setting up tzdata (2018i-0ubuntu0.16.04) ...
  1577.  
  1578. Current default time zone: 'Etc/UTC'
  1579. Local time is now:      Thu Jan 10 20:39:22 UTC 2019.
  1580. Universal Time is now:  Thu Jan 10 20:39:22 UTC 2019.
  1581. Run 'dpkg-reconfigure tzdata' if you wish to change it.
  1582.  
  1583. Setting up libnettle6:s390x (3.2-1ubuntu0.16.04.1) ...
  1584. Setting up libhogweed4:s390x (3.2-1ubuntu0.16.04.1) ...
  1585. Setting up libidn11:s390x (1.32-3ubuntu1.2) ...
  1586. Setting up libp11-kit0:s390x (0.23.2-5~ubuntu16.04.1) ...
  1587. Setting up libtasn1-6:s390x (4.7-3ubuntu0.16.04.3) ...
  1588. Setting up libgnutls30:s390x (3.4.10-4ubuntu1.4) ...
  1589. Setting up libpng12-0:s390x (1.2.54-1ubuntu1.1) ...
  1590. Setting up libslang2:s390x (2.3.0-2ubuntu1.1) ...
  1591. Setting up libssl1.0.0:s390x (1.0.2g-1ubuntu4.14) ...
  1592. Setting up libkrb5support0:s390x (1.13.2+dfsg-5ubuntu2) ...
  1593. Setting up libk5crypto3:s390x (1.13.2+dfsg-5ubuntu2) ...
  1594. Setting up libkrb5-3:s390x (1.13.2+dfsg-5ubuntu2) ...
  1595. Setting up libgssapi-krb5-2:s390x (1.13.2+dfsg-5ubuntu2) ...
  1596. Setting up libroken18-heimdal:s390x (1.7~git20150920+dfsg-4ubuntu1.16.04.1) ...
  1597. Setting up libasn1-8-heimdal:s390x (1.7~git20150920+dfsg-4ubuntu1.16.04.1) ...
  1598. Setting up libhcrypto4-heimdal:s390x (1.7~git20150920+dfsg-4ubuntu1.16.04.1) ...
  1599. Setting up libheimbase1-heimdal:s390x (1.7~git20150920+dfsg-4ubuntu1.16.04.1) ...
  1600. Setting up libwind0-heimdal:s390x (1.7~git20150920+dfsg-4ubuntu1.16.04.1) ...
  1601. Setting up libhx509-5-heimdal:s390x (1.7~git20150920+dfsg-4ubuntu1.16.04.1) ...
  1602. Setting up libkrb5-26-heimdal:s390x (1.7~git20150920+dfsg-4ubuntu1.16.04.1) ...
  1603. Setting up libheimntlm0-heimdal:s390x (1.7~git20150920+dfsg-4ubuntu1.16.04.1) ...
  1604. Setting up libgssapi3-heimdal:s390x (1.7~git20150920+dfsg-4ubuntu1.16.04.1) ...
  1605. Setting up libsasl2-modules-db:s390x (2.1.26.dfsg1-14ubuntu0.1) ...
  1606. Setting up libsasl2-2:s390x (2.1.26.dfsg1-14ubuntu0.1) ...
  1607. Setting up libldap-2.4-2:s390x (2.4.42+dfsg-2ubuntu3.4) ...
  1608. Setting up librtmp1:s390x (2.4+20151223.gitfa8646d-1ubuntu0.1) ...
  1609. Setting up libcurl3-gnutls:s390x (7.47.0-1ubuntu2.11) ...
  1610. Setting up apt-transport-https (1.2.29) ...
  1611. Setting up openssl (1.0.2g-1ubuntu4.14) ...
  1612. Setting up ca-certificates (20170717~16.04.2) ...
  1613. Setting up advancecomp (1.20-1ubuntu0.1) ...
  1614. Setting up libdpkg-perl (1.18.4ubuntu1.5) ...
  1615. Setting up patch (2.7.5-1ubuntu0.16.04.1) ...
  1616. Setting up dpkg-dev (1.18.4ubuntu1.5) ...
  1617. Setting up optipng (0.7.6-1ubuntu0.16.04.1) ...
  1618. Processing triggers for libc-bin (2.23-0ubuntu10) ...
  1619. Processing triggers for ca-certificates (20170717~16.04.2) ...
  1620. Updating certificates in /etc/ssl/certs...
  1621. 17 added, 42 removed; done.
  1622. Running hooks in /etc/ca-certificates/update.d...
  1623. done.
  1624. RUN: /usr/share/launchpad-buildd/slavebin/in-target buildsnap --backend=lxd --series=xenial --arch=s390x SNAPBUILD-428701 --build-url 'https://launchpad.net/~build.snapcraft.io/+snap/9bc23507e335fb54c4484719e01a72a0-xenial/+build/428701' --proxy-url http://10.10.10.1:8222/ --revocation-endpoint http://snap-proxy.launchpad.net:8080/tokens/SNAPBUILD-428701-1547152709 --git-repository https://github.com/yorokobicom/agent yorokobi
  1625. Running install phase...
  1626. Reading package lists...
  1627. Building dependency tree...
  1628. Reading state information...
  1629. The following additional packages will be installed:
  1630.   apparmor dh-python execstack git-man libapparmor-perl libapt-inst2.0 libbsd0
  1631.   libedit2 libelf1 liberror-perl libexpat1 libfuse2 libicu55 liblzo2-2
  1632.   libmpdec2 libpython-stdlib libpython2.7-minimal libpython2.7-stdlib
  1633.   libpython3-stdlib libpython3.5-minimal libpython3.5-stdlib libsodium18
  1634.   libwrap0 libxml2 libxslt1.1 libyaml-0-2 mime-support openssh-client patchelf
  1635.   python python-apt-common python-chardet python-minimal python-pkg-resources
  1636.   python-requests python-six python-urllib3 python2.7 python2.7-minimal
  1637.   python3-apt python3-chardet python3-click python3-colorama python3-crypto
  1638.   python3-debian python3-ecdsa python3-jsonschema python3-libnacl python3-lxml
  1639.   python3-minimal python3-paramiko python3-petname python3-pkg-resources
  1640.   python3-progressbar python3-pyelftools python3-pymacaroons python3-pysha3
  1641.   python3-requests python3-requests-toolbelt python3-requests-unixsocket
  1642.   python3-setuptools python3-simplejson python3-six python3-tabulate
  1643.   python3-urllib3 python3-xdg python3-yaml python3.5 python3.5-minimal
  1644.   squashfs-tools sudo xdelta3
  1645. Suggested packages:
  1646.   apparmor-profiles apparmor-profiles-extra apparmor-docs apparmor-utils
  1647.   gettext-base git-daemon-run | git-daemon-sysvinit git-doc git-el git-email
  1648.   git-gui gitk gitweb git-arch git-cvs git-mediawiki git-svn ssh-askpass
  1649.   libpam-ssh keychain monkeysphere python-doc python-tk python-setuptools
  1650.   python-ndg-httpsclient python-openssl python-pyasn1 python-ntlm
  1651.   python2.7-doc binfmt-support python3-doc python3-tk python3-venv
  1652.   python3-apt-dbg python-apt-doc python3-crypto-dbg python-crypto-doc
  1653.   python3-lxml-dbg python-lxml-doc python-pysha3-doc python3-ndg-httpsclient
  1654.   python3-openssl python3-pyasn1 python-setuptools-doc python3.5-venv
  1655.   python3.5-doc lxd zenity | kdialog
  1656. Recommended packages:
  1657.   less rsync tcpd xml-core file xauth python-ndg-httpsclient python-openssl
  1658.   python-pyasn1 lsb-release iso-codes python3-bs4 python3-html5lib
  1659. The following NEW packages will be installed:
  1660.   apparmor dh-python execstack fuse git git-man libapparmor-perl
  1661.   libapt-inst2.0 libbsd0 libedit2 libelf1 liberror-perl libexpat1 libfuse2
  1662.   libicu55 liblzo2-2 libmpdec2 libpython-stdlib libpython2.7-minimal
  1663.   libpython2.7-stdlib libpython3-stdlib libpython3.5-minimal
  1664.   libpython3.5-stdlib libsodium18 libwrap0 libxml2 libxslt1.1 libyaml-0-2
  1665.   mime-support openssh-client patchelf python python-apt-common python-chardet
  1666.   python-minimal python-pkg-resources python-requests python-six
  1667.   python-urllib3 python2.7 python2.7-minimal python3 python3-apt
  1668.   python3-chardet python3-click python3-colorama python3-crypto python3-debian
  1669.   python3-ecdsa python3-jsonschema python3-libnacl python3-lxml
  1670.   python3-minimal python3-paramiko python3-petname python3-pkg-resources
  1671.   python3-progressbar python3-pyelftools python3-pymacaroons python3-pysha3
  1672.   python3-requests python3-requests-toolbelt python3-requests-unixsocket
  1673.   python3-setuptools python3-simplejson python3-six python3-tabulate
  1674.   python3-urllib3 python3-xdg python3-yaml python3.5 python3.5-minimal
  1675.   snapcraft snapd socat squashfs-tools squashfuse sudo udev xdelta3
  1676. 0 upgraded, 80 newly installed, 0 to remove and 0 not upgraded.
  1677. Need to get 39.0 MB of archives.
  1678. After this operation, 221 MB of additional disk space will be used.
  1679. Get:1 http://ftpmaster.internal/ubuntu xenial-security/main s390x libpython3.5-minimal s390x 3.5.2-2ubuntu0~16.04.5 [523 kB]
  1680. Get:2 http://ftpmaster.internal/ubuntu xenial-security/main s390x libexpat1 s390x 2.1.0-7ubuntu0.16.04.3 [66.0 kB]
  1681. Get:3 http://ftpmaster.internal/ubuntu xenial-security/main s390x python3.5-minimal s390x 3.5.2-2ubuntu0~16.04.5 [1490 kB]
  1682. Get:4 http://ftpmaster.internal/ubuntu xenial/main s390x python3-minimal s390x 3.5.1-3 [23.4 kB]
  1683. Get:5 http://ftpmaster.internal/ubuntu xenial/main s390x mime-support all 3.59ubuntu1 [31.0 kB]
  1684. Get:6 http://ftpmaster.internal/ubuntu xenial/main s390x libmpdec2 s390x 2.4.2-1 [81.5 kB]
  1685. Get:7 http://ftpmaster.internal/ubuntu xenial-security/main s390x libpython3.5-stdlib s390x 3.5.2-2ubuntu0~16.04.5 [2102 kB]
  1686. Get:8 http://ftpmaster.internal/ubuntu xenial-security/main s390x python3.5 s390x 3.5.2-2ubuntu0~16.04.5 [165 kB]
  1687. Get:9 http://ftpmaster.internal/ubuntu xenial/main s390x libpython3-stdlib s390x 3.5.1-3 [6816 B]
  1688. Get:10 http://ftpmaster.internal/ubuntu xenial-updates/main s390x dh-python all 2.20151103ubuntu1.1 [74.1 kB]
  1689. Get:11 http://ftpmaster.internal/ubuntu xenial/main s390x python3 s390x 3.5.1-3 [8716 B]
  1690. Get:12 http://ftpmaster.internal/ubuntu xenial-security/main s390x udev s390x 229-4ubuntu21.10 [958 kB]
  1691. Get:13 http://ftpmaster.internal/ubuntu xenial-security/main s390x libpython2.7-minimal s390x 2.7.12-1ubuntu0~16.04.4 [339 kB]
  1692. Get:14 http://ftpmaster.internal/ubuntu xenial-security/main s390x python2.7-minimal s390x 2.7.12-1ubuntu0~16.04.4 [1220 kB]
  1693. Get:15 http://ftpmaster.internal/ubuntu xenial-updates/main s390x python-minimal s390x 2.7.12-1~16.04 [28.3 kB]
  1694. Get:16 http://ftpmaster.internal/ubuntu xenial-security/main s390x libpython2.7-stdlib s390x 2.7.12-1ubuntu0~16.04.4 [1850 kB]
  1695. Get:17 http://ftpmaster.internal/ubuntu xenial-security/main s390x python2.7 s390x 2.7.12-1ubuntu0~16.04.4 [224 kB]
  1696. Get:18 http://ftpmaster.internal/ubuntu xenial-updates/main s390x libpython-stdlib s390x 2.7.12-1~16.04 [7760 B]
  1697. Get:19 http://ftpmaster.internal/ubuntu xenial-updates/main s390x python s390x 2.7.12-1~16.04 [137 kB]
  1698. Get:20 http://ftpmaster.internal/ubuntu xenial-updates/main s390x libapt-inst2.0 s390x 1.2.29 [55.2 kB]
  1699. Get:21 http://ftpmaster.internal/ubuntu xenial/main s390x libbsd0 s390x 0.8.2-1 [40.6 kB]
  1700. Get:22 http://ftpmaster.internal/ubuntu xenial-updates/main s390x sudo s390x 1.8.16-0ubuntu1.5 [364 kB]
  1701. Get:23 http://ftpmaster.internal/ubuntu xenial-security/main s390x libapparmor-perl s390x 2.10.95-0ubuntu2.10 [30.1 kB]
  1702. Get:24 http://ftpmaster.internal/ubuntu xenial-security/main s390x apparmor s390x 2.10.95-0ubuntu2.10 [475 kB]
  1703. Get:25 http://ftpmaster.internal/ubuntu xenial-updates/main s390x libfuse2 s390x 2.9.4-1ubuntu3.1 [85.2 kB]
  1704. Get:26 http://ftpmaster.internal/ubuntu xenial-updates/main s390x fuse s390x 2.9.4-1ubuntu3.1 [24.3 kB]
  1705. Get:27 http://ftpmaster.internal/ubuntu xenial/main s390x libedit2 s390x 3.1-20150325-1ubuntu2 [73.6 kB]
  1706. Get:28 http://ftpmaster.internal/ubuntu xenial-security/main s390x libelf1 s390x 0.165-3ubuntu1.1 [42.2 kB]
  1707. Get:29 http://ftpmaster.internal/ubuntu xenial-security/main s390x libicu55 s390x 55.1-7ubuntu0.4 [7490 kB]
  1708. Get:30 http://ftpmaster.internal/ubuntu xenial-security/main s390x libxml2 s390x 2.9.3+dfsg1-1ubuntu0.6 [642 kB]
  1709. Get:31 http://ftpmaster.internal/ubuntu xenial-security/main s390x openssh-client s390x 1:7.2p2-4ubuntu2.6 [563 kB]
  1710. Get:32 http://ftpmaster.internal/ubuntu xenial-updates/main s390x python-apt-common all 1.1.0~beta1ubuntu0.16.04.2 [16.0 kB]
  1711. Get:33 http://ftpmaster.internal/ubuntu xenial-updates/main s390x python3-apt s390x 1.1.0~beta1ubuntu0.16.04.2 [132 kB]
  1712. Get:34 http://ftpmaster.internal/ubuntu xenial/universe s390x execstack s390x 0.0.20130503-1.1 [72.3 kB]
  1713. Get:35 http://ftpmaster.internal/ubuntu xenial/main s390x liberror-perl all 0.17-1.2 [19.6 kB]
  1714. Get:36 http://ftpmaster.internal/ubuntu xenial-security/main s390x git-man all 1:2.7.4-0ubuntu1.6 [736 kB]
  1715. Get:37 http://ftpmaster.internal/ubuntu xenial-security/main s390x git s390x 1:2.7.4-0ubuntu1.6 [3008 kB]
  1716. Get:38 http://ftpmaster.internal/ubuntu xenial/main s390x liblzo2-2 s390x 2.08-1.2 [44.6 kB]
  1717. Get:39 http://ftpmaster.internal/ubuntu xenial/universe s390x libsodium18 s390x 1.0.8-5 [114 kB]
  1718. Get:40 http://ftpmaster.internal/ubuntu xenial/main s390x libwrap0 s390x 7.6.q-25 [45.7 kB]
  1719. Get:41 http://ftpmaster.internal/ubuntu xenial-security/main s390x libxslt1.1 s390x 1.1.28-2.1ubuntu0.1 [140 kB]
  1720. Get:42 http://ftpmaster.internal/ubuntu xenial/main s390x libyaml-0-2 s390x 0.1.6-3 [43.2 kB]
  1721. Get:43 http://ftpmaster.internal/ubuntu xenial-updates/universe s390x patchelf s390x 0.9-1~ubuntu16.04.1 [43.8 kB]
  1722. Get:44 http://ftpmaster.internal/ubuntu xenial/main s390x python-pkg-resources all 20.7.0-1 [108 kB]
  1723. Get:45 http://ftpmaster.internal/ubuntu xenial/main s390x python-chardet all 2.3.0-2 [96.3 kB]
  1724. Get:46 http://ftpmaster.internal/ubuntu xenial/main s390x python-six all 1.10.0-3 [10.9 kB]
  1725. Get:47 http://ftpmaster.internal/ubuntu xenial-updates/main s390x python-urllib3 all 1.13.1-2ubuntu0.16.04.2 [57.9 kB]
  1726. Get:48 http://ftpmaster.internal/ubuntu xenial-security/main s390x python-requests all 2.9.1-3ubuntu0.1 [55.9 kB]
  1727. Get:49 http://ftpmaster.internal/ubuntu xenial/main s390x python3-pkg-resources all 20.7.0-1 [79.0 kB]
  1728. Get:50 http://ftpmaster.internal/ubuntu xenial/main s390x python3-chardet all 2.3.0-2 [96.2 kB]
  1729. Get:51 http://ftpmaster.internal/ubuntu xenial/universe s390x python3-colorama all 0.3.7-1 [14.9 kB]
  1730. Get:52 http://ftpmaster.internal/ubuntu xenial/universe s390x python3-click all 6.2-2ubuntu1 [56.2 kB]
  1731. Get:53 http://ftpmaster.internal/ubuntu xenial-security/main s390x python3-crypto s390x 2.6.1-6ubuntu0.16.04.3 [258 kB]
  1732. Get:54 http://ftpmaster.internal/ubuntu xenial/main s390x python3-six all 1.10.0-3 [11.0 kB]
  1733. Get:55 http://ftpmaster.internal/ubuntu xenial/main s390x python3-debian all 0.1.27ubuntu2 [43.6 kB]
  1734. Get:56 http://ftpmaster.internal/ubuntu xenial/main s390x python3-ecdsa all 0.13-2 [34.1 kB]
  1735. Get:57 http://ftpmaster.internal/ubuntu xenial/main s390x python3-jsonschema all 2.5.1-4 [30.3 kB]
  1736. Get:58 http://ftpmaster.internal/ubuntu xenial-updates/universe s390x python3-libnacl all 1.4.5-0ubuntu1 [9576 B]
  1737. Get:59 http://ftpmaster.internal/ubuntu xenial-security/main s390x python3-lxml s390x 3.5.0-1ubuntu0.1 [706 kB]
  1738. Get:60 http://ftpmaster.internal/ubuntu xenial-security/main s390x python3-paramiko all 1.16.0-1ubuntu0.2 [110 kB]
  1739. Get:61 http://ftpmaster.internal/ubuntu xenial-updates/main s390x python3-petname all 2.0-0ubuntu1~16.04 [10.7 kB]
  1740. Get:62 http://ftpmaster.internal/ubuntu xenial/universe s390x python3-progressbar all 2.3-2 [9570 B]
  1741. Get:63 http://ftpmaster.internal/ubuntu xenial-updates/universe s390x python3-pymacaroons all 0.9.2-0ubuntu1 [9942 B]
  1742. Get:64 http://ftpmaster.internal/ubuntu xenial-updates/universe s390x python3-pysha3 s390x 1.0.0-0ubuntu1~ubuntu16.04.1 [24.2 kB]
  1743. Get:65 http://ftpmaster.internal/ubuntu xenial-updates/main s390x python3-urllib3 all 1.13.1-2ubuntu0.16.04.2 [58.1 kB]
  1744. Get:66 http://ftpmaster.internal/ubuntu xenial-security/main s390x python3-requests all 2.9.1-3ubuntu0.1 [55.8 kB]
  1745. Get:67 http://ftpmaster.internal/ubuntu xenial/universe s390x python3-requests-toolbelt all 0.6.0-2 [31.6 kB]
  1746. Get:68 http://ftpmaster.internal/ubuntu xenial/universe s390x python3-requests-unixsocket all 0.1.5-0ubuntu4 [6560 B]
  1747. Get:69 http://ftpmaster.internal/ubuntu xenial/main s390x python3-setuptools all 20.7.0-1 [88.0 kB]
  1748. Get:70 http://ftpmaster.internal/ubuntu xenial/main s390x python3-simplejson s390x 3.8.1-1ubuntu2 [48.0 kB]
  1749. Get:71 http://ftpmaster.internal/ubuntu xenial/universe s390x python3-tabulate all 0.7.5-1 [23.8 kB]
  1750. Get:72 http://ftpmaster.internal/ubuntu xenial/main s390x python3-xdg all 0.25-4 [31.5 kB]
  1751. Get:73 http://ftpmaster.internal/ubuntu xenial/main s390x python3-yaml s390x 3.11-3build1 [85.4 kB]
  1752. Get:74 http://ftpmaster.internal/ubuntu xenial-updates/main s390x squashfs-tools s390x 1:4.3-3ubuntu2.16.04.3 [107 kB]
  1753. Get:75 http://ftpmaster.internal/ubuntu xenial-updates/main s390x snapd s390x 2.34.2 [12.3 MB]
  1754. Get:76 http://ftpmaster.internal/ubuntu xenial-updates/universe s390x squashfuse s390x 0.1.100-0ubuntu1~ubuntu16.04.1 [17.1 kB]
  1755. Get:77 http://ftpmaster.internal/ubuntu xenial/universe s390x xdelta3 s390x 3.0.8-dfsg-1ubuntu2 [66.1 kB]
  1756. Get:78 http://ftpmaster.internal/ubuntu xenial/universe s390x python3-pyelftools all 0.23-2 [67.4 kB]
  1757. Get:79 http://ftpmaster.internal/ubuntu xenial-updates/universe s390x snapcraft all 2.43.1 [216 kB]
  1758. Get:80 http://ftpmaster.internal/ubuntu xenial/universe s390x socat s390x 1.7.3.1-1 [321 kB]
  1759. debconf: delaying package configuration, since apt-utils is not installed
  1760. Fetched 39.0 MB in 0s (64.9 MB/s)
  1761. Selecting previously unselected package libpython3.5-minimal:s390x.
  1762. (Reading database ...
  1763. (Reading database ... 5%
  1764. (Reading database ... 10%
  1765. (Reading database ... 15%
  1766. (Reading database ... 20%
  1767. (Reading database ... 25%
  1768. (Reading database ... 30%
  1769. (Reading database ... 35%
  1770. (Reading database ... 40%
  1771. (Reading database ... 45%
  1772. (Reading database ... 50%
  1773. (Reading database ... 55%
  1774. (Reading database ... 60%
  1775. (Reading database ... 65%
  1776. (Reading database ... 70%
  1777. (Reading database ... 75%
  1778. (Reading database ... 80%
  1779. (Reading database ... 85%
  1780. (Reading database ... 90%
  1781. (Reading database ... 95%
  1782. (Reading database ... 100%
  1783. (Reading database ... 11895 files and directories currently installed.)
  1784. Preparing to unpack .../libpython3.5-minimal_3.5.2-2ubuntu0~16.04.5_s390x.deb ...
  1785. Unpacking libpython3.5-minimal:s390x (3.5.2-2ubuntu0~16.04.5) ...
  1786. Selecting previously unselected package libexpat1:s390x.
  1787. Preparing to unpack .../libexpat1_2.1.0-7ubuntu0.16.04.3_s390x.deb ...
  1788. Unpacking libexpat1:s390x (2.1.0-7ubuntu0.16.04.3) ...
  1789. Selecting previously unselected package python3.5-minimal.
  1790. Preparing to unpack .../python3.5-minimal_3.5.2-2ubuntu0~16.04.5_s390x.deb ...
  1791. Unpacking python3.5-minimal (3.5.2-2ubuntu0~16.04.5) ...
  1792. Selecting previously unselected package python3-minimal.
  1793. Preparing to unpack .../python3-minimal_3.5.1-3_s390x.deb ...
  1794. Unpacking python3-minimal (3.5.1-3) ...
  1795. Selecting previously unselected package mime-support.
  1796. Preparing to unpack .../mime-support_3.59ubuntu1_all.deb ...
  1797. Unpacking mime-support (3.59ubuntu1) ...
  1798. Selecting previously unselected package libmpdec2:s390x.
  1799. Preparing to unpack .../libmpdec2_2.4.2-1_s390x.deb ...
  1800. Unpacking libmpdec2:s390x (2.4.2-1) ...
  1801. Selecting previously unselected package libpython3.5-stdlib:s390x.
  1802. Preparing to unpack .../libpython3.5-stdlib_3.5.2-2ubuntu0~16.04.5_s390x.deb ...
  1803. Unpacking libpython3.5-stdlib:s390x (3.5.2-2ubuntu0~16.04.5) ...
  1804. Selecting previously unselected package python3.5.
  1805. Preparing to unpack .../python3.5_3.5.2-2ubuntu0~16.04.5_s390x.deb ...
  1806. Unpacking python3.5 (3.5.2-2ubuntu0~16.04.5) ...
  1807. Selecting previously unselected package libpython3-stdlib:s390x.
  1808. Preparing to unpack .../libpython3-stdlib_3.5.1-3_s390x.deb ...
  1809. Unpacking libpython3-stdlib:s390x (3.5.1-3) ...
  1810. Selecting previously unselected package dh-python.
  1811. Preparing to unpack .../dh-python_2.20151103ubuntu1.1_all.deb ...
  1812. Unpacking dh-python (2.20151103ubuntu1.1) ...
  1813. Processing triggers for libc-bin (2.23-0ubuntu10) ...
  1814. Setting up libpython3.5-minimal:s390x (3.5.2-2ubuntu0~16.04.5) ...
  1815. Setting up libexpat1:s390x (2.1.0-7ubuntu0.16.04.3) ...
  1816. Setting up python3.5-minimal (3.5.2-2ubuntu0~16.04.5) ...
  1817. Setting up python3-minimal (3.5.1-3) ...
  1818. Processing triggers for libc-bin (2.23-0ubuntu10) ...
  1819. Selecting previously unselected package python3.
  1820. (Reading database ...
  1821. (Reading database ... 5%
  1822. (Reading database ... 10%
  1823. (Reading database ... 15%
  1824. (Reading database ... 20%
  1825. (Reading database ... 25%
  1826. (Reading database ... 30%
  1827. (Reading database ... 35%
  1828. (Reading database ... 40%
  1829. (Reading database ... 45%
  1830. (Reading database ... 50%
  1831. (Reading database ... 55%
  1832. (Reading database ... 60%
  1833. (Reading database ... 65%
  1834. (Reading database ... 70%
  1835. (Reading database ... 75%
  1836. (Reading database ... 80%
  1837. (Reading database ... 85%
  1838. (Reading database ... 90%
  1839. (Reading database ... 95%
  1840. (Reading database ... 100%
  1841. (Reading database ... 12846 files and directories currently installed.)
  1842. Preparing to unpack .../python3_3.5.1-3_s390x.deb ...
  1843. Unpacking python3 (3.5.1-3) ...
  1844. Selecting previously unselected package udev.
  1845. Preparing to unpack .../udev_229-4ubuntu21.10_s390x.deb ...
  1846. Unpacking udev (229-4ubuntu21.10) ...
  1847. Selecting previously unselected package libpython2.7-minimal:s390x.
  1848. Preparing to unpack .../libpython2.7-minimal_2.7.12-1ubuntu0~16.04.4_s390x.deb ...
  1849. Unpacking libpython2.7-minimal:s390x (2.7.12-1ubuntu0~16.04.4) ...
  1850. Selecting previously unselected package python2.7-minimal.
  1851. Preparing to unpack .../python2.7-minimal_2.7.12-1ubuntu0~16.04.4_s390x.deb ...
  1852. Unpacking python2.7-minimal (2.7.12-1ubuntu0~16.04.4) ...
  1853. Selecting previously unselected package python-minimal.
  1854. Preparing to unpack .../python-minimal_2.7.12-1~16.04_s390x.deb ...
  1855. Unpacking python-minimal (2.7.12-1~16.04) ...
  1856. Selecting previously unselected package libpython2.7-stdlib:s390x.
  1857. Preparing to unpack .../libpython2.7-stdlib_2.7.12-1ubuntu0~16.04.4_s390x.deb ...
  1858. Unpacking libpython2.7-stdlib:s390x (2.7.12-1ubuntu0~16.04.4) ...
  1859. Selecting previously unselected package python2.7.
  1860. Preparing to unpack .../python2.7_2.7.12-1ubuntu0~16.04.4_s390x.deb ...
  1861. Unpacking python2.7 (2.7.12-1ubuntu0~16.04.4) ...
  1862. Selecting previously unselected package libpython-stdlib:s390x.
  1863. Preparing to unpack .../libpython-stdlib_2.7.12-1~16.04_s390x.deb ...
  1864. Unpacking libpython-stdlib:s390x (2.7.12-1~16.04) ...
  1865. Processing triggers for systemd (229-4ubuntu21.10) ...
  1866. Setting up libpython2.7-minimal:s390x (2.7.12-1ubuntu0~16.04.4) ...
  1867. Setting up python2.7-minimal (2.7.12-1ubuntu0~16.04.4) ...
  1868. Linking and byte-compiling packages for runtime python2.7...
  1869. Setting up python-minimal (2.7.12-1~16.04) ...
  1870. Selecting previously unselected package python.
  1871. (Reading database ...
  1872. (Reading database ... 5%
  1873. (Reading database ... 10%
  1874. (Reading database ... 15%
  1875. (Reading database ... 20%
  1876. (Reading database ... 25%
  1877. (Reading database ... 30%
  1878. (Reading database ... 35%
  1879. (Reading database ... 40%
  1880. (Reading database ... 45%
  1881. (Reading database ... 50%
  1882. (Reading database ... 55%
  1883. (Reading database ... 60%
  1884. (Reading database ... 65%
  1885. (Reading database ... 70%
  1886. (Reading database ... 75%
  1887. (Reading database ... 80%
  1888. (Reading database ... 85%
  1889. (Reading database ... 90%
  1890. (Reading database ... 95%
  1891. (Reading database ... 100%
  1892. (Reading database ... 13713 files and directories currently installed.)
  1893. Preparing to unpack .../python_2.7.12-1~16.04_s390x.deb ...
  1894. Unpacking python (2.7.12-1~16.04) ...
  1895. Selecting previously unselected package libapt-inst2.0:s390x.
  1896. Preparing to unpack .../libapt-inst2.0_1.2.29_s390x.deb ...
  1897. Unpacking libapt-inst2.0:s390x (1.2.29) ...
  1898. Selecting previously unselected package libbsd0:s390x.
  1899. Preparing to unpack .../libbsd0_0.8.2-1_s390x.deb ...
  1900. Unpacking libbsd0:s390x (0.8.2-1) ...
  1901. Selecting previously unselected package sudo.
  1902. Preparing to unpack .../sudo_1.8.16-0ubuntu1.5_s390x.deb ...
  1903. Unpacking sudo (1.8.16-0ubuntu1.5) ...
  1904. Selecting previously unselected package libapparmor-perl.
  1905. Preparing to unpack .../libapparmor-perl_2.10.95-0ubuntu2.10_s390x.deb ...
  1906. Unpacking libapparmor-perl (2.10.95-0ubuntu2.10) ...
  1907. Selecting previously unselected package apparmor.
  1908. Preparing to unpack .../apparmor_2.10.95-0ubuntu2.10_s390x.deb ...
  1909. Unpacking apparmor (2.10.95-0ubuntu2.10) ...
  1910. Selecting previously unselected package libfuse2:s390x.
  1911. Preparing to unpack .../libfuse2_2.9.4-1ubuntu3.1_s390x.deb ...
  1912. Unpacking libfuse2:s390x (2.9.4-1ubuntu3.1) ...
  1913. Selecting previously unselected package fuse.
  1914. Preparing to unpack .../fuse_2.9.4-1ubuntu3.1_s390x.deb ...
  1915. Unpacking fuse (2.9.4-1ubuntu3.1) ...
  1916. Selecting previously unselected package libedit2:s390x.
  1917. Preparing to unpack .../libedit2_3.1-20150325-1ubuntu2_s390x.deb ...
  1918. Unpacking libedit2:s390x (3.1-20150325-1ubuntu2) ...
  1919. Selecting previously unselected package libelf1:s390x.
  1920. Preparing to unpack .../libelf1_0.165-3ubuntu1.1_s390x.deb ...
  1921. Unpacking libelf1:s390x (0.165-3ubuntu1.1) ...
  1922. Selecting previously unselected package libicu55:s390x.
  1923. Preparing to unpack .../libicu55_55.1-7ubuntu0.4_s390x.deb ...
  1924. Unpacking libicu55:s390x (55.1-7ubuntu0.4) ...
  1925. Selecting previously unselected package libxml2:s390x.
  1926. Preparing to unpack .../libxml2_2.9.3+dfsg1-1ubuntu0.6_s390x.deb ...
  1927. Unpacking libxml2:s390x (2.9.3+dfsg1-1ubuntu0.6) ...
  1928. Selecting previously unselected package openssh-client.
  1929. Preparing to unpack .../openssh-client_1%3a7.2p2-4ubuntu2.6_s390x.deb ...
  1930. Unpacking openssh-client (1:7.2p2-4ubuntu2.6) ...
  1931. Selecting previously unselected package python-apt-common.
  1932. Preparing to unpack .../python-apt-common_1.1.0~beta1ubuntu0.16.04.2_all.deb ...
  1933. Unpacking python-apt-common (1.1.0~beta1ubuntu0.16.04.2) ...
  1934. Selecting previously unselected package python3-apt.
  1935. Preparing to unpack .../python3-apt_1.1.0~beta1ubuntu0.16.04.2_s390x.deb ...
  1936. Unpacking python3-apt (1.1.0~beta1ubuntu0.16.04.2) ...
  1937. Selecting previously unselected package execstack.
  1938. Preparing to unpack .../execstack_0.0.20130503-1.1_s390x.deb ...
  1939. Unpacking execstack (0.0.20130503-1.1) ...
  1940. Selecting previously unselected package liberror-perl.
  1941. Preparing to unpack .../liberror-perl_0.17-1.2_all.deb ...
  1942. Unpacking liberror-perl (0.17-1.2) ...
  1943. Selecting previously unselected package git-man.
  1944. Preparing to unpack .../git-man_1%3a2.7.4-0ubuntu1.6_all.deb ...
  1945. Unpacking git-man (1:2.7.4-0ubuntu1.6) ...
  1946. Selecting previously unselected package git.
  1947. Preparing to unpack .../git_1%3a2.7.4-0ubuntu1.6_s390x.deb ...
  1948. Unpacking git (1:2.7.4-0ubuntu1.6) ...
  1949. Selecting previously unselected package liblzo2-2:s390x.
  1950. Preparing to unpack .../liblzo2-2_2.08-1.2_s390x.deb ...
  1951. Unpacking liblzo2-2:s390x (2.08-1.2) ...
  1952. Selecting previously unselected package libsodium18:s390x.
  1953. Preparing to unpack .../libsodium18_1.0.8-5_s390x.deb ...
  1954. Unpacking libsodium18:s390x (1.0.8-5) ...
  1955. Selecting previously unselected package libwrap0:s390x.
  1956. Preparing to unpack .../libwrap0_7.6.q-25_s390x.deb ...
  1957. Unpacking libwrap0:s390x (7.6.q-25) ...
  1958. Selecting previously unselected package libxslt1.1:s390x.
  1959. Preparing to unpack .../libxslt1.1_1.1.28-2.1ubuntu0.1_s390x.deb ...
  1960. Unpacking libxslt1.1:s390x (1.1.28-2.1ubuntu0.1) ...
  1961. Selecting previously unselected package libyaml-0-2:s390x.
  1962. Preparing to unpack .../libyaml-0-2_0.1.6-3_s390x.deb ...
  1963. Unpacking libyaml-0-2:s390x (0.1.6-3) ...
  1964. Selecting previously unselected package patchelf.
  1965. Preparing to unpack .../patchelf_0.9-1~ubuntu16.04.1_s390x.deb ...
  1966. Unpacking patchelf (0.9-1~ubuntu16.04.1) ...
  1967. Selecting previously unselected package python-pkg-resources.
  1968. Preparing to unpack .../python-pkg-resources_20.7.0-1_all.deb ...
  1969. Unpacking python-pkg-resources (20.7.0-1) ...
  1970. Selecting previously unselected package python-chardet.
  1971. Preparing to unpack .../python-chardet_2.3.0-2_all.deb ...
  1972. Unpacking python-chardet (2.3.0-2) ...
  1973. Selecting previously unselected package python-six.
  1974. Preparing to unpack .../python-six_1.10.0-3_all.deb ...
  1975. Unpacking python-six (1.10.0-3) ...
  1976. Selecting previously unselected package python-urllib3.
  1977. Preparing to unpack .../python-urllib3_1.13.1-2ubuntu0.16.04.2_all.deb ...
  1978. Unpacking python-urllib3 (1.13.1-2ubuntu0.16.04.2) ...
  1979. Selecting previously unselected package python-requests.
  1980. Preparing to unpack .../python-requests_2.9.1-3ubuntu0.1_all.deb ...
  1981. Unpacking python-requests (2.9.1-3ubuntu0.1) ...
  1982. Selecting previously unselected package python3-pkg-resources.
  1983. Preparing to unpack .../python3-pkg-resources_20.7.0-1_all.deb ...
  1984. Unpacking python3-pkg-resources (20.7.0-1) ...
  1985. Selecting previously unselected package python3-chardet.
  1986. Preparing to unpack .../python3-chardet_2.3.0-2_all.deb ...
  1987. Unpacking python3-chardet (2.3.0-2) ...
  1988. Selecting previously unselected package python3-colorama.
  1989. Preparing to unpack .../python3-colorama_0.3.7-1_all.deb ...
  1990. Unpacking python3-colorama (0.3.7-1) ...
  1991. Selecting previously unselected package python3-click.
  1992. Preparing to unpack .../python3-click_6.2-2ubuntu1_all.deb ...
  1993. Unpacking python3-click (6.2-2ubuntu1) ...
  1994. Selecting previously unselected package python3-crypto.
  1995. Preparing to unpack .../python3-crypto_2.6.1-6ubuntu0.16.04.3_s390x.deb ...
  1996. Unpacking python3-crypto (2.6.1-6ubuntu0.16.04.3) ...
  1997. Selecting previously unselected package python3-six.
  1998. Preparing to unpack .../python3-six_1.10.0-3_all.deb ...
  1999. Unpacking python3-six (1.10.0-3) ...
  2000. Selecting previously unselected package python3-debian.
  2001. Preparing to unpack .../python3-debian_0.1.27ubuntu2_all.deb ...
  2002. Unpacking python3-debian (0.1.27ubuntu2) ...
  2003. Selecting previously unselected package python3-ecdsa.
  2004. Preparing to unpack .../python3-ecdsa_0.13-2_all.deb ...
  2005. Unpacking python3-ecdsa (0.13-2) ...
  2006. Selecting previously unselected package python3-jsonschema.
  2007. Preparing to unpack .../python3-jsonschema_2.5.1-4_all.deb ...
  2008. Unpacking python3-jsonschema (2.5.1-4) ...
  2009. Selecting previously unselected package python3-libnacl.
  2010. Preparing to unpack .../python3-libnacl_1.4.5-0ubuntu1_all.deb ...
  2011. Unpacking python3-libnacl (1.4.5-0ubuntu1) ...
  2012. Selecting previously unselected package python3-lxml.
  2013. Preparing to unpack .../python3-lxml_3.5.0-1ubuntu0.1_s390x.deb ...
  2014. Unpacking python3-lxml (3.5.0-1ubuntu0.1) ...
  2015. Selecting previously unselected package python3-paramiko.
  2016. Preparing to unpack .../python3-paramiko_1.16.0-1ubuntu0.2_all.deb ...
  2017. Unpacking python3-paramiko (1.16.0-1ubuntu0.2) ...
  2018. Selecting previously unselected package python3-petname.
  2019. Preparing to unpack .../python3-petname_2.0-0ubuntu1~16.04_all.deb ...
  2020. Unpacking python3-petname (2.0-0ubuntu1~16.04) ...
  2021. Selecting previously unselected package python3-progressbar.
  2022. Preparing to unpack .../python3-progressbar_2.3-2_all.deb ...
  2023. Unpacking python3-progressbar (2.3-2) ...
  2024. Selecting previously unselected package python3-pymacaroons.
  2025. Preparing to unpack .../python3-pymacaroons_0.9.2-0ubuntu1_all.deb ...
  2026. Unpacking python3-pymacaroons (0.9.2-0ubuntu1) ...
  2027. Selecting previously unselected package python3-pysha3.
  2028. Preparing to unpack .../python3-pysha3_1.0.0-0ubuntu1~ubuntu16.04.1_s390x.deb ...
  2029. Unpacking python3-pysha3 (1.0.0-0ubuntu1~ubuntu16.04.1) ...
  2030. Selecting previously unselected package python3-urllib3.
  2031. Preparing to unpack .../python3-urllib3_1.13.1-2ubuntu0.16.04.2_all.deb ...
  2032. Unpacking python3-urllib3 (1.13.1-2ubuntu0.16.04.2) ...
  2033. Selecting previously unselected package python3-requests.
  2034. Preparing to unpack .../python3-requests_2.9.1-3ubuntu0.1_all.deb ...
  2035. Unpacking python3-requests (2.9.1-3ubuntu0.1) ...
  2036. Selecting previously unselected package python3-requests-toolbelt.
  2037. Preparing to unpack .../python3-requests-toolbelt_0.6.0-2_all.deb ...
  2038. Unpacking python3-requests-toolbelt (0.6.0-2) ...
  2039. Selecting previously unselected package python3-requests-unixsocket.
  2040. Preparing to unpack .../python3-requests-unixsocket_0.1.5-0ubuntu4_all.deb ...
  2041. Unpacking python3-requests-unixsocket (0.1.5-0ubuntu4) ...
  2042. Selecting previously unselected package python3-setuptools.
  2043. Preparing to unpack .../python3-setuptools_20.7.0-1_all.deb ...
  2044. Unpacking python3-setuptools (20.7.0-1) ...
  2045. Selecting previously unselected package python3-simplejson.
  2046. Preparing to unpack .../python3-simplejson_3.8.1-1ubuntu2_s390x.deb ...
  2047. Unpacking python3-simplejson (3.8.1-1ubuntu2) ...
  2048. Selecting previously unselected package python3-tabulate.
  2049. Preparing to unpack .../python3-tabulate_0.7.5-1_all.deb ...
  2050. Unpacking python3-tabulate (0.7.5-1) ...
  2051. Selecting previously unselected package python3-xdg.
  2052. Preparing to unpack .../python3-xdg_0.25-4_all.deb ...
  2053. Unpacking python3-xdg (0.25-4) ...
  2054. Selecting previously unselected package python3-yaml.
  2055. Preparing to unpack .../python3-yaml_3.11-3build1_s390x.deb ...
  2056. Unpacking python3-yaml (3.11-3build1) ...
  2057. Selecting previously unselected package squashfs-tools.
  2058. Preparing to unpack .../squashfs-tools_1%3a4.3-3ubuntu2.16.04.3_s390x.deb ...
  2059. Unpacking squashfs-tools (1:4.3-3ubuntu2.16.04.3) ...
  2060. Selecting previously unselected package snapd.
  2061. Preparing to unpack .../snapd_2.34.2_s390x.deb ...
  2062. Unpacking snapd (2.34.2) ...
  2063. Selecting previously unselected package squashfuse.
  2064. Preparing to unpack .../squashfuse_0.1.100-0ubuntu1~ubuntu16.04.1_s390x.deb ...
  2065. Unpacking squashfuse (0.1.100-0ubuntu1~ubuntu16.04.1) ...
  2066. Selecting previously unselected package xdelta3.
  2067. Preparing to unpack .../xdelta3_3.0.8-dfsg-1ubuntu2_s390x.deb ...
  2068. Unpacking xdelta3 (3.0.8-dfsg-1ubuntu2) ...
  2069. Selecting previously unselected package python3-pyelftools.
  2070. Preparing to unpack .../python3-pyelftools_0.23-2_all.deb ...
  2071. Unpacking python3-pyelftools (0.23-2) ...
  2072. Selecting previously unselected package snapcraft.
  2073. Preparing to unpack .../snapcraft_2.43.1_all.deb ...
  2074. Unpacking snapcraft (2.43.1) ...
  2075. Selecting previously unselected package socat.
  2076. Preparing to unpack .../socat_1.7.3.1-1_s390x.deb ...
  2077. Unpacking socat (1.7.3.1-1) ...
  2078. Processing triggers for libc-bin (2.23-0ubuntu10) ...
  2079. Processing triggers for systemd (229-4ubuntu21.10) ...
  2080. Setting up mime-support (3.59ubuntu1) ...
  2081. Setting up libmpdec2:s390x (2.4.2-1) ...
  2082. Setting up libpython3.5-stdlib:s390x (3.5.2-2ubuntu0~16.04.5) ...
  2083. Setting up python3.5 (3.5.2-2ubuntu0~16.04.5) ...
  2084. Setting up libpython3-stdlib:s390x (3.5.1-3) ...
  2085. Setting up udev (229-4ubuntu21.10) ...
  2086. addgroup: The group `input' already exists as a system group. Exiting.
  2087. Setting up libpython2.7-stdlib:s390x (2.7.12-1ubuntu0~16.04.4) ...
  2088. Setting up python2.7 (2.7.12-1ubuntu0~16.04.4) ...
  2089. Setting up libpython-stdlib:s390x (2.7.12-1~16.04) ...
  2090. Setting up python (2.7.12-1~16.04) ...
  2091. Setting up libapt-inst2.0:s390x (1.2.29) ...
  2092. Setting up libbsd0:s390x (0.8.2-1) ...
  2093. Setting up sudo (1.8.16-0ubuntu1.5) ...
  2094. Setting up libapparmor-perl (2.10.95-0ubuntu2.10) ...
  2095. Setting up libfuse2:s390x (2.9.4-1ubuntu3.1) ...
  2096. Setting up fuse (2.9.4-1ubuntu3.1) ...
  2097. Setting up libedit2:s390x (3.1-20150325-1ubuntu2) ...
  2098. Setting up libelf1:s390x (0.165-3ubuntu1.1) ...
  2099. Setting up libicu55:s390x (55.1-7ubuntu0.4) ...
  2100. Setting up libxml2:s390x (2.9.3+dfsg1-1ubuntu0.6) ...
  2101. Setting up openssh-client (1:7.2p2-4ubuntu2.6) ...
  2102. Setting up python-apt-common (1.1.0~beta1ubuntu0.16.04.2) ...
  2103. Setting up execstack (0.0.20130503-1.1) ...
  2104. Setting up liberror-perl (0.17-1.2) ...
  2105. Setting up git-man (1:2.7.4-0ubuntu1.6) ...
  2106. Setting up git (1:2.7.4-0ubuntu1.6) ...
  2107. Setting up liblzo2-2:s390x (2.08-1.2) ...
  2108. Setting up libsodium18:s390x (1.0.8-5) ...
  2109. Setting up libwrap0:s390x (7.6.q-25) ...
  2110. Setting up libxslt1.1:s390x (1.1.28-2.1ubuntu0.1) ...
  2111. Setting up libyaml-0-2:s390x (0.1.6-3) ...
  2112. Setting up patchelf (0.9-1~ubuntu16.04.1) ...
  2113. Setting up python-pkg-resources (20.7.0-1) ...
  2114. Setting up python-chardet (2.3.0-2) ...
  2115. Setting up python-six (1.10.0-3) ...
  2116. Setting up python-urllib3 (1.13.1-2ubuntu0.16.04.2) ...
  2117. Setting up python-requests (2.9.1-3ubuntu0.1) ...
  2118. Setting up squashfs-tools (1:4.3-3ubuntu2.16.04.3) ...
  2119. Setting up squashfuse (0.1.100-0ubuntu1~ubuntu16.04.1) ...
  2120. Setting up xdelta3 (3.0.8-dfsg-1ubuntu2) ...
  2121. Setting up socat (1.7.3.1-1) ...
  2122. Setting up python3 (3.5.1-3) ...
  2123. running python rtupdate hooks for python3.5...
  2124. running python post-rtupdate hooks for python3.5...
  2125. Setting up apparmor (2.10.95-0ubuntu2.10) ...
  2126. update-rc.d: warning: start and stop actions are no longer supported; falling back to defaults
  2127. Warning from stdin (line 1): /sbin/apparmor_parser: cannot use or update cache, disable, or force-complain via stdin
  2128. Warning failed to create cache: (null)
  2129. diff: /var/lib/apparmor/profiles/.apparmor.md5sums: No such file or directory
  2130. Setting up python3-apt (1.1.0~beta1ubuntu0.16.04.2) ...
  2131. Setting up python3-pkg-resources (20.7.0-1) ...
  2132. Setting up python3-chardet (2.3.0-2) ...
  2133. Setting up python3-colorama (0.3.7-1) ...
  2134. Setting up python3-click (6.2-2ubuntu1) ...
  2135. Setting up python3-crypto (2.6.1-6ubuntu0.16.04.3) ...
  2136. Setting up python3-six (1.10.0-3) ...
  2137. Setting up python3-debian (0.1.27ubuntu2) ...
  2138. Setting up python3-ecdsa (0.13-2) ...
  2139. Setting up python3-jsonschema (2.5.1-4) ...
  2140. update-alternatives: using /usr/bin/python3-jsonschema to provide /usr/bin/jsonschema (jsonschema) in auto mode
  2141. Setting up python3-libnacl (1.4.5-0ubuntu1) ...
  2142. Setting up python3-lxml (3.5.0-1ubuntu0.1) ...
  2143. Setting up python3-paramiko (1.16.0-1ubuntu0.2) ...
  2144. Setting up python3-petname (2.0-0ubuntu1~16.04) ...
  2145. Setting up python3-progressbar (2.3-2) ...
  2146. Setting up python3-pymacaroons (0.9.2-0ubuntu1) ...
  2147. Setting up python3-pysha3 (1.0.0-0ubuntu1~ubuntu16.04.1) ...
  2148. Setting up python3-urllib3 (1.13.1-2ubuntu0.16.04.2) ...
  2149. Setting up python3-requests (2.9.1-3ubuntu0.1) ...
  2150. Setting up python3-requests-toolbelt (0.6.0-2) ...
  2151. Setting up python3-requests-unixsocket (0.1.5-0ubuntu4) ...
  2152. Setting up python3-setuptools (20.7.0-1) ...
  2153. Setting up python3-simplejson (3.8.1-1ubuntu2) ...
  2154. Setting up python3-tabulate (0.7.5-1) ...
  2155. Setting up python3-xdg (0.25-4) ...
  2156. Setting up python3-yaml (3.11-3build1) ...
  2157. Setting up snapd (2.34.2) ...
  2158. deb-systemd-invoke only supports /usr/sbin/policy-rc.d return code 101 and 104!
  2159. Got return code 0, ignoring.
  2160. deb-systemd-invoke only supports /usr/sbin/policy-rc.d return code 101 and 104!
  2161. Got return code 0, ignoring.
  2162. deb-systemd-invoke only supports /usr/sbin/policy-rc.d return code 101 and 104!
  2163. Got return code 0, ignoring.
  2164. deb-systemd-invoke only supports /usr/sbin/policy-rc.d return code 101 and 104!
  2165. Got return code 0, ignoring.
  2166. deb-systemd-invoke only supports /usr/sbin/policy-rc.d return code 101 and 104!
  2167. Got return code 0, ignoring.
  2168. deb-systemd-invoke only supports /usr/sbin/policy-rc.d return code 101 and 104!
  2169. Got return code 0, ignoring.
  2170. deb-systemd-invoke only supports /usr/sbin/policy-rc.d return code 101 and 104!
  2171. Got return code 0, ignoring.
  2172. deb-systemd-invoke only supports /usr/sbin/policy-rc.d return code 101 and 104!
  2173. Got return code 0, ignoring.
  2174. snapd.snap-repair.service is a disabled or a static unit, not starting it.
  2175. Setting up python3-pyelftools (0.23-2) ...
  2176. Setting up snapcraft (2.43.1) ...
  2177. Setting up dh-python (2.20151103ubuntu1.1) ...
  2178. Processing triggers for libc-bin (2.23-0ubuntu10) ...
  2179. Processing triggers for systemd (229-4ubuntu21.10) ...
  2180. /usr/lib/python2.7/dist-packages/pylxd/model.py:116: UserWarning: Attempted to set unknown attribute "description" on instance of "Container"
  2181.   key, self.__class__.__name__
  2182. Running repo phase...
  2183. Cloning into 'yorokobi'...
  2184. [10/Jan/2019:20:39:46 +0000] "CONNECT github.com:443 HTTP/1.1" 200 72516 "-" "git/2.7.4"
  2185. Running pull phase...
  2186. Installing build dependencies: libexpat1-dev libpython3-dev libpython3.5 libpython3.5-dev python-pip-whl python3-dev python3-pip python3.5-dev
  2187. Reading package lists...
  2188. Building dependency tree...
  2189. Reading state information...
  2190. Recommended packages:
  2191.   python3-wheel
  2192. The following NEW packages will be installed:
  2193.   libexpat1-dev libpython3-dev libpython3.5 libpython3.5-dev python-pip-whl
  2194.   python3-dev python3-pip python3.5-dev
  2195. 0 upgraded, 8 newly installed, 0 to remove and 0 not upgraded.
  2196. Need to get 40.2 MB of archives.
  2197. After this operation, 61.1 MB of additional disk space will be used.
  2198. Get:1 http://ftpmaster.internal/ubuntu xenial-security/main s390x libexpat1-dev s390x 2.1.0-7ubuntu0.16.04.3 [118 kB]
  2199. Get:2 http://ftpmaster.internal/ubuntu xenial-security/main s390x libpython3.5 s390x 3.5.2-2ubuntu0~16.04.5 [1279 kB]
  2200. Get:3 http://ftpmaster.internal/ubuntu xenial-security/main s390x libpython3.5-dev s390x 3.5.2-2ubuntu0~16.04.5 [37.1 MB]
  2201. Get:4 http://ftpmaster.internal/ubuntu xenial/main s390x libpython3-dev s390x 3.5.1-3 [6916 B]
  2202. Get:5 http://ftpmaster.internal/ubuntu xenial-updates/universe s390x python-pip-whl all 8.1.1-2ubuntu0.4 [1110 kB]
  2203. Get:6 http://ftpmaster.internal/ubuntu xenial-security/main s390x python3.5-dev s390x 3.5.2-2ubuntu0~16.04.5 [413 kB]
  2204. Get:7 http://ftpmaster.internal/ubuntu xenial/main s390x python3-dev s390x 3.5.1-3 [1188 B]
  2205. Get:8 http://ftpmaster.internal/ubuntu xenial-updates/universe s390x python3-pip all 8.1.1-2ubuntu0.4 [109 kB]
  2206. debconf: delaying package configuration, since apt-utils is not installed
  2207. Fetched 40.2 MB in 0s (73.5 MB/s)
  2208. Selecting previously unselected package libexpat1-dev:s390x.
  2209. (Reading database ...
  2210. (Reading database ... 5%
  2211. (Reading database ... 10%
  2212. (Reading database ... 15%
  2213. (Reading database ... 20%
  2214. (Reading database ... 25%
  2215. (Reading database ... 30%
  2216. (Reading database ... 35%
  2217. (Reading database ... 40%
  2218. (Reading database ... 45%
  2219. (Reading database ... 50%
  2220. (Reading database ... 55%
  2221. (Reading database ... 60%
  2222. (Reading database ... 65%
  2223. (Reading database ... 70%
  2224. (Reading database ... 75%
  2225. (Reading database ... 80%
  2226. (Reading database ... 85%
  2227. (Reading database ... 90%
  2228. (Reading database ... 95%
  2229. (Reading database ... 100%
  2230. (Reading database ... 16498 files and directories currently installed.)
  2231. Preparing to unpack .../libexpat1-dev_2.1.0-7ubuntu0.16.04.3_s390x.deb ...
  2232. Unpacking libexpat1-dev:s390x (2.1.0-7ubuntu0.16.04.3) ...
  2233. Selecting previously unselected package libpython3.5:s390x.
  2234. Preparing to unpack .../libpython3.5_3.5.2-2ubuntu0~16.04.5_s390x.deb ...
  2235. Unpacking libpython3.5:s390x (3.5.2-2ubuntu0~16.04.5) ...
  2236. Selecting previously unselected package libpython3.5-dev:s390x.
  2237. Preparing to unpack .../libpython3.5-dev_3.5.2-2ubuntu0~16.04.5_s390x.deb ...
  2238. Unpacking libpython3.5-dev:s390x (3.5.2-2ubuntu0~16.04.5) ...
  2239. Selecting previously unselected package libpython3-dev:s390x.
  2240. Preparing to unpack .../libpython3-dev_3.5.1-3_s390x.deb ...
  2241. Unpacking libpython3-dev:s390x (3.5.1-3) ...
  2242. Selecting previously unselected package python-pip-whl.
  2243. Preparing to unpack .../python-pip-whl_8.1.1-2ubuntu0.4_all.deb ...
  2244. Unpacking python-pip-whl (8.1.1-2ubuntu0.4) ...
  2245. Selecting previously unselected package python3.5-dev.
  2246. Preparing to unpack .../python3.5-dev_3.5.2-2ubuntu0~16.04.5_s390x.deb ...
  2247. Unpacking python3.5-dev (3.5.2-2ubuntu0~16.04.5) ...
  2248. Selecting previously unselected package python3-dev.
  2249. Preparing to unpack .../python3-dev_3.5.1-3_s390x.deb ...
  2250. Unpacking python3-dev (3.5.1-3) ...
  2251. Selecting previously unselected package python3-pip.
  2252. Preparing to unpack .../python3-pip_8.1.1-2ubuntu0.4_all.deb ...
  2253. Unpacking python3-pip (8.1.1-2ubuntu0.4) ...
  2254. Processing triggers for libc-bin (2.23-0ubuntu10) ...
  2255. Setting up libexpat1-dev:s390x (2.1.0-7ubuntu0.16.04.3) ...
  2256. Setting up libpython3.5:s390x (3.5.2-2ubuntu0~16.04.5) ...
  2257. Setting up libpython3.5-dev:s390x (3.5.2-2ubuntu0~16.04.5) ...
  2258. Setting up libpython3-dev:s390x (3.5.1-3) ...
  2259. Setting up python-pip-whl (8.1.1-2ubuntu0.4) ...
  2260. Setting up python3.5-dev (3.5.2-2ubuntu0~16.04.5) ...
  2261. Setting up python3-dev (3.5.1-3) ...
  2262. Setting up python3-pip (8.1.1-2ubuntu0.4) ...
  2263. Processing triggers for libc-bin (2.23-0ubuntu10) ...
  2264. libexpat1-dev set to automatically installed.
  2265. libpython3-dev set to automatically installed.
  2266. libpython3.5 set to automatically installed.
  2267. libpython3.5-dev set to automatically installed.
  2268. python-pip-whl set to automatically installed.
  2269. python3-dev set to automatically installed.
  2270. python3-pip set to automatically installed.
  2271. python3.5-dev set to automatically installed.
  2272. [10/Jan/2019:20:39:51 +0000] "GET http://ppa.launchpad.net/snappy-dev/tools/ubuntu/dists/xenial/InRelease HTTP/1.1" 200 18071 "-" "Debian APT-HTTP/1.3 (1.2.29)"
  2273. [10/Jan/2019:20:39:51 +0000] "GET http://ftpmaster.internal/ubuntu/dists/xenial/InRelease HTTP/1.1" 200 246846 "-" "Debian APT-HTTP/1.3 (1.2.29)"
  2274. [10/Jan/2019:20:39:51 +0000] "GET http://ppa.launchpad.net/snappy-dev/tools/ubuntu/dists/xenial/main/binary-s390x/by-hash/SHA256/7ea615402ca5d0ecaaceb72a6c7a0b0eed2b37788607665b0331978caa0ea651 HTTP/1.1" 200 692 "-" "Debian APT-HTTP/1.3 (1.2.29)"
  2275. [10/Jan/2019:20:39:51 +0000] "GET http://ppa.launchpad.net/snappy-dev/tools/ubuntu/dists/xenial/main/i18n/by-hash/SHA256/1445b19aae85d4a5fd16e52dbc8992b106c6ad765375f4b6c1a83ce889ed2279 HTTP/1.1" 200 496 "-" "Debian APT-HTTP/1.3 (1.2.29)"
  2276. [10/Jan/2019:20:39:51 +0000] "GET http://ftpmaster.internal/ubuntu/dists/xenial-security/InRelease HTTP/1.1" 200 106778 "-" "Debian APT-HTTP/1.3 (1.2.29)"
  2277. [10/Jan/2019:20:39:52 +0000] "GET http://ftpmaster.internal/ubuntu/dists/xenial-updates/InRelease HTTP/1.1" 200 109196 "-" "Debian APT-HTTP/1.3 (1.2.29)"
  2278. [10/Jan/2019:20:39:52 +0000] "GET http://ftpmaster.internal/ubuntu/dists/xenial/main/binary-s390x/by-hash/SHA256/ba7a526a22fec670ec9780f989f0cd7443d96c57927b2464d64f9daae1e64def HTTP/1.1" 200 1131768 "-" "Debian APT-HTTP/1.3 (1.2.29)"
  2279. [10/Jan/2019:20:39:53 +0000] "GET http://ftpmaster.internal/ubuntu/dists/xenial/main/i18n/by-hash/SHA256/f514e12580e59b8f6ae10801a91f14708bdead04db91aa20fe9e2c0384413c67 HTTP/1.1" 200 567552 "-" "Debian APT-HTTP/1.3 (1.2.29)"
  2280. [10/Jan/2019:20:39:53 +0000] "GET http://ftpmaster.internal/ubuntu/dists/xenial/restricted/i18n/by-hash/SHA256/02cbeba7eff7b00f22ee839e33219b7b9a2fd7ee2403e142cb4cdb93d116170b HTTP/1.1" 200 2908 "-" "Debian APT-HTTP/1.3 (1.2.29)"
  2281. [10/Jan/2019:20:39:54 +0000] "GET http://ftpmaster.internal/ubuntu/dists/xenial/universe/binary-s390x/by-hash/SHA256/2293540b7543e164967ba6812ecaf67aa345f974444c912f9429931aecbb7eaf HTTP/1.1" 200 7190340 "-" "Debian APT-HTTP/1.3 (1.2.29)"
  2282. [10/Jan/2019:20:39:55 +0000] "GET http://ftpmaster.internal/ubuntu/dists/xenial/universe/i18n/by-hash/SHA256/18dacc7ff138747cd23eaa7a6691e259ab48c1fbc7df219cf85e5891d8c6b0f8 HTTP/1.1" 200 4353988 "-" "Debian APT-HTTP/1.3 (1.2.29)"
  2283. [10/Jan/2019:20:39:55 +0000] "GET http://ftpmaster.internal/ubuntu/dists/xenial/multiverse/binary-s390x/by-hash/SHA256/681b4fd42f31771947f00f63978e09ec797b0136ad3aee44107fe1a8c7177e0d HTTP/1.1" 200 119420 "-" "Debian APT-HTTP/1.3 (1.2.29)"
  2284. [10/Jan/2019:20:39:55 +0000] "GET http://ftpmaster.internal/ubuntu/dists/xenial/multiverse/i18n/by-hash/SHA256/323f1839768b76c9184bd91f970b77a504920ea9c755925824e9e2aee705c696 HTTP/1.1" 200 106232 "-" "Debian APT-HTTP/1.3 (1.2.29)"
  2285. [10/Jan/2019:20:39:56 +0000] "GET http://ftpmaster.internal/ubuntu/dists/xenial-security/main/binary-s390x/by-hash/SHA256/5790645b603dc925dd6b16ff60bfdd3e46b3fa3bb25deef6f045242a9b952c9e HTTP/1.1" 200 413092 "-" "Debian APT-HTTP/1.3 (1.2.29)"
  2286. [10/Jan/2019:20:39:56 +0000] "GET http://ftpmaster.internal/ubuntu/dists/xenial-security/main/i18n/by-hash/SHA256/06ba66fadf517caafc02dbbe82a9cef3db40ed5b6b40e6c00788d6d2e2457655 HTTP/1.1" 200 247672 "-" "Debian APT-HTTP/1.3 (1.2.29)"
  2287. [10/Jan/2019:20:39:56 +0000] "GET http://ftpmaster.internal/ubuntu/dists/xenial-security/restricted/i18n/by-hash/SHA256/123a306d97d3144c2951938b2728e9331cbe4157e9335b88f95c39ab87568899 HTTP/1.1" 200 2152 "-" "Debian APT-HTTP/1.3 (1.2.29)"
  2288. [10/Jan/2019:20:39:57 +0000] "GET http://ftpmaster.internal/ubuntu/dists/xenial-security/universe/binary-s390x/by-hash/SHA256/192a4e81d8a7c7f1fc762d4e1c2e8a548d115adc120f96f26ffb62f019074578 HTTP/1.1" 200 320076 "-" "Debian APT-HTTP/1.3 (1.2.29)"
  2289. [10/Jan/2019:20:39:57 +0000] "GET http://ftpmaster.internal/ubuntu/dists/xenial-security/universe/i18n/by-hash/SHA256/171cd553888fcae9e589fb1d333b1ae3ca8adb852affb824a7e3f86d700e664d HTTP/1.1" 200 160812 "-" "Debian APT-HTTP/1.3 (1.2.29)"
  2290. [10/Jan/2019:20:39:57 +0000] "GET http://ftpmaster.internal/ubuntu/dists/xenial-security/multiverse/binary-s390x/by-hash/SHA256/2a165ab66362d8cd588f4fd3f69b1526ff3a7279054e6a5bd056d148b68aa04e HTTP/1.1" 200 936 "-" "Debian APT-HTTP/1.3 (1.2.29)"
  2291. [10/Jan/2019:20:39:57 +0000] "GET http://ftpmaster.internal/ubuntu/dists/xenial-security/multiverse/i18n/by-hash/SHA256/5e67ec9c5a1bc5302be70144371c014f4fda60fc30ee635fb93e2d25edf16f70 HTTP/1.1" 200 1844 "-" "Debian APT-HTTP/1.3 (1.2.29)"
  2292. [10/Jan/2019:20:39:58 +0000] "GET http://ftpmaster.internal/ubuntu/dists/xenial-updates/main/binary-s390x/by-hash/SHA256/63c6e1ae45011932456c6d7e75fa88942f1cc686ae95dcf9c7ea1a4c1c162893 HTTP/1.1" 200 656176 "-" "Debian APT-HTTP/1.3 (1.2.29)"
  2293. [10/Jan/2019:20:39:59 +0000] "GET http://ftpmaster.internal/ubuntu/dists/xenial-updates/main/i18n/by-hash/SHA256/22998eec5e023757e29d4d61f17049217b4c930ae3792d0c7656986565b93890 HTTP/1.1" 200 363872 "-" "Debian APT-HTTP/1.3 (1.2.29)"
  2294. [10/Jan/2019:20:39:59 +0000] "GET http://ftpmaster.internal/ubuntu/dists/xenial-updates/restricted/i18n/by-hash/SHA256/1872740770cbd17b9ad1da685ce3a0500b37babce0e78b36e1280cfab6db0af3 HTTP/1.1" 200 2272 "-" "Debian APT-HTTP/1.3 (1.2.29)"
  2295. [10/Jan/2019:20:39:59 +0000] "GET http://ftpmaster.internal/ubuntu/dists/xenial-updates/universe/binary-s390x/by-hash/SHA256/00ab9164549ae3c85fc773eeb384a1043d90fd68d75b517a2afd2ede5f61397b HTTP/1.1" 200 586832 "-" "Debian APT-HTTP/1.3 (1.2.29)"
  2296. [10/Jan/2019:20:40:00 +0000] "GET http://ftpmaster.internal/ubuntu/dists/xenial-updates/universe/i18n/by-hash/SHA256/55933e7e033350c5b806ce55df2fed9e6e8b001313c8e66923f9ca119adc4d9d HTTP/1.1" 200 293660 "-" "Debian APT-HTTP/1.3 (1.2.29)"
  2297. [10/Jan/2019:20:40:00 +0000] "GET http://ftpmaster.internal/ubuntu/dists/xenial-updates/multiverse/binary-s390x/by-hash/SHA256/a3cc6bc03a5d8211863e961fe27085e1862b5ac05c4a0d29ba0e5be19ff97698 HTTP/1.1" 200 10944 "-" "Debian APT-HTTP/1.3 (1.2.29)"
  2298. [10/Jan/2019:20:40:00 +0000] "GET http://ftpmaster.internal/ubuntu/dists/xenial-updates/multiverse/i18n/by-hash/SHA256/6947a41bae92dc9e84ef8695edee2f85b570f678a1c42eedfb5d036ac87c8d3f HTTP/1.1" 200 8440 "-" "Debian APT-HTTP/1.3 (1.2.29)"
  2299. [10/Jan/2019:20:40:02 +0000] "GET http://ftpmaster.internal/ubuntu/pool/main/s/sqlite3/libsqlite3-0_3.11.0-1ubuntu1_s390x.deb HTTP/1.1" 200 376738 "-" "Debian APT-HTTP/1.3 (1.2.29)"
  2300. [10/Jan/2019:20:40:03 +0000] "GET http://ftpmaster.internal/ubuntu/pool/main/p/python3.5/python3.5_3.5.2-2ubuntu0%7e16.04.5_s390x.deb HTTP/1.1" 200 165240 "-" "Debian APT-HTTP/1.3 (1.2.29)"
  2301. [10/Jan/2019:20:40:03 +0000] "GET http://ftpmaster.internal/ubuntu/pool/main/p/python3-defaults/python3_3.5.1-3_s390x.deb HTTP/1.1" 200 8716 "-" "Debian APT-HTTP/1.3 (1.2.29)"
  2302. [10/Jan/2019:20:40:04 +0000] "GET http://ftpmaster.internal/ubuntu/pool/main/p/python3.5/python3.5-minimal_3.5.2-2ubuntu0%7e16.04.5_s390x.deb HTTP/1.1" 200 1490334 "-" "Debian APT-HTTP/1.3 (1.2.29)"
  2303. [10/Jan/2019:20:40:05 +0000] "GET http://ftpmaster.internal/ubuntu/pool/main/m/mime-support/mime-support_3.59ubuntu1_all.deb HTTP/1.1" 200 31022 "-" "Debian APT-HTTP/1.3 (1.2.29)"
  2304. [10/Jan/2019:20:40:05 +0000] "GET http://ftpmaster.internal/ubuntu/pool/main/m/mpdecimal/libmpdec2_2.4.2-1_s390x.deb HTTP/1.1" 200 81514 "-" "Debian APT-HTTP/1.3 (1.2.29)"
  2305. [10/Jan/2019:20:40:05 +0000] "GET http://ftpmaster.internal/ubuntu/pool/main/e/expat/libexpat1_2.1.0-7ubuntu0.16.04.3_s390x.deb HTTP/1.1" 200 65974 "-" "Debian APT-HTTP/1.3 (1.2.29)"
  2306. [10/Jan/2019:20:40:05 +0000] "GET http://ftpmaster.internal/ubuntu/pool/main/p/python3-defaults/python3-minimal_3.5.1-3_s390x.deb HTTP/1.1" 200 23392 "-" "Debian APT-HTTP/1.3 (1.2.29)"
  2307. [10/Jan/2019:20:40:05 +0000] "GET http://ftpmaster.internal/ubuntu/pool/main/p/python3-defaults/libpython3-stdlib_3.5.1-3_s390x.deb HTTP/1.1" 200 6816 "-" "Debian APT-HTTP/1.3 (1.2.29)"
  2308. [10/Jan/2019:20:40:06 +0000] "GET http://ftpmaster.internal/ubuntu/pool/main/d/dh-python/dh-python_2.20151103ubuntu1.1_all.deb HTTP/1.1" 200 74086 "-" "Debian APT-HTTP/1.3 (1.2.29)"
  2309. [10/Jan/2019:20:40:07 +0000] "GET http://ftpmaster.internal/ubuntu/pool/main/p/python3.5/libpython3.5-stdlib_3.5.2-2ubuntu0%7e16.04.5_s390x.deb HTTP/1.1" 200 2102258 "-" "Debian APT-HTTP/1.3 (1.2.29)"
  2310. [10/Jan/2019:20:40:08 +0000] "GET http://ftpmaster.internal/ubuntu/pool/main/p/python3.5/libpython3.5-minimal_3.5.2-2ubuntu0%7e16.04.5_s390x.deb HTTP/1.1" 200 522790 "-" "Debian APT-HTTP/1.3 (1.2.29)"
  2311. [10/Jan/2019:20:40:09 +0000] "GET http://ftpmaster.internal/ubuntu/pool/main/o/openssl/libssl1.0.0_1.0.2g-1ubuntu4.14_s390x.deb HTTP/1.1" 200 781540 "-" "Debian APT-HTTP/1.3 (1.2.29)"
  2312.  
  2313. Get:1 http://ppa.launchpad.net/snappy-dev/tools/ubuntu xenial InRelease [18.1 kB]
  2314.  
  2315. Get:2 http://ftpmaster.internal/ubuntu xenial InRelease [247 kB]
  2316.  
  2317. Get:3 http://ppa.launchpad.net/snappy-dev/tools/ubuntu xenial/main s390x Packages [692 B]
  2318.  
  2319. Get:4 http://ftpmaster.internal/ubuntu xenial-security InRelease [107 kB]
  2320.  
  2321. Get:5 http://ppa.launchpad.net/snappy-dev/tools/ubuntu xenial/main Translation-en [496 B]
  2322.  
  2323. Get:6 http://ftpmaster.internal/ubuntu xenial-updates InRelease [109 kB]
  2324.  
  2325. Get:7 http://ftpmaster.internal/ubuntu xenial/main s390x Packages [1132 kB]
  2326.  
  2327. Get:8 http://ftpmaster.internal/ubuntu xenial/main Translation-en [568 kB]
  2328.  
  2329. Get:9 http://ftpmaster.internal/ubuntu xenial/restricted Translation-en [2908 B]
  2330.  
  2331. Get:10 http://ftpmaster.internal/ubuntu xenial/universe s390x Packages [7190 kB]
  2332.  
  2333. Get:11 http://ftpmaster.internal/ubuntu xenial/universe Translation-en [4354 kB]
  2334.  
  2335. Get:12 http://ftpmaster.internal/ubuntu xenial/multiverse s390x Packages [119 kB]
  2336.  
  2337. Get:13 http://ftpmaster.internal/ubuntu xenial/multiverse Translation-en [106 kB]
  2338.  
  2339. Get:14 http://ftpmaster.internal/ubuntu xenial-security/main s390x Packages [413 kB]
  2340.  
  2341. Get:15 http://ftpmaster.internal/ubuntu xenial-security/main Translation-en [248 kB]
  2342.  
  2343. Get:16 http://ftpmaster.internal/ubuntu xenial-security/restricted Translation-en [2152 B]
  2344.  
  2345. Get:17 http://ftpmaster.internal/ubuntu xenial-security/universe s390x Packages [320 kB]
  2346.  
  2347. Get:18 http://ftpmaster.internal/ubuntu xenial-security/universe Translation-en [161 kB]
  2348.  
  2349. Get:19 http://ftpmaster.internal/ubuntu xenial-security/multiverse s390x Packages [936 B]
  2350.  
  2351. Get:20 http://ftpmaster.internal/ubuntu xenial-security/multiverse Translation-en [1844 B]
  2352.  
  2353. Get:21 http://ftpmaster.internal/ubuntu xenial-updates/main s390x Packages [656 kB]
  2354.  
  2355. Get:22 http://ftpmaster.internal/ubuntu xenial-updates/main Translation-en [364 kB]
  2356.  
  2357. Get:23 http://ftpmaster.internal/ubuntu xenial-updates/restricted Translation-en [2272 B]
  2358.  
  2359. Get:24 http://ftpmaster.internal/ubuntu xenial-updates/universe s390x Packages [587 kB]
  2360.  
  2361. Get:25 http://ftpmaster.internal/ubuntu xenial-updates/universe Translation-en [294 kB]
  2362.  
  2363. Get:26 http://ftpmaster.internal/ubuntu xenial-updates/multiverse s390x Packages [10.9 kB]
  2364.  
  2365. Get:27 http://ftpmaster.internal/ubuntu xenial-updates/multiverse Translation-en [8440 B]
  2366.  
  2367. Fetched 17.0 MB in 6s (2433 kB/s)
  2368.  
  2369. Get:1 libsqlite3-0_3.11.0-1ubuntu1_s390x.deb [377 kB]
  2370.  
  2371. Fetched 377 kB in 0s (0 B/s)
  2372.  
  2373. Get:1 python3.5_3.5.2-2ubuntu0~16.04.5_s390x.deb [165 kB]
  2374.  
  2375. Fetched 165 kB in 0s (0 B/s)
  2376.  
  2377. Get:1 python3_3.5.1-3_s390x.deb [8716 B]
  2378.  
  2379. Fetched 8716 B in 0s (0 B/s)
  2380.  
  2381. Get:1 python3.5-minimal_3.5.2-2ubuntu0~16.04.5_s390x.deb [1490 kB]
  2382.  
  2383. Fetched 1490 kB in 0s (0 B/s)
  2384.  
  2385. Get:1 mime-support_3.59ubuntu1_all.deb [31.0 kB]
  2386.  
  2387. Fetched 31.0 kB in 0s (0 B/s)
  2388.  
  2389. Get:1 libmpdec2_2.4.2-1_s390x.deb [81.5 kB]
  2390.  
  2391. Fetched 81.5 kB in 0s (0 B/s)
  2392.  
  2393. Get:1 libexpat1_2.1.0-7ubuntu0.16.04.3_s390x.deb [66.0 kB]
  2394.  
  2395. Fetched 66.0 kB in 0s (0 B/s)
  2396.  
  2397. Get:1 python3-minimal_3.5.1-3_s390x.deb [23.4 kB]
  2398.  
  2399. Fetched 23.4 kB in 0s (0 B/s)
  2400.  
  2401. Get:1 libpython3-stdlib_3.5.1-3_s390x.deb [6816 B]
  2402.  
  2403. Fetched 6816 B in 0s (0 B/s)
  2404.  
  2405. Get:1 dh-python_2.20151103ubuntu1.1_all.deb [74.1 kB]
  2406.  
  2407. Fetched 74.1 kB in 0s (0 B/s)
  2408.  
  2409. Get:1 libpython3.5-stdlib_3.5.2-2ubuntu0~16.04.5_s390x.deb [2102 kB]
  2410.  
  2411. Fetched 2102 kB in 0s (0 B/s)
  2412.  
  2413. Get:1 libpython3.5-minimal_3.5.2-2ubuntu0~16.04.5_s390x.deb [523 kB]
  2414.  
  2415. Fetched 523 kB in 0s (0 B/s)
  2416.  
  2417. Get:1 libssl1.0.0_1.0.2g-1ubuntu4.14_s390x.deb [782 kB]
  2418.  
  2419. Fetched 782 kB in 0s (0 B/s)
  2420. Pulling remofile
  2421. Cloning into '/build/yorokobi/parts/remofile/src'...
  2422. [10/Jan/2019:20:40:12 +0000] "CONNECT github.com:443 HTTP/1.1" 200 142968 "-" "git/2.7.4"
  2423. Fetching and installing pip...
  2424. Collecting pip
  2425. [10/Jan/2019:20:40:13 +0000] "CONNECT pypi.python.org:443 HTTP/1.0" 200 4794 "-" "-"
  2426.   Downloading https://files.pythonhosted.org/packages/c2/d7/90f34cb0d83a6c5631cf71dfe64cc1054598c843a92b400e55675cc2ac37/pip-18.1-py2.py3-none-any.whl (1.3MB)
  2427.   Saved ./parts/remofile/python-packages/pip-18.1-py2.py3-none-any.whl
  2428. Successfully downloaded pip
  2429. [10/Jan/2019:20:40:15 +0000] "CONNECT files.pythonhosted.org:443 HTTP/1.0" 200 1331960 "-" "-"
  2430. [10/Jan/2019:20:40:15 +0000] "CONNECT pypi.org:443 HTTP/1.0" 200 15114 "-" "-"
  2431. Ignoring indexes: https://pypi.python.org/simple
  2432. Collecting pip
  2433. Installing collected packages: pip
  2434. Successfully installed pip-8.1.1
  2435. Fetching and installing wheel...
  2436. [10/Jan/2019:20:40:18 +0000] "CONNECT pypi.org:443 HTTP/1.0" 200 4568 "-" "-"
  2437. Collecting wheel
  2438.   Downloading https://files.pythonhosted.org/packages/ff/47/1dfa4795e24fd6f93d5d58602dd716c3f101cfd5a77cd9acbe519b44a0a9/wheel-0.32.3-py2.py3-none-any.whl
  2439.   Saved ./parts/remofile/python-packages/wheel-0.32.3-py2.py3-none-any.whl
  2440. Successfully downloaded wheel
  2441. [10/Jan/2019:20:40:19 +0000] "CONNECT pypi.org:443 HTTP/1.0" 200 12755 "-" "-"
  2442. [10/Jan/2019:20:40:19 +0000] "CONNECT files.pythonhosted.org:443 HTTP/1.0" 200 27490 "-" "-"
  2443. Looking in links: /build/yorokobi/parts/remofile/python-packages
  2444. Collecting wheel
  2445. Installing collected packages: wheel
  2446. Successfully installed wheel-0.32.3
  2447. Fetching and installing setuptools...
  2448. Collecting setuptools
  2449.   Downloading https://files.pythonhosted.org/packages/37/06/754589caf971b0d2d48f151c2586f62902d93dc908e2fd9b9b9f6aa3c9dd/setuptools-40.6.3-py2.py3-none-any.whl (573kB)
  2450.   Saved ./parts/remofile/python-packages/setuptools-40.6.3-py2.py3-none-any.whl
  2451. Successfully downloaded setuptools
  2452. [10/Jan/2019:20:40:22 +0000] "CONNECT pypi.org:443 HTTP/1.0" 200 89538 "-" "-"
  2453. [10/Jan/2019:20:40:22 +0000] "CONNECT files.pythonhosted.org:443 HTTP/1.0" 200 580241 "-" "-"
  2454. Looking in links: /build/yorokobi/parts/remofile/python-packages
  2455. Collecting setuptools
  2456. Installing collected packages: setuptools
  2457. Successfully installed setuptools-40.6.3
  2458. Processing /build/yorokobi/parts/remofile/src
  2459.   Link is a directory, ignoring download_dir
  2460. Collecting Click (from remofile==1.0.0.dev6)
  2461.   Downloading https://files.pythonhosted.org/packages/fa/37/45185cb5abbc30d7257104c434fe0b07e5a195a6847506c074527aa599ec/Click-7.0-py2.py3-none-any.whl (81kB)
  2462.   Saved /build/yorokobi/parts/remofile/python-packages/Click-7.0-py2.py3-none-any.whl
  2463. Collecting pyzmq (from remofile==1.0.0.dev6)
  2464.   Downloading https://files.pythonhosted.org/packages/b9/6a/bc9277b78f5c3236e36b8c16f4d2701a7fd4fa2eb697159d3e0a3a991573/pyzmq-17.1.2.tar.gz (1.1MB)
  2465.   Saved /build/yorokobi/parts/remofile/python-packages/pyzmq-17.1.2.tar.gz
  2466. Collecting shortuuid (from remofile==1.0.0.dev6)
  2467.   Downloading https://files.pythonhosted.org/packages/80/d7/2bfc9332e68d3e15ea97b9b1588b3899ad565120253d3fd71c8f7f13b4fe/shortuuid-0.5.0.tar.gz
  2468.   Saved /build/yorokobi/parts/remofile/python-packages/shortuuid-0.5.0.tar.gz
  2469. Successfully downloaded remofile Click pyzmq shortuuid
  2470. [10/Jan/2019:20:40:26 +0000] "CONNECT pypi.org:443 HTTP/1.0" 200 74014 "-" "-"
  2471. [10/Jan/2019:20:40:26 +0000] "CONNECT files.pythonhosted.org:443 HTTP/1.0" 200 1177533 "-" "-"
  2472. [10/Jan/2019:20:40:27 +0000] "GET http://ftpmaster.internal/ubuntu/dists/xenial/InRelease HTTP/1.1" 304 - "-" "Debian APT-HTTP/1.3 (1.2.29)"
  2473. [10/Jan/2019:20:40:27 +0000] "GET http://ppa.launchpad.net/snappy-dev/tools/ubuntu/dists/xenial/InRelease HTTP/1.1" 304 - "-" "Debian APT-HTTP/1.3 (1.2.29)"
  2474. [10/Jan/2019:20:40:27 +0000] "GET http://ftpmaster.internal/ubuntu/dists/xenial-security/InRelease HTTP/1.1" 304 - "-" "Debian APT-HTTP/1.3 (1.2.29)"
  2475. [10/Jan/2019:20:40:27 +0000] "GET http://ftpmaster.internal/ubuntu/dists/xenial-updates/InRelease HTTP/1.1" 304 - "-" "Debian APT-HTTP/1.3 (1.2.29)"
  2476. [10/Jan/2019:20:40:29 +0000] "GET http://ftpmaster.internal/ubuntu/pool/main/h/heimdal/libgssapi3-heimdal_1.7%7egit20150920%2bdfsg-4ubuntu1.16.04.1_s390x.deb HTTP/1.1" 200 88426 "-" "Debian APT-HTTP/1.3 (1.2.29)"
  2477. [10/Jan/2019:20:40:29 +0000] "GET http://ftpmaster.internal/ubuntu/pool/main/k/krb5/libkrb5-3_1.13.2%2bdfsg-5ubuntu2_s390x.deb HTTP/1.1" 200 260246 "-" "Debian APT-HTTP/1.3 (1.2.29)"
  2478. [10/Jan/2019:20:40:30 +0000] "GET http://ftpmaster.internal/ubuntu/pool/main/k/krb5/libgssapi-krb5-2_1.13.2%2bdfsg-5ubuntu2_s390x.deb HTTP/1.1" 200 109884 "-" "Debian APT-HTTP/1.3 (1.2.29)"
  2479. [10/Jan/2019:20:40:30 +0000] "GET http://ftpmaster.internal/ubuntu/pool/main/e/e2fsprogs/comerr-dev_2.1-1.42.13-1ubuntu1_s390x.deb HTTP/1.1" 200 38172 "-" "Debian APT-HTTP/1.3 (1.2.29)"
  2480. [10/Jan/2019:20:40:30 +0000] "GET http://ftpmaster.internal/ubuntu/pool/main/k/krb5/krb5-multidev_1.13.2%2bdfsg-5ubuntu2_s390x.deb HTTP/1.1" 200 113470 "-" "Debian APT-HTTP/1.3 (1.2.29)"
  2481. [10/Jan/2019:20:40:31 +0000] "GET http://ftpmaster.internal/ubuntu/pool/main/k/krb5/libkadm5clnt-mit9_1.13.2%2bdfsg-5ubuntu2_s390x.deb HTTP/1.1" 200 34940 "-" "Debian APT-HTTP/1.3 (1.2.29)"
  2482. [10/Jan/2019:20:40:31 +0000] "GET http://ftpmaster.internal/ubuntu/pool/main/h/heimdal/libwind0-heimdal_1.7%7egit20150920%2bdfsg-4ubuntu1.16.04.1_s390x.deb HTTP/1.1" 200 48220 "-" "Debian APT-HTTP/1.3 (1.2.29)"
  2483. [10/Jan/2019:20:40:31 +0000] "GET http://ftpmaster.internal/ubuntu/pool/main/c/cyrus-sasl2/libsasl2-modules-db_2.1.26.dfsg1-14ubuntu0.1_s390x.deb HTTP/1.1" 200 13968 "-" "Debian APT-HTTP/1.3 (1.2.29)"
  2484. [10/Jan/2019:20:40:32 +0000] "GET http://ftpmaster.internal/ubuntu/pool/main/l/linux/linux-libc-dev_4.4.0-141.167_s390x.deb HTTP/1.1" 200 843292 "-" "Debian APT-HTTP/1.3 (1.2.29)"
  2485. [10/Jan/2019:20:40:33 +0000] "GET http://ftpmaster.internal/ubuntu/pool/main/o/openldap/libldap-2.4-2_2.4.42%2bdfsg-2ubuntu3.4_s390x.deb HTTP/1.1" 200 150760 "-" "Debian APT-HTTP/1.3 (1.2.29)"
  2486. [10/Jan/2019:20:40:35 +0000] "GET http://ftpmaster.internal/ubuntu/pool/main/g/glibc/libc6-dev_2.23-0ubuntu10_s390x.deb HTTP/1.1" 200 1848334 "-" "Debian APT-HTTP/1.3 (1.2.29)"
  2487. [10/Jan/2019:20:40:35 +0000] "GET http://ftpmaster.internal/ubuntu/pool/main/h/heimdal/libheimntlm0-heimdal_1.7%7egit20150920%2bdfsg-4ubuntu1.16.04.1_s390x.deb HTTP/1.1" 200 14652 "-" "Debian APT-HTTP/1.3 (1.2.29)"
  2488. [10/Jan/2019:20:40:36 +0000] "GET http://ftpmaster.internal/ubuntu/pool/universe/z/zeromq3/libzmq5_4.1.4-7_s390x.deb HTTP/1.1" 200 141238 "-" "Debian APT-HTTP/1.3 (1.2.29)"
  2489. [10/Jan/2019:20:40:36 +0000] "GET http://ftpmaster.internal/ubuntu/pool/main/g/gmp/libgmp10_6.1.0%2bdfsg-2_s390x.deb HTTP/1.1" 200 228592 "-" "Debian APT-HTTP/1.3 (1.2.29)"
  2490. [10/Jan/2019:20:40:37 +0000] "GET http://ftpmaster.internal/ubuntu/pool/main/k/krb5/libkdb5-8_1.13.2%2bdfsg-5ubuntu2_s390x.deb HTTP/1.1" 200 35592 "-" "Debian APT-HTTP/1.3 (1.2.29)"
  2491. [10/Jan/2019:20:40:37 +0000] "GET http://ftpmaster.internal/ubuntu/pool/main/h/heimdal/libheimbase1-heimdal_1.7%7egit20150920%2bdfsg-4ubuntu1.16.04.1_s390x.deb HTTP/1.1" 200 27530 "-" "Debian APT-HTTP/1.3 (1.2.29)"
  2492. [10/Jan/2019:20:40:37 +0000] "GET http://ftpmaster.internal/ubuntu/pool/main/k/krb5/libk5crypto3_1.13.2%2bdfsg-5ubuntu2_s390x.deb HTTP/1.1" 200 80972 "-" "Debian APT-HTTP/1.3 (1.2.29)"
  2493. [10/Jan/2019:20:40:37 +0000] "GET http://ftpmaster.internal/ubuntu/pool/main/c/cyrus-sasl2/libsasl2-2_2.1.26.dfsg1-14ubuntu0.1_s390x.deb HTTP/1.1" 200 46750 "-" "Debian APT-HTTP/1.3 (1.2.29)"
  2494. [10/Jan/2019:20:40:38 +0000] "GET http://ftpmaster.internal/ubuntu/pool/main/z/zlib/zlib1g-dev_1.2.8.dfsg-2ubuntu4.1_s390x.deb HTTP/1.1" 200 168448 "-" "Debian APT-HTTP/1.3 (1.2.29)"
  2495. [10/Jan/2019:20:40:38 +0000] "GET http://ftpmaster.internal/ubuntu/pool/main/p/postgresql-9.5/libpq5_9.5.14-0ubuntu0.16.04_s390x.deb HTTP/1.1" 200 75860 "-" "Debian APT-HTTP/1.3 (1.2.29)"
  2496. [10/Jan/2019:20:40:39 +0000] "GET http://ftpmaster.internal/ubuntu/pool/universe/z/zeromq3/libzmq3-dev_4.1.4-7_s390x.deb HTTP/1.1" 200 279736 "-" "Debian APT-HTTP/1.3 (1.2.29)"
  2497. [10/Jan/2019:20:40:39 +0000] "GET http://ftpmaster.internal/ubuntu/pool/main/p/postgresql-9.5/libpq-dev_9.5.14-0ubuntu0.16.04_s390x.deb HTTP/1.1" 200 152264 "-" "Debian APT-HTTP/1.3 (1.2.29)"
  2498. [10/Jan/2019:20:40:39 +0000] "GET http://ftpmaster.internal/ubuntu/pool/main/k/krb5/libkrb5support0_1.13.2%2bdfsg-5ubuntu2_s390x.deb HTTP/1.1" 200 30216 "-" "Debian APT-HTTP/1.3 (1.2.29)"
  2499. [10/Jan/2019:20:40:40 +0000] "GET http://ftpmaster.internal/ubuntu/pool/main/k/krb5/libgssrpc4_1.13.2%2bdfsg-5ubuntu2_s390x.deb HTTP/1.1" 200 51702 "-" "Debian APT-HTTP/1.3 (1.2.29)"
  2500. [10/Jan/2019:20:40:40 +0000] "GET http://ftpmaster.internal/ubuntu/pool/main/h/heimdal/libhcrypto4-heimdal_1.7%7egit20150920%2bdfsg-4ubuntu1.16.04.1_s390x.deb HTTP/1.1" 200 81502 "-" "Debian APT-HTTP/1.3 (1.2.29)"
  2501. [10/Jan/2019:20:40:40 +0000] "GET http://ftpmaster.internal/ubuntu/pool/main/k/keyutils/libkeyutils1_1.5.9-8ubuntu1_s390x.deb HTTP/1.1" 200 9918 "-" "Debian APT-HTTP/1.3 (1.2.29)"
  2502. [10/Jan/2019:20:40:42 +0000] "GET http://ftpmaster.internal/ubuntu/pool/main/o/openssl/libssl-dev_1.0.2g-1ubuntu4.14_s390x.deb HTTP/1.1" 200 1067094 "-" "Debian APT-HTTP/1.3 (1.2.29)"
  2503. [10/Jan/2019:20:40:42 +0000] "GET http://ftpmaster.internal/ubuntu/pool/main/n/nettle/libhogweed4_3.2-1ubuntu0.16.04.1_s390x.deb HTTP/1.1" 200 134574 "-" "Debian APT-HTTP/1.3 (1.2.29)"
  2504. [10/Jan/2019:20:40:42 +0000] "GET http://ftpmaster.internal/ubuntu/pool/universe/libs/libsodium/libsodium18_1.0.8-5_s390x.deb HTTP/1.1" 200 113994 "-" "Debian APT-HTTP/1.3 (1.2.29)"
  2505. [10/Jan/2019:20:40:43 +0000] "GET http://ftpmaster.internal/ubuntu/pool/main/n/nettle/libnettle6_3.2-1ubuntu0.16.04.1_s390x.deb HTTP/1.1" 200 104088 "-" "Debian APT-HTTP/1.3 (1.2.29)"
  2506. [10/Jan/2019:20:40:43 +0000] "GET http://ftpmaster.internal/ubuntu/pool/main/g/glibc/libc-dev-bin_2.23-0ubuntu10_s390x.deb HTTP/1.1" 200 62780 "-" "Debian APT-HTTP/1.3 (1.2.29)"
  2507. [10/Jan/2019:20:40:43 +0000] "GET http://ftpmaster.internal/ubuntu/pool/main/libi/libidn/libidn11_1.32-3ubuntu1.2_s390x.deb HTTP/1.1" 200 44562 "-" "Debian APT-HTTP/1.3 (1.2.29)"
  2508. [10/Jan/2019:20:40:44 +0000] "GET http://ftpmaster.internal/ubuntu/pool/main/g/gnutls28/libgnutls30_3.4.10-4ubuntu1.4_s390x.deb HTTP/1.1" 200 490316 "-" "Debian APT-HTTP/1.3 (1.2.29)"
  2509. [10/Jan/2019:20:40:44 +0000] "GET http://ftpmaster.internal/ubuntu/pool/main/h/heimdal/libroken18-heimdal_1.7%7egit20150920%2bdfsg-4ubuntu1.16.04.1_s390x.deb HTTP/1.1" 200 39596 "-" "Debian APT-HTTP/1.3 (1.2.29)"
  2510. [10/Jan/2019:20:40:45 +0000] "GET http://ftpmaster.internal/ubuntu/pool/main/libf/libffi/libffi6_3.2.1-4_s390x.deb HTTP/1.1" 200 16306 "-" "Debian APT-HTTP/1.3 (1.2.29)"
  2511. [10/Jan/2019:20:40:45 +0000] "GET http://ftpmaster.internal/ubuntu/pool/main/p/p11-kit/libp11-kit0_0.23.2-5%7eubuntu16.04.1_s390x.deb HTTP/1.1" 200 97756 "-" "Debian APT-HTTP/1.3 (1.2.29)"
  2512. [10/Jan/2019:20:40:45 +0000] "GET http://ftpmaster.internal/ubuntu/pool/main/h/heimdal/libasn1-8-heimdal_1.7%7egit20150920%2bdfsg-4ubuntu1.16.04.1_s390x.deb HTTP/1.1" 200 147242 "-" "Debian APT-HTTP/1.3 (1.2.29)"
  2513. [10/Jan/2019:20:40:46 +0000] "GET http://ftpmaster.internal/ubuntu/pool/main/h/heimdal/libkrb5-26-heimdal_1.7%7egit20150920%2bdfsg-4ubuntu1.16.04.1_s390x.deb HTTP/1.1" 200 186746 "-" "Debian APT-HTTP/1.3 (1.2.29)"
  2514. [10/Jan/2019:20:40:46 +0000] "GET http://ftpmaster.internal/ubuntu/pool/main/k/krb5/libkadm5srv-mit9_1.13.2%2bdfsg-5ubuntu2_s390x.deb HTTP/1.1" 200 49270 "-" "Debian APT-HTTP/1.3 (1.2.29)"
  2515. [10/Jan/2019:20:40:46 +0000] "GET http://ftpmaster.internal/ubuntu/pool/main/libt/libtasn1-6/libtasn1-6_4.7-3ubuntu0.16.04.3_s390x.deb HTTP/1.1" 200 41922 "-" "Debian APT-HTTP/1.3 (1.2.29)"
  2516. [10/Jan/2019:20:40:47 +0000] "GET http://ftpmaster.internal/ubuntu/pool/main/h/heimdal/libhx509-5-heimdal_1.7%7egit20150920%2bdfsg-4ubuntu1.16.04.1_s390x.deb HTTP/1.1" 200 99264 "-" "Debian APT-HTTP/1.3 (1.2.29)"
  2517.  
  2518. Hit http://ftpmaster.internal/ubuntu xenial InRelease
  2519.  
  2520. Hit http://ppa.launchpad.net/snappy-dev/tools/ubuntu xenial InRelease
  2521.  
  2522. Hit http://ftpmaster.internal/ubuntu xenial-security InRelease
  2523.  
  2524. Hit http://ftpmaster.internal/ubuntu xenial-updates InRelease
  2525.  
  2526. Fetched 0 B in 0s (0 B/s)
  2527.  
  2528. Get:1 libgssapi3-heimdal_1.7~git20150920+dfsg-4ubuntu1.16.04.1_s390x.deb [88.4 kB]
  2529.  
  2530. Fetched 88.4 kB in 0s (0 B/s)
  2531.  
  2532. Get:1 libkrb5-3_1.13.2+dfsg-5ubuntu2_s390x.deb [260 kB]
  2533.  
  2534. Fetched 260 kB in 0s (0 B/s)
  2535.  
  2536. Get:1 libgssapi-krb5-2_1.13.2+dfsg-5ubuntu2_s390x.deb [110 kB]
  2537.  
  2538. Fetched 110 kB in 0s (0 B/s)
  2539.  
  2540. Get:1 comerr-dev_2.1-1.42.13-1ubuntu1_s390x.deb [38.2 kB]
  2541.  
  2542. Fetched 38.2 kB in 0s (0 B/s)
  2543.  
  2544. Get:1 krb5-multidev_1.13.2+dfsg-5ubuntu2_s390x.deb [113 kB]
  2545.  
  2546. Fetched 113 kB in 0s (0 B/s)
  2547.  
  2548. Get:1 libkadm5clnt-mit9_1.13.2+dfsg-5ubuntu2_s390x.deb [34.9 kB]
  2549.  
  2550. Fetched 34.9 kB in 0s (0 B/s)
  2551.  
  2552. Get:1 libwind0-heimdal_1.7~git20150920+dfsg-4ubuntu1.16.04.1_s390x.deb [48.2 kB]
  2553.  
  2554. Fetched 48.2 kB in 0s (0 B/s)
  2555.  
  2556. Get:1 libsasl2-modules-db_2.1.26.dfsg1-14ubuntu0.1_s390x.deb [14.0 kB]
  2557.  
  2558. Fetched 14.0 kB in 0s (0 B/s)
  2559.  
  2560. Get:1 linux-libc-dev_4.4.0-141.167_s390x.deb [843 kB]
  2561.  
  2562. Fetched 843 kB in 0s (0 B/s)
  2563.  
  2564. Get:1 libldap-2.4-2_2.4.42+dfsg-2ubuntu3.4_s390x.deb [151 kB]
  2565.  
  2566. Fetched 151 kB in 0s (0 B/s)
  2567.  
  2568. Get:1 libc6-dev_2.23-0ubuntu10_s390x.deb [1848 kB]
  2569.  
  2570. Fetched 1848 kB in 0s (0 B/s)
  2571.  
  2572. Get:1 libheimntlm0-heimdal_1.7~git20150920+dfsg-4ubuntu1.16.04.1_s390x.deb [14.7 kB]
  2573.  
  2574. Fetched 14.7 kB in 0s (0 B/s)
  2575.  
  2576. Get:1 libzmq5_4.1.4-7_s390x.deb [141 kB]
  2577.  
  2578. Fetched 141 kB in 0s (0 B/s)
  2579.  
  2580. Get:1 libgmp10_6.1.0+dfsg-2_s390x.deb [229 kB]
  2581.  
  2582. Fetched 229 kB in 0s (0 B/s)
  2583.  
  2584. Get:1 libkdb5-8_1.13.2+dfsg-5ubuntu2_s390x.deb [35.6 kB]
  2585.  
  2586. Fetched 35.6 kB in 0s (0 B/s)
  2587.  
  2588. Get:1 libheimbase1-heimdal_1.7~git20150920+dfsg-4ubuntu1.16.04.1_s390x.deb [27.5 kB]
  2589.  
  2590. Fetched 27.5 kB in 0s (0 B/s)
  2591.  
  2592. Get:1 libk5crypto3_1.13.2+dfsg-5ubuntu2_s390x.deb [81.0 kB]
  2593.  
  2594. Fetched 81.0 kB in 0s (0 B/s)
  2595.  
  2596. Get:1 libsasl2-2_2.1.26.dfsg1-14ubuntu0.1_s390x.deb [46.8 kB]
  2597.  
  2598. Fetched 46.8 kB in 0s (0 B/s)
  2599.  
  2600. Get:1 zlib1g-dev_1.2.8.dfsg-2ubuntu4.1_s390x.deb [168 kB]
  2601.  
  2602. Fetched 168 kB in 0s (0 B/s)
  2603.  
  2604. Get:1 libpq5_9.5.14-0ubuntu0.16.04_s390x.deb [75.9 kB]
  2605.  
  2606. Fetched 75.9 kB in 0s (0 B/s)
  2607.  
  2608. Get:1 libzmq3-dev_4.1.4-7_s390x.deb [280 kB]
  2609.  
  2610. Fetched 280 kB in 0s (0 B/s)
  2611.  
  2612. Get:1 libpq-dev_9.5.14-0ubuntu0.16.04_s390x.deb [152 kB]
  2613.  
  2614. Fetched 152 kB in 0s (0 B/s)
  2615.  
  2616. Get:1 libkrb5support0_1.13.2+dfsg-5ubuntu2_s390x.deb [30.2 kB]
  2617.  
  2618. Fetched 30.2 kB in 0s (0 B/s)
  2619.  
  2620. Get:1 libgssrpc4_1.13.2+dfsg-5ubuntu2_s390x.deb [51.7 kB]
  2621.  
  2622. Fetched 51.7 kB in 0s (0 B/s)
  2623.  
  2624. Get:1 libhcrypto4-heimdal_1.7~git20150920+dfsg-4ubuntu1.16.04.1_s390x.deb [81.5 kB]
  2625.  
  2626. Fetched 81.5 kB in 0s (0 B/s)
  2627.  
  2628. Get:1 libkeyutils1_1.5.9-8ubuntu1_s390x.deb [9918 B]
  2629.  
  2630. Fetched 9918 B in 0s (0 B/s)
  2631.  
  2632. Get:1 libssl-dev_1.0.2g-1ubuntu4.14_s390x.deb [1067 kB]
  2633.  
  2634. Fetched 1067 kB in 0s (0 B/s)
  2635.  
  2636. Get:1 libhogweed4_3.2-1ubuntu0.16.04.1_s390x.deb [135 kB]
  2637.  
  2638. Fetched 135 kB in 0s (0 B/s)
  2639.  
  2640. Get:1 libsodium18_1.0.8-5_s390x.deb [114 kB]
  2641.  
  2642. Fetched 114 kB in 0s (0 B/s)
  2643.  
  2644. Get:1 libnettle6_3.2-1ubuntu0.16.04.1_s390x.deb [104 kB]
  2645.  
  2646. Fetched 104 kB in 0s (0 B/s)
  2647.  
  2648. Get:1 libc-dev-bin_2.23-0ubuntu10_s390x.deb [62.8 kB]
  2649.  
  2650. Fetched 62.8 kB in 0s (0 B/s)
  2651.  
  2652. Get:1 libidn11_1.32-3ubuntu1.2_s390x.deb [44.6 kB]
  2653.  
  2654. Fetched 44.6 kB in 0s (0 B/s)
  2655.  
  2656. Get:1 libgnutls30_3.4.10-4ubuntu1.4_s390x.deb [490 kB]
  2657.  
  2658. Fetched 490 kB in 0s (0 B/s)
  2659.  
  2660. Get:1 libroken18-heimdal_1.7~git20150920+dfsg-4ubuntu1.16.04.1_s390x.deb [39.6 kB]
  2661.  
  2662. Fetched 39.6 kB in 0s (0 B/s)
  2663.  
  2664. Get:1 libffi6_3.2.1-4_s390x.deb [16.3 kB]
  2665.  
  2666. Fetched 16.3 kB in 0s (0 B/s)
  2667.  
  2668. Get:1 libp11-kit0_0.23.2-5~ubuntu16.04.1_s390x.deb [97.8 kB]
  2669.  
  2670. Fetched 97.8 kB in 0s (0 B/s)
  2671.  
  2672. Get:1 libasn1-8-heimdal_1.7~git20150920+dfsg-4ubuntu1.16.04.1_s390x.deb [147 kB]
  2673.  
  2674. Fetched 147 kB in 0s (0 B/s)
  2675.  
  2676. Get:1 libkrb5-26-heimdal_1.7~git20150920+dfsg-4ubuntu1.16.04.1_s390x.deb [187 kB]
  2677.  
  2678. Fetched 187 kB in 0s (0 B/s)
  2679.  
  2680. Get:1 libkadm5srv-mit9_1.13.2+dfsg-5ubuntu2_s390x.deb [49.3 kB]
  2681.  
  2682. Fetched 49.3 kB in 0s (0 B/s)
  2683.  
  2684. Get:1 libtasn1-6_4.7-3ubuntu0.16.04.3_s390x.deb [41.9 kB]
  2685.  
  2686. Fetched 41.9 kB in 0s (0 B/s)
  2687.  
  2688. Get:1 libhx509-5-heimdal_1.7~git20150920+dfsg-4ubuntu1.16.04.1_s390x.deb [99.3 kB]
  2689.  
  2690. Fetched 99.3 kB in 0s (0 B/s)
  2691. Copying needed target link from the system /lib/s390x-linux-gnu/libcom_err.so.2.1
  2692. Copying needed target link from the system /lib/s390x-linux-gnu/libz.so.1.2.8
  2693. Pulling yorokobi
  2694. Fetching and installing pip...
  2695. Collecting pip
  2696.   Using cached https://files.pythonhosted.org/packages/c2/d7/90f34cb0d83a6c5631cf71dfe64cc1054598c843a92b400e55675cc2ac37/pip-18.1-py2.py3-none-any.whl
  2697.   Saved ./parts/yorokobi/python-packages/pip-18.1-py2.py3-none-any.whl
  2698. Successfully downloaded pip
  2699. [10/Jan/2019:20:40:51 +0000] "CONNECT pypi.org:443 HTTP/1.0" 200 15114 "-" "-"
  2700. Ignoring indexes: https://pypi.python.org/simple
  2701. Collecting pip
  2702. Installing collected packages: pip
  2703. Successfully installed pip-8.1.1
  2704. Fetching and installing wheel...
  2705. [10/Jan/2019:20:40:54 +0000] "CONNECT pypi.org:443 HTTP/1.0" 200 4568 "-" "-"
  2706. Collecting wheel
  2707.   Using cached https://files.pythonhosted.org/packages/ff/47/1dfa4795e24fd6f93d5d58602dd716c3f101cfd5a77cd9acbe519b44a0a9/wheel-0.32.3-py2.py3-none-any.whl
  2708.   Saved ./parts/yorokobi/python-packages/wheel-0.32.3-py2.py3-none-any.whl
  2709. Successfully downloaded wheel
  2710. [10/Jan/2019:20:40:54 +0000] "CONNECT pypi.org:443 HTTP/1.0" 200 4568 "-" "-"
  2711. Looking in links: /build/yorokobi/parts/yorokobi/python-packages
  2712. Collecting wheel
  2713. Installing collected packages: wheel
  2714. Successfully installed wheel-0.32.3
  2715. Fetching and installing setuptools...
  2716. Collecting setuptools
  2717.   Using cached https://files.pythonhosted.org/packages/37/06/754589caf971b0d2d48f151c2586f62902d93dc908e2fd9b9b9f6aa3c9dd/setuptools-40.6.3-py2.py3-none-any.whl
  2718.   Saved ./parts/yorokobi/python-packages/setuptools-40.6.3-py2.py3-none-any.whl
  2719. Successfully downloaded setuptools
  2720. [10/Jan/2019:20:40:57 +0000] "CONNECT pypi.org:443 HTTP/1.0" 200 4568 "-" "-"
  2721. Looking in links: /build/yorokobi/parts/yorokobi/python-packages
  2722. Collecting setuptools
  2723. Installing collected packages: setuptools
  2724. Successfully installed setuptools-40.6.3
  2725. Processing /build/yorokobi/parts/yorokobi/src
  2726.   Link is a directory, ignoring download_dir
  2727. Collecting psycopg2-binary
  2728.   Downloading https://files.pythonhosted.org/packages/59/64/7b0fea58c9b7c609717cc951607fe5edb73e86d46a47b0c7d58586335e53/psycopg2-binary-2.7.6.1.tar.gz (428kB)
  2729.   Saved /build/yorokobi/parts/yorokobi/python-packages/psycopg2-binary-2.7.6.1.tar.gz
  2730. Collecting click
  2731.   Using cached https://files.pythonhosted.org/packages/fa/37/45185cb5abbc30d7257104c434fe0b07e5a195a6847506c074527aa599ec/Click-7.0-py2.py3-none-any.whl
  2732.   Saved /build/yorokobi/parts/yorokobi/python-packages/Click-7.0-py2.py3-none-any.whl
  2733. Collecting pyzmq
  2734.   Using cached https://files.pythonhosted.org/packages/b9/6a/bc9277b78f5c3236e36b8c16f4d2701a7fd4fa2eb697159d3e0a3a991573/pyzmq-17.1.2.tar.gz
  2735.   Saved /build/yorokobi/parts/yorokobi/python-packages/pyzmq-17.1.2.tar.gz
  2736. Collecting schedule
  2737.   Downloading https://files.pythonhosted.org/packages/df/2c/3a94d846682a4fb94966e65bca19a1acb6f7dd85977f4e4cece6e677b757/schedule-0.5.0-py2.py3-none-any.whl
  2738.   Saved /build/yorokobi/parts/yorokobi/python-packages/schedule-0.5.0-py2.py3-none-any.whl
  2739. Collecting inquirer
  2740.   Downloading https://files.pythonhosted.org/packages/5b/e1/1b154d3f81af4e33c35270a19bd2b26d85466aa131781f5eda175af19a1c/inquirer-2.5.1-py2.py3-none-any.whl
  2741.   Saved /build/yorokobi/parts/yorokobi/python-packages/inquirer-2.5.1-py2.py3-none-any.whl
  2742. Collecting pexpect
  2743.   Downloading https://files.pythonhosted.org/packages/89/e6/b5a1de8b0cc4e07ca1b305a4fcc3f9806025c1b651ea302646341222f88b/pexpect-4.6.0-py2.py3-none-any.whl (57kB)
  2744.   Saved /build/yorokobi/parts/yorokobi/python-packages/pexpect-4.6.0-py2.py3-none-any.whl
  2745. Collecting setuptools
  2746.   File was already downloaded /build/yorokobi/parts/yorokobi/python-packages/setuptools-40.6.3-py2.py3-none-any.whl
  2747. Collecting requests
  2748.   Downloading https://files.pythonhosted.org/packages/7d/e3/20f3d364d6c8e5d2353c72a67778eb189176f08e873c9900e10c0287b84b/requests-2.21.0-py2.py3-none-any.whl (57kB)
  2749.   Saved /build/yorokobi/parts/yorokobi/python-packages/requests-2.21.0-py2.py3-none-any.whl
  2750. Collecting blessings>=1.7 (from inquirer)
  2751.   Downloading https://files.pythonhosted.org/packages/03/74/489f85a78247609c6b4f13733cbf3ba0d864b11aa565617b645d6fdf2a4a/blessings-1.7-py3-none-any.whl
  2752.   Saved /build/yorokobi/parts/yorokobi/python-packages/blessings-1.7-py3-none-any.whl
  2753. Collecting readchar>=2.0.0 (from inquirer)
  2754.   Downloading https://files.pythonhosted.org/packages/ef/f3/50cc9199733bf91f3c140150752a6430d8b785f9d22a31dcae721edb0b9a/readchar-2.0.1-py3-none-any.whl
  2755.   Saved /build/yorokobi/parts/yorokobi/python-packages/readchar-2.0.1-py3-none-any.whl
  2756. Collecting ptyprocess>=0.5 (from pexpect)
  2757.   Downloading https://files.pythonhosted.org/packages/d1/29/605c2cc68a9992d18dada28206eeada56ea4bd07a239669da41674648b6f/ptyprocess-0.6.0-py2.py3-none-any.whl
  2758.   Saved /build/yorokobi/parts/yorokobi/python-packages/ptyprocess-0.6.0-py2.py3-none-any.whl
  2759. Collecting urllib3<1.25,>=1.21.1 (from requests)
  2760.   Downloading https://files.pythonhosted.org/packages/62/00/ee1d7de624db8ba7090d1226aebefab96a2c71cd5cfa7629d6ad3f61b79e/urllib3-1.24.1-py2.py3-none-any.whl (118kB)
  2761.   Saved /build/yorokobi/parts/yorokobi/python-packages/urllib3-1.24.1-py2.py3-none-any.whl
  2762. Collecting idna<2.9,>=2.5 (from requests)
  2763.   Downloading https://files.pythonhosted.org/packages/14/2c/cd551d81dbe15200be1cf41cd03869a46fe7226e7450af7a6545bfc474c9/idna-2.8-py2.py3-none-any.whl (58kB)
  2764.   Saved /build/yorokobi/parts/yorokobi/python-packages/idna-2.8-py2.py3-none-any.whl
  2765. Collecting chardet<3.1.0,>=3.0.2 (from requests)
  2766.   Downloading https://files.pythonhosted.org/packages/bc/a9/01ffebfb562e4274b6487b4bb1ddec7ca55ec7510b22e4c51f14098443b8/chardet-3.0.4-py2.py3-none-any.whl (133kB)
  2767.   Saved /build/yorokobi/parts/yorokobi/python-packages/chardet-3.0.4-py2.py3-none-any.whl
  2768. Collecting certifi>=2017.4.17 (from requests)
  2769.   Downloading https://files.pythonhosted.org/packages/9f/e0/accfc1b56b57e9750eba272e24c4dddeac86852c2bebd1236674d7887e8a/certifi-2018.11.29-py2.py3-none-any.whl (154kB)
  2770.   Saved /build/yorokobi/parts/yorokobi/python-packages/certifi-2018.11.29-py2.py3-none-any.whl
  2771. Collecting six (from blessings>=1.7->inquirer)
  2772.   Downloading https://files.pythonhosted.org/packages/73/fb/00a976f728d0d1fecfe898238ce23f502a721c0ac0ecfedb80e0d88c64e9/six-1.12.0-py2.py3-none-any.whl
  2773.   Saved /build/yorokobi/parts/yorokobi/python-packages/six-1.12.0-py2.py3-none-any.whl
  2774. Successfully downloaded yorokobi psycopg2-binary click pyzmq schedule inquirer pexpect setuptools requests blessings readchar ptyprocess urllib3 idna chardet certifi six
  2775. [10/Jan/2019:20:41:04 +0000] "CONNECT pypi.org:443 HTTP/1.0" 200 81064 "-" "-"
  2776. [10/Jan/2019:20:41:04 +0000] "CONNECT files.pythonhosted.org:443 HTTP/1.0" 200 1138984 "-" "-"
  2777. Running build phase...
  2778. Skipping pull remofile (already ran)
  2779. Skipping pull yorokobi (already ran)
  2780. Building remofile
  2781. Looking in links: /build/yorokobi/parts/remofile/python-packages
  2782. Processing /build/yorokobi/parts/remofile/build
  2783. Collecting Click (from remofile==1.0.0.dev6)
  2784.   Saved /tmp/tmp5hpc73t_/Click-7.0-py2.py3-none-any.whl
  2785. Collecting pyzmq (from remofile==1.0.0.dev6)
  2786. Collecting shortuuid (from remofile==1.0.0.dev6)
  2787. Skipping Click, due to already being wheel.
  2788. Building wheels for collected packages: remofile, pyzmq, shortuuid
  2789.   Running setup.py bdist_wheel for remofile: started
  2790.   Running setup.py bdist_wheel for remofile: finished with status 'done'
  2791.   Stored in directory: /tmp/tmp5hpc73t_
  2792.   Running setup.py bdist_wheel for pyzmq: started
  2793.   Running setup.py bdist_wheel for pyzmq: finished with status 'error'
  2794.   Complete output from command /build/yorokobi/parts/remofile/install/usr/bin/python3 -u -c "import setuptools, tokenize;__file__='/tmp/pip-wheel-r0gezw99/pyzmq/setup.py';f=getattr(tokenize, 'open', open)(__file__);code=f.read().replace('\r\n', '\n');f.close();exec(compile(code, __file__, 'exec'))" bdist_wheel -d /tmp/pip-wheel-oninrr4s:
  2795.   running bdist_wheel
  2796.   running build
  2797.   running build_py
  2798.   Generating grammar tables from /build/yorokobi/parts/remofile/install/usr/lib/python3.5/lib2to3/Grammar.txt
  2799.   Generating grammar tables from /build/yorokobi/parts/remofile/install/usr/lib/python3.5/lib2to3/PatternGrammar.txt
  2800.   creating build
  2801.   creating build/lib.linux-s390x-3.5
  2802.   creating build/lib.linux-s390x-3.5/zmq
  2803.   copying zmq/__init__.py -> build/lib.linux-s390x-3.5/zmq
  2804.   copying zmq/decorators.py -> build/lib.linux-s390x-3.5/zmq
  2805.   copying zmq/_future.py -> build/lib.linux-s390x-3.5/zmq
  2806.   copying zmq/error.py -> build/lib.linux-s390x-3.5/zmq
  2807.   creating build/lib.linux-s390x-3.5/zmq/utils
  2808.   copying zmq/utils/win32.py -> build/lib.linux-s390x-3.5/zmq/utils
  2809.   copying zmq/utils/__init__.py -> build/lib.linux-s390x-3.5/zmq/utils
  2810.   copying zmq/utils/jsonapi.py -> build/lib.linux-s390x-3.5/zmq/utils
  2811.   copying zmq/utils/strtypes.py -> build/lib.linux-s390x-3.5/zmq/utils
  2812.   copying zmq/utils/garbage.py -> build/lib.linux-s390x-3.5/zmq/utils
  2813.   copying zmq/utils/sixcerpt.py -> build/lib.linux-s390x-3.5/zmq/utils
  2814.   copying zmq/utils/z85.py -> build/lib.linux-s390x-3.5/zmq/utils
  2815.   copying zmq/utils/interop.py -> build/lib.linux-s390x-3.5/zmq/utils
  2816.   copying zmq/utils/monitor.py -> build/lib.linux-s390x-3.5/zmq/utils
  2817.   copying zmq/utils/constant_names.py -> build/lib.linux-s390x-3.5/zmq/utils
  2818.   creating build/lib.linux-s390x-3.5/zmq/green
  2819.   copying zmq/green/__init__.py -> build/lib.linux-s390x-3.5/zmq/green
  2820.   copying zmq/green/core.py -> build/lib.linux-s390x-3.5/zmq/green
  2821.   copying zmq/green/device.py -> build/lib.linux-s390x-3.5/zmq/green
  2822.   copying zmq/green/poll.py -> build/lib.linux-s390x-3.5/zmq/green
  2823.   creating build/lib.linux-s390x-3.5/zmq/green/eventloop
  2824.   copying zmq/green/eventloop/__init__.py -> build/lib.linux-s390x-3.5/zmq/green/eventloop
  2825.   copying zmq/green/eventloop/ioloop.py -> build/lib.linux-s390x-3.5/zmq/green/eventloop
  2826.   copying zmq/green/eventloop/zmqstream.py -> build/lib.linux-s390x-3.5/zmq/green/eventloop
  2827.   creating build/lib.linux-s390x-3.5/zmq/eventloop
  2828.   copying zmq/eventloop/__init__.py -> build/lib.linux-s390x-3.5/zmq/eventloop
  2829.   copying zmq/eventloop/ioloop.py -> build/lib.linux-s390x-3.5/zmq/eventloop
  2830.   copying zmq/eventloop/future.py -> build/lib.linux-s390x-3.5/zmq/eventloop
  2831.   copying zmq/eventloop/_deprecated.py -> build/lib.linux-s390x-3.5/zmq/eventloop
  2832.   copying zmq/eventloop/zmqstream.py -> build/lib.linux-s390x-3.5/zmq/eventloop
  2833.   creating build/lib.linux-s390x-3.5/zmq/eventloop/minitornado
  2834.   copying zmq/eventloop/minitornado/__init__.py -> build/lib.linux-s390x-3.5/zmq/eventloop/minitornado
  2835.   copying zmq/eventloop/minitornado/ioloop.py -> build/lib.linux-s390x-3.5/zmq/eventloop/minitornado
  2836.   copying zmq/eventloop/minitornado/util.py -> build/lib.linux-s390x-3.5/zmq/eventloop/minitornado
  2837.   copying zmq/eventloop/minitornado/log.py -> build/lib.linux-s390x-3.5/zmq/eventloop/minitornado
  2838.   copying zmq/eventloop/minitornado/concurrent.py -> build/lib.linux-s390x-3.5/zmq/eventloop/minitornado
  2839.   copying zmq/eventloop/minitornado/stack_context.py -> build/lib.linux-s390x-3.5/zmq/eventloop/minitornado
  2840.   creating build/lib.linux-s390x-3.5/zmq/eventloop/minitornado/platform
  2841.   copying zmq/eventloop/minitornado/platform/__init__.py -> build/lib.linux-s390x-3.5/zmq/eventloop/minitornado/platform
  2842.   copying zmq/eventloop/minitornado/platform/posix.py -> build/lib.linux-s390x-3.5/zmq/eventloop/minitornado/platform
  2843.   copying zmq/eventloop/minitornado/platform/windows.py -> build/lib.linux-s390x-3.5/zmq/eventloop/minitornado/platform
  2844.   copying zmq/eventloop/minitornado/platform/common.py -> build/lib.linux-s390x-3.5/zmq/eventloop/minitornado/platform
  2845.   copying zmq/eventloop/minitornado/platform/auto.py -> build/lib.linux-s390x-3.5/zmq/eventloop/minitornado/platform
  2846.   copying zmq/eventloop/minitornado/platform/interface.py -> build/lib.linux-s390x-3.5/zmq/eventloop/minitornado/platform
  2847.   creating build/lib.linux-s390x-3.5/zmq/tests
  2848.   copying zmq/tests/test_constants.py -> build/lib.linux-s390x-3.5/zmq/tests
  2849.   copying zmq/tests/__init__.py -> build/lib.linux-s390x-3.5/zmq/tests
  2850.   copying zmq/tests/test_security.py -> build/lib.linux-s390x-3.5/zmq/tests
  2851.   copying zmq/tests/test_device.py -> build/lib.linux-s390x-3.5/zmq/tests
  2852.   copying zmq/tests/test_auth.py -> build/lib.linux-s390x-3.5/zmq/tests
  2853.   copying zmq/tests/test_error.py -> build/lib.linux-s390x-3.5/zmq/tests
  2854.   copying zmq/tests/test_socket.py -> build/lib.linux-s390x-3.5/zmq/tests
  2855.   copying zmq/tests/test_message.py -> build/lib.linux-s390x-3.5/zmq/tests
  2856.   copying zmq/tests/test_log.py -> build/lib.linux-s390x-3.5/zmq/tests
  2857.   copying zmq/tests/test_etc.py -> build/lib.linux-s390x-3.5/zmq/tests
  2858.   copying zmq/tests/test_pubsub.py -> build/lib.linux-s390x-3.5/zmq/tests
  2859.   copying zmq/tests/test_pair.py -> build/lib.linux-s390x-3.5/zmq/tests
  2860.   copying zmq/tests/test_zmqstream.py -> build/lib.linux-s390x-3.5/zmq/tests
  2861.   copying zmq/tests/test_poll.py -> build/lib.linux-s390x-3.5/zmq/tests
  2862.   copying zmq/tests/test_win32_shim.py -> build/lib.linux-s390x-3.5/zmq/tests
  2863.   copying zmq/tests/test_draft.py -> build/lib.linux-s390x-3.5/zmq/tests
  2864.   copying zmq/tests/test_monqueue.py -> build/lib.linux-s390x-3.5/zmq/tests
  2865.   copying zmq/tests/test_imports.py -> build/lib.linux-s390x-3.5/zmq/tests
  2866.   copying zmq/tests/test_ssh.py -> build/lib.linux-s390x-3.5/zmq/tests
  2867.   copying zmq/tests/test_decorators.py -> build/lib.linux-s390x-3.5/zmq/tests
  2868.   copying zmq/tests/test_includes.py -> build/lib.linux-s390x-3.5/zmq/tests
  2869.   copying zmq/tests/test_context.py -> build/lib.linux-s390x-3.5/zmq/tests
  2870.   copying zmq/tests/test_z85.py -> build/lib.linux-s390x-3.5/zmq/tests
  2871.   copying zmq/tests/test_version.py -> build/lib.linux-s390x-3.5/zmq/tests
  2872.   copying zmq/tests/test_reqrep.py -> build/lib.linux-s390x-3.5/zmq/tests
  2873.   copying zmq/tests/test_retry_eintr.py -> build/lib.linux-s390x-3.5/zmq/tests
  2874.   copying zmq/tests/test_cffi_backend.py -> build/lib.linux-s390x-3.5/zmq/tests
  2875.   copying zmq/tests/test_ioloop.py -> build/lib.linux-s390x-3.5/zmq/tests
  2876.   copying zmq/tests/test_future.py -> build/lib.linux-s390x-3.5/zmq/tests
  2877.   copying zmq/tests/test_monitor.py -> build/lib.linux-s390x-3.5/zmq/tests
  2878.   copying zmq/tests/test_multipart.py -> build/lib.linux-s390x-3.5/zmq/tests
  2879.   creating build/lib.linux-s390x-3.5/zmq/tests/asyncio
  2880.   copying zmq/tests/asyncio/__init__.py -> build/lib.linux-s390x-3.5/zmq/tests/asyncio
  2881.   copying zmq/tests/asyncio/_test_asyncio.py -> build/lib.linux-s390x-3.5/zmq/tests/asyncio
  2882.   copying zmq/tests/asyncio/test_asyncio.py -> build/lib.linux-s390x-3.5/zmq/tests/asyncio
  2883.   creating build/lib.linux-s390x-3.5/zmq/asyncio
  2884.   copying zmq/asyncio/__init__.py -> build/lib.linux-s390x-3.5/zmq/asyncio
  2885.   creating build/lib.linux-s390x-3.5/zmq/ssh
  2886.   copying zmq/ssh/__init__.py -> build/lib.linux-s390x-3.5/zmq/ssh
  2887.   copying zmq/ssh/forward.py -> build/lib.linux-s390x-3.5/zmq/ssh
  2888.   copying zmq/ssh/tunnel.py -> build/lib.linux-s390x-3.5/zmq/ssh
  2889.   creating build/lib.linux-s390x-3.5/zmq/auth
  2890.   copying zmq/auth/base.py -> build/lib.linux-s390x-3.5/zmq/auth
  2891.   copying zmq/auth/__init__.py -> build/lib.linux-s390x-3.5/zmq/auth
  2892.   copying zmq/auth/ioloop.py -> build/lib.linux-s390x-3.5/zmq/auth
  2893.   copying zmq/auth/certs.py -> build/lib.linux-s390x-3.5/zmq/auth
  2894.   copying zmq/auth/thread.py -> build/lib.linux-s390x-3.5/zmq/auth
  2895.   creating build/lib.linux-s390x-3.5/zmq/auth/asyncio
  2896.   copying zmq/auth/asyncio/__init__.py -> build/lib.linux-s390x-3.5/zmq/auth/asyncio
  2897.   creating build/lib.linux-s390x-3.5/zmq/backend
  2898.   copying zmq/backend/__init__.py -> build/lib.linux-s390x-3.5/zmq/backend
  2899.   copying zmq/backend/select.py -> build/lib.linux-s390x-3.5/zmq/backend
  2900.   creating build/lib.linux-s390x-3.5/zmq/backend/cython
  2901.   copying zmq/backend/cython/__init__.py -> build/lib.linux-s390x-3.5/zmq/backend/cython
  2902.   creating build/lib.linux-s390x-3.5/zmq/backend/cffi
  2903.   copying zmq/backend/cffi/socket.py -> build/lib.linux-s390x-3.5/zmq/backend/cffi
  2904.   copying zmq/backend/cffi/__init__.py -> build/lib.linux-s390x-3.5/zmq/backend/cffi
  2905.   copying zmq/backend/cffi/context.py -> build/lib.linux-s390x-3.5/zmq/backend/cffi
  2906.   copying zmq/backend/cffi/devices.py -> build/lib.linux-s390x-3.5/zmq/backend/cffi
  2907.   copying zmq/backend/cffi/_cffi.py -> build/lib.linux-s390x-3.5/zmq/backend/cffi
  2908.   copying zmq/backend/cffi/utils.py -> build/lib.linux-s390x-3.5/zmq/backend/cffi
  2909.   copying zmq/backend/cffi/_poll.py -> build/lib.linux-s390x-3.5/zmq/backend/cffi
  2910.   copying zmq/backend/cffi/message.py -> build/lib.linux-s390x-3.5/zmq/backend/cffi
  2911.   copying zmq/backend/cffi/error.py -> build/lib.linux-s390x-3.5/zmq/backend/cffi
  2912.   copying zmq/backend/cffi/constants.py -> build/lib.linux-s390x-3.5/zmq/backend/cffi
  2913.   creating build/lib.linux-s390x-3.5/zmq/log
  2914.   copying zmq/log/__init__.py -> build/lib.linux-s390x-3.5/zmq/log
  2915.   copying zmq/log/handlers.py -> build/lib.linux-s390x-3.5/zmq/log
  2916.   creating build/lib.linux-s390x-3.5/zmq/sugar
  2917.   copying zmq/sugar/socket.py -> build/lib.linux-s390x-3.5/zmq/sugar
  2918.   copying zmq/sugar/__init__.py -> build/lib.linux-s390x-3.5/zmq/sugar
  2919.   copying zmq/sugar/context.py -> build/lib.linux-s390x-3.5/zmq/sugar
  2920.   copying zmq/sugar/stopwatch.py -> build/lib.linux-s390x-3.5/zmq/sugar
  2921.   copying zmq/sugar/version.py -> build/lib.linux-s390x-3.5/zmq/sugar
  2922.   copying zmq/sugar/attrsettr.py -> build/lib.linux-s390x-3.5/zmq/sugar
  2923.   copying zmq/sugar/frame.py -> build/lib.linux-s390x-3.5/zmq/sugar
  2924.   copying zmq/sugar/tracker.py -> build/lib.linux-s390x-3.5/zmq/sugar
  2925.   copying zmq/sugar/constants.py -> build/lib.linux-s390x-3.5/zmq/sugar
  2926.   copying zmq/sugar/poll.py -> build/lib.linux-s390x-3.5/zmq/sugar
  2927.   creating build/lib.linux-s390x-3.5/zmq/devices
  2928.   copying zmq/devices/__init__.py -> build/lib.linux-s390x-3.5/zmq/devices
  2929.   copying zmq/devices/proxydevice.py -> build/lib.linux-s390x-3.5/zmq/devices
  2930.   copying zmq/devices/monitoredqueue.py -> build/lib.linux-s390x-3.5/zmq/devices
  2931.   copying zmq/devices/basedevice.py -> build/lib.linux-s390x-3.5/zmq/devices
  2932.   copying zmq/devices/monitoredqueuedevice.py -> build/lib.linux-s390x-3.5/zmq/devices
  2933.   copying zmq/utils/buffers.pxd -> build/lib.linux-s390x-3.5/zmq/utils
  2934.   copying zmq/utils/pyversion_compat.h -> build/lib.linux-s390x-3.5/zmq/utils
  2935.   copying zmq/utils/mutex.h -> build/lib.linux-s390x-3.5/zmq/utils
  2936.   copying zmq/utils/getpid_compat.h -> build/lib.linux-s390x-3.5/zmq/utils
  2937.   copying zmq/utils/zmq_compat.h -> build/lib.linux-s390x-3.5/zmq/utils
  2938.   copying zmq/utils/zmq_constants.h -> build/lib.linux-s390x-3.5/zmq/utils
  2939.   copying zmq/utils/ipcmaxlen.h -> build/lib.linux-s390x-3.5/zmq/utils
  2940.   copying zmq/backend/cython/checkrc.pxd -> build/lib.linux-s390x-3.5/zmq/backend/cython
  2941.   copying zmq/backend/cython/message.pxd -> build/lib.linux-s390x-3.5/zmq/backend/cython
  2942.   copying zmq/backend/cython/libzmq.pxd -> build/lib.linux-s390x-3.5/zmq/backend/cython
  2943.   copying zmq/backend/cython/context.pxd -> build/lib.linux-s390x-3.5/zmq/backend/cython
  2944.   copying zmq/backend/cython/socket.pxd -> build/lib.linux-s390x-3.5/zmq/backend/cython
  2945.   copying zmq/backend/cython/constant_enums.pxi -> build/lib.linux-s390x-3.5/zmq/backend/cython
  2946.   copying zmq/backend/cython/constants.pxi -> build/lib.linux-s390x-3.5/zmq/backend/cython
  2947.   copying zmq/backend/cffi/_cdefs.h -> build/lib.linux-s390x-3.5/zmq/backend/cffi
  2948.   copying zmq/backend/cffi/_verify.c -> build/lib.linux-s390x-3.5/zmq/backend/cffi
  2949.   copying zmq/devices/monitoredqueue.pxd -> build/lib.linux-s390x-3.5/zmq/devices
  2950.   running build_ext
  2951.   running configure
  2952.   pkg-config not found
  2953.   {'include_dirs': [], 'libraries': ['zmq'], 'library_dirs': [], 'runtime_library_dirs': [], 'extra_link_args': []}
  2954.   s390x-linux-gnu-gcc -pthread -DNDEBUG -g -fwrapv -O2 -Wall -Wstrict-prototypes -g -fstack-protector-strong -Wformat -Werror=format-security -I/usr/include/python3.5 -fPIC -c build/temp.linux-s390x-3.5/scratch/check_sys_un.c -o build/temp.linux-s390x-3.5/scratch/check_sys_un.o
  2955.   s390x-linux-gnu-gcc -pthread build/temp.linux-s390x-3.5/scratch/check_sys_un.o -o build/temp.linux-s390x-3.5/scratch/check_sys_un
  2956.   ************************************************
  2957.   Configure: Autodetecting ZMQ settings...
  2958.       Custom ZMQ dir:
  2959.   creating build/temp.linux-s390x-3.5/scratch/tmp
  2960.   s390x-linux-gnu-gcc -pthread -DNDEBUG -g -fwrapv -O2 -Wall -Wstrict-prototypes -g -fstack-protector-strong -Wformat -Werror=format-security -I/usr/include/python3.5 -fPIC -c /tmp/timer_createav7bsxxf.c -o build/temp.linux-s390x-3.5/scratch/tmp/timer_createav7bsxxf.o
  2961.   /tmp/timer_createav7bsxxf.c:1:1: warning: return type defaults to ‘int’ [-Wimplicit-int]
  2962.    main (int argc, char **argv) {
  2963.    ^
  2964.   /tmp/timer_createav7bsxxf.c: In function ‘main’:
  2965.   /tmp/timer_createav7bsxxf.c:2:5: warning: implicit declaration of function ‘timer_create’ [-Wimplicit-function-declaration]
  2966.        timer_create();
  2967.        ^
  2968.   s390x-linux-gnu-gcc -pthread build/temp.linux-s390x-3.5/scratch/tmp/timer_createav7bsxxf.o -o build/temp.linux-s390x-3.5/scratch/a.out
  2969.   build/temp.linux-s390x-3.5/scratch/tmp/timer_createav7bsxxf.o: In function `main':
  2970.   /tmp/timer_createav7bsxxf.c:2: undefined reference to `timer_create'
  2971.   collect2: error: ld returned 1 exit status
  2972.   s390x-linux-gnu-gcc -pthread -DNDEBUG -g -fwrapv -O2 -Wall -Wstrict-prototypes -g -fstack-protector-strong -Wformat -Werror=format-security -I/usr/include/python3.5 -fPIC -Izmq/utils -Izmq/backend/cython -Izmq/devices -c build/temp.linux-s390x-3.5/scratch/vers.c -o build/temp.linux-s390x-3.5/scratch/vers.o
  2973.   build/temp.linux-s390x-3.5/scratch/vers.c:4:17: fatal error: zmq.h: No such file or directory
  2974.   compilation terminated.
  2975.  
  2976.   error: command 's390x-linux-gnu-gcc' failed with exit status 1
  2977.  
  2978.   Failed with default libzmq, trying again with /usr/local
  2979.   {'include_dirs': ['/usr/local/include'], 'libraries': ['zmq'], 'library_dirs': ['/usr/local/lib'], 'runtime_library_dirs': ['/usr/local/lib'], 'extra_link_args': []}
  2980.   ************************************************
  2981.   Configure: Autodetecting ZMQ settings...
  2982.       Custom ZMQ dir:       /usr/local
  2983.   s390x-linux-gnu-gcc -pthread -DNDEBUG -g -fwrapv -O2 -Wall -Wstrict-prototypes -g -fstack-protector-strong -Wformat -Werror=format-security -I/usr/include/python3.5 -fPIC -c /tmp/timer_creategvdct7ja.c -o build/temp.linux-s390x-3.5/scratch/tmp/timer_creategvdct7ja.o
  2984.   /tmp/timer_creategvdct7ja.c:1:1: warning: return type defaults to ‘int’ [-Wimplicit-int]
  2985.    main (int argc, char **argv) {
  2986.    ^
  2987.   /tmp/timer_creategvdct7ja.c: In function ‘main’:
  2988.   /tmp/timer_creategvdct7ja.c:2:5: warning: implicit declaration of function ‘timer_create’ [-Wimplicit-function-declaration]
  2989.        timer_create();
  2990.        ^
  2991.   Assembler messages:
  2992.   Fatal error: can't create build/temp.linux-s390x-3.5/scratch/tmp/timer_creategvdct7ja.o: No such file or directory
  2993.   s390x-linux-gnu-gcc -pthread -DNDEBUG -g -fwrapv -O2 -Wall -Wstrict-prototypes -g -fstack-protector-strong -Wformat -Werror=format-security -I/usr/include/python3.5 -fPIC -I/usr/local/include -Izmq/utils -Izmq/backend/cython -Izmq/devices -c build/temp.linux-s390x-3.5/scratch/vers.c -o build/temp.linux-s390x-3.5/scratch/vers.o
  2994.   build/temp.linux-s390x-3.5/scratch/vers.c:4:17: fatal error: zmq.h: No such file or directory
  2995.   compilation terminated.
  2996.  
  2997.   error: command 's390x-linux-gnu-gcc' failed with exit status 1
  2998.  
  2999.   ************************************************
  3000.   Warning: Couldn't find an acceptable libzmq on the system.
  3001.  
  3002.   If you expected pyzmq to link against an installed libzmq, please check to make sure:
  3003.  
  3004.       * You have a C compiler installed
  3005.       * A development version of Python is installed (including headers)
  3006.       * A development version of ZMQ >= 3.2 is installed (including headers)
  3007.       * If ZMQ is not in a default location, supply the argument --zmq=<path>
  3008.       * If you did recently install ZMQ to a default location,
  3009.         try rebuilding the ld cache with `sudo ldconfig`
  3010.         or specify zmq's location with `--zmq=/usr/local`
  3011.  
  3012.   You can skip all this detection/waiting nonsense if you know
  3013.   you want pyzmq to bundle libzmq as an extension by passing:
  3014.  
  3015.       `--zmq=bundled`
  3016.  
  3017.   I will now try to build libzmq as a Python extension
  3018.   unless you interrupt me (^C) in the next 10 seconds...
  3019.  
  3020.  
  3021.   10...
  3022.    9...
  3023.    8...
  3024.    7...
  3025.    6...
  3026.    5...
  3027.    4...
  3028.    3...
  3029.    2...
  3030.    1...
  3031.   ************************************************
  3032.   Using bundled libzmq
  3033.   already have bundled/zeromq
  3034.   attempting ./configure to generate platform.hpp
  3035.   Warning: failed to configure libzmq:
  3036.   b'/bin/sh: 1: ./configure: not found\n'
  3037.   staging platform.hpp from: /tmp/pip-wheel-r0gezw99/pyzmq/buildutils/include_linux
  3038.   ************************************************
  3039.   checking for timer_create
  3040.   creating build/temp.linux-s390x-3.5/tmp
  3041.   s390x-linux-gnu-gcc -pthread -DNDEBUG -g -fwrapv -O2 -Wall -Wstrict-prototypes -g -fstack-protector-strong -Wformat -Werror=format-security -I/usr/include/python3.5 -fPIC -c /tmp/timer_create15lwvudd.c -o build/temp.linux-s390x-3.5/tmp/timer_create15lwvudd.o
  3042.   /tmp/timer_create15lwvudd.c:1:1: warning: return type defaults to ‘int’ [-Wimplicit-int]
  3043.    main (int argc, char **argv) {
  3044.    ^
  3045.   /tmp/timer_create15lwvudd.c: In function ‘main’:
  3046.   /tmp/timer_create15lwvudd.c:2:5: warning: implicit declaration of function ‘timer_create’ [-Wimplicit-function-declaration]
  3047.        timer_create();
  3048.        ^
  3049.   s390x-linux-gnu-gcc -pthread build/temp.linux-s390x-3.5/tmp/timer_create15lwvudd.o -o build/temp.linux-s390x-3.5/a.out
  3050.   build/temp.linux-s390x-3.5/tmp/timer_create15lwvudd.o: In function `main':
  3051.   /tmp/timer_create15lwvudd.c:2: undefined reference to `timer_create'
  3052.   collect2: error: ld returned 1 exit status
  3053.   no timer_create, linking librt
  3054.   ************************************************
  3055.   building 'zmq.libzmq' extension
  3056.   creating build/temp.linux-s390x-3.5/buildutils
  3057.   creating build/temp.linux-s390x-3.5/bundled
  3058.   creating build/temp.linux-s390x-3.5/bundled/zeromq
  3059.   creating build/temp.linux-s390x-3.5/bundled/zeromq/src
  3060.   s390x-linux-gnu-gcc -pthread -DNDEBUG -g -fwrapv -O2 -Wall -Wstrict-prototypes -g -fstack-protector-strong -Wformat -Werror=format-security -I/usr/include/python3.5 -fPIC -DZMQ_HAVE_CURVE=1 -DZMQ_USE_TWEETNACL=1 -DZMQ_USE_EPOLL=1 -Ibundled/zeromq/include -Ibundled -I/build/yorokobi/parts/remofile/install/usr/include/python3.5m -c buildutils/initlibzmq.c -o build/temp.linux-s390x-3.5/buildutils/initlibzmq.o
  3061.   s390x-linux-gnu-gcc -pthread -DNDEBUG -g -fwrapv -O2 -Wall -Wstrict-prototypes -g -fstack-protector-strong -Wformat -Werror=format-security -I/usr/include/python3.5 -fPIC -DZMQ_HAVE_CURVE=1 -DZMQ_USE_TWEETNACL=1 -DZMQ_USE_EPOLL=1 -Ibundled/zeromq/include -Ibundled -I/build/yorokobi/parts/remofile/install/usr/include/python3.5m -c bundled/zeromq/src/dish.cpp -o build/temp.linux-s390x-3.5/bundled/zeromq/src/dish.o
  3062.   cc1plus: warning: command line option ‘-Wstrict-prototypes’ is valid for C/ObjC but not for C++
  3063.   In file included from bundled/zeromq/src/options.hpp:38:0,
  3064.                    from bundled/zeromq/src/own.hpp:37,
  3065.                    from bundled/zeromq/src/socket_base.hpp:37,
  3066.                    from bundled/zeromq/src/dish.hpp:36,
  3067.                    from bundled/zeromq/src/dish.cpp:34:
  3068.   bundled/zeromq/src/atomic_ptr.hpp: In member function ‘int zmq::atomic_value_t::load() const’:
  3069.   bundled/zeromq/src/atomic_ptr.hpp:269:46: error: binding ‘const zmq::mutex_t’ to reference of type ‘zmq::mutex_t&’ discards qualifiers
  3070.                                                 sync
  3071.                                                 ^
  3072.   bundled/zeromq/src/atomic_ptr.hpp:116:14: note:   initializing argument 4 of ‘void* zmq::atomic_cas(void* volatile*, void*, void*, zmq::mutex_t&)’
  3073.    inline void *atomic_cas (void *volatile *ptr_,
  3074.                 ^
  3075.   error: command 's390x-linux-gnu-gcc' failed with exit status 1
  3076.  
  3077.   ----------------------------------------
  3078.   Failed building wheel for pyzmq
  3079.   Running setup.py clean for pyzmq
  3080.   Running setup.py bdist_wheel for shortuuid: started
  3081.   Running setup.py bdist_wheel for shortuuid: finished with status 'done'
  3082.   Stored in directory: /tmp/tmp5hpc73t_
  3083. Successfully built remofile shortuuid
  3084. Failed to build pyzmq
  3085. ERROR: Failed to build one or more wheels
  3086. Failed to run '/build/yorokobi/parts/remofile/install/usr/bin/python3 -m pip wheel --no-index --find-links /build/yorokobi/parts/remofile/python-packages --wheel-dir /tmp/tmp5hpc73t_ .': Exited with code 1.
  3087. Build failed
  3088. Traceback (most recent call last):
  3089.   File "/usr/lib/python2.7/dist-packages/lpbuildd/target/build_snap.py", line 231, in run
  3090.     self.build()
  3091.   File "/usr/lib/python2.7/dist-packages/lpbuildd/target/build_snap.py", line 220, in build
  3092.     env=env)
  3093.   File "/usr/lib/python2.7/dist-packages/lpbuildd/target/build_snap.py", line 75, in run_build_command
  3094.     return self.backend.run(args, env=full_env, **kwargs)
  3095.   File "/usr/lib/python2.7/dist-packages/lpbuildd/target/lxd.py", line 460, in run
  3096.     subprocess.check_call(cmd, **kwargs)
  3097.   File "/usr/lib/python2.7/subprocess.py", line 541, in check_call
  3098.     raise CalledProcessError(retcode, cmd)
  3099. CalledProcessError: Command '['lxc', 'exec', 'lp-xenial-s390x', '--env', 'LANG=C.UTF-8', '--env', 'SHELL=/bin/sh', '--env', 'SNAPCRAFT_BUILD_INFO=1', '--env', 'SNAPCRAFT_IMAGE_INFO={"build_url": "https://launchpad.net/~build.snapcraft.io/+snap/9bc23507e335fb54c4484719e01a72a0-xenial/+build/428701"}', '--env', 'SNAPCRAFT_BUILD_ENVIRONMENT=host', '--env', 'http_proxy=http://10.10.10.1:8222/', '--env', 'https_proxy=http://10.10.10.1:8222/', '--env', 'GIT_PROXY_COMMAND=/usr/local/bin/snap-git-proxy', '--', '/bin/sh', '-c', 'cd /build/yorokobi && linux64 snapcraft']' returned non-zero exit status 2
  3100. Revoking proxy token...
  3101. RUN: /usr/share/launchpad-buildd/slavebin/in-target scan-for-processes --backend=lxd --series=xenial --arch=s390x SNAPBUILD-428701
  3102. Scanning for processes to kill in build SNAPBUILD-428701
RAW Paste Data
We use cookies for various purposes including analytics. By continuing to use Pastebin, you agree to our use of cookies as described in the Cookies Policy. OK, I Understand
 
Top