SHARE
TWEET

Untitled

a guest Aug 22nd, 2019 85 Never
Not a member of Pastebin yet? Sign Up, it unlocks many cool features!
  1. macbook-pro-de-jonathan:xamarin-macios jo$ make all -j8 && make install -j8
  2. mono is up-to-date.
  3. Touch.Unit is up-to-date.
  4. opentk is up-to-date.
  5. Xamarin.MacDev is up-to-date.
  6. guiunit is up-to-date.
  7. macios-binaries is up-to-date.
  8. All dependent modules up to date
  9. Checking system...
  10.     Found OSX 10.14.5 (at least 10.14 is required)
  11.         Deleted Xcode cache file: /var/folders/zs/j6vw88ln4w345667y83lnzfw0000gq/C/com.apple.dt.Xcode.InstallCheckCache_MobileDevice_18F132_9F1027a (this is normal)
  12.         Deleted Xcode cache file: /var/folders/zs/j6vw88ln4w345667y83lnzfw0000gq/C/com.apple.dt.Xcode.InstallCheckCache_CoreSim_18F132_9F1027a (this is normal)
  13.     Found Xcode 11.0 in /Applications/Xcode11-beta5.app
  14.         Found CoreSimulator.framework 681.1 (exactly 681.1 is recommended)
  15.         Deleted Xcode cache file: /var/folders/zs/j6vw88ln4w345667y83lnzfw0000gq/T/com.apple.dt.Xcode.InstallCheckCache_com.apple.pkg.CoreTypes.1300B10_18F132_11M382q (this is normal)
  16.         Deleted Xcode cache file: /var/folders/zs/j6vw88ln4w345667y83lnzfw0000gq/T/com.apple.dt.Xcode.InstallCheckCache_CoreSim_18F132_11M382q (this is normal)
  17.         Deleted Xcode cache file: /var/folders/zs/j6vw88ln4w345667y83lnzfw0000gq/T/com.apple.dt.Xcode.InstallCheckCache_com.apple.pkg.MobileDeviceDevelopment_18F132_11M382q (this is normal)
  18.         Deleted Xcode cache file: /var/folders/zs/j6vw88ln4w345667y83lnzfw0000gq/T/com.apple.dt.Xcode.InstallCheckCache_MobileDevice_18F132_11M382q (this is normal)
  19.     Found Xcode 9.4 in /Applications/Xcode94.app
  20.     Found Homebrew (Homebrew 2.1.6)
  21.     Found autoconf (GNU Autoconf) 2.69 (no specific version is required)
  22.     Found glibtool (GNU libtool) 2.4.6 (no specific version is required)
  23.     Found automake (GNU automake) 1.16.1 (no specific version is required)
  24.     Found Mono 6.0.0.286 (at least 6.0.0.286 and not more than 6.0.99 is required)
  25.     Found Visual Studio 8.1.0.2742 (at least 8.1.0.2742 and not more than 8.1.0.2742 is required)
  26.     Found CMake 3.14.5 (at least 2.8.8 is required)
  27.     Found Objective Sharpie 3.4.43 (at least 3.4.43 and not more than 3.4.99 is recommended)
  28.     Found all extra simulators: com.apple.pkg.iPhoneSimulatorSDK10_3, com.apple.pkg.iPhoneSimulatorSDK11_0, com.apple.pkg.AppleTVSimulatorSDK10_2, com.apple.pkg.WatchSimulatorSDK4_0
  29. System check succeeded
  30. Building Xamarin.iOS 12.99.2.77 and Xamarin.Mac 5.99.2.77
  31. Making all in builds
  32. make[2]: `MonoAotOffsetsDumper.exe' is up to date.
  33. Making all in runtime
  34. Making all in fsharp
  35. Making all in src
  36. GEN      [ios] generated_sources
  37. GEN      [mac/mobile] generated-sources
  38. GEN      [mac/full] generated-sources
  39. CSC      [watch] MonoTouch.NUnitLite.dll
  40. GEN      [tvos] generated_sources
  41. avkit.cs(279,55): error CS0246: The type or namespace name 'AVAudioSessionRouteSelection' could not be found (are you missing a using directive or an assembly reference?)
  42. avkit.cs(767,43): error CS0246: The type or namespace name 'AVRoutePickerViewButtonState' could not be found (are you missing a using directive or an assembly reference?)
  43. avkit.cs(767,3): error CS0246: The type or namespace name 'NSColor' could not be found (are you missing a using directive or an assembly reference?)
  44. avkit.cs(771,49): error CS0246: The type or namespace name 'NSColor' could not be found (are you missing a using directive or an assembly reference?)
  45. avkit.cs(771,64): error CS0246: The type or namespace name 'AVRoutePickerViewButtonState' could not be found (are you missing a using directive or an assembly reference?)
  46. avkit.cs(712,44): error CS0246: The type or namespace name 'UITraitCollection' could not be found (are you missing a using directive or an assembly reference?)
  47. avkit.cs(717,43): error CS0246: The type or namespace name 'UITraitCollection' could not be found (are you missing a using directive or an assembly reference?)
  48. avkit.cs(722,69): error CS0246: The type or namespace name 'UITraitCollection' could not be found (are you missing a using directive or an assembly reference?)
  49. avkit.cs(727,68): error CS0246: The type or namespace name 'UITraitCollection' could not be found (are you missing a using directive or an assembly reference?)
  50. avkit.cs(747,3): error CS0246: The type or namespace name 'UIColor' could not be found (are you missing a using directive or an assembly reference?)
  51. avkit.cs(751,3): error CS0246: The type or namespace name 'AVRoutePickerViewButtonStyle' could not be found (are you missing a using directive or an assembly reference?)
  52. bgen: API binding contains errors.
  53. make[1]: *** [build/tvos/tvos/generated_sources] Error 1
  54. make[1]: *** Waiting for unfinished jobs....
  55. bgen: API binding contains errors.
  56. avkit.cs(767,43): error CS0246: The type or namespace name 'AVRoutePickerViewButtonState' could not be found (are you missing a using directive or an assembly reference?)
  57. avkit.cs(767,3): error CS0246: The type or namespace name 'NSColor' could not be found (are you missing a using directive or an assembly reference?)
  58. avkit.cs(771,49): error CS0246: The type or namespace name 'NSColor' could not be found (are you missing a using directive or an assembly reference?)
  59. avkit.cs(771,64): error CS0246: The type or namespace name 'AVRoutePickerViewButtonState' could not be found (are you missing a using directive or an assembly reference?)
  60. make[1]: *** [build/mac/full/generated-sources] Error 1
  61. avkit.cs(747,3): error CS0246: The type or namespace name 'UIColor' could not be found (are you missing a using directive or an assembly reference?)
  62. avkit.cs(712,44): error CS0246: The type or namespace name 'UITraitCollection' could not be found (are you missing a using directive or an assembly reference?)
  63. avkit.cs(751,3): error CS0246: The type or namespace name 'AVRoutePickerViewButtonStyle' could not be found (are you missing a using directive or an assembly reference?)
  64. avkit.cs(717,43): error CS0246: The type or namespace name 'UITraitCollection' could not be found (are you missing a using directive or an assembly reference?)
  65. avkit.cs(722,69): error CS0246: The type or namespace name 'UITraitCollection' could not be found (are you missing a using directive or an assembly reference?)
  66. avkit.cs(727,68): error CS0246: The type or namespace name 'UITraitCollection' could not be found (are you missing a using directive or an assembly reference?)
  67. bgen: API binding contains errors.
  68. make[1]: *** [build/ios/native/generated_sources] Error 1
  69. bgen: API binding contains errors.
  70. make[1]: *** [build/mac/mobile/generated-sources] Error 1
  71. rm build/ios/reference/OpenTK-1.0.dll.config build/watch/reference/MonoTouch.NUnitLite.dll
  72. make: *** [all-recurse] Error 1
RAW Paste Data
We use cookies for various purposes including analytics. By continuing to use Pastebin, you agree to our use of cookies as described in the Cookies Policy. OK, I Understand
 
Top