SHARE
TWEET

virtualbox failure

razec Jun 21st, 2015 258 Never
Not a member of Pastebin yet? Sign Up, it unlocks many cool features!
  1. src/VBox/Runtime/common/ldr/ldrkStuff.cpp
  2. kBuild: Compiling RuntimeR3 - /home/pkgmk/work/virtualbox/src/VirtualBox-4.3.26/src/VBox/Runtime/VBox/RTAssertShouldPanic-vbox.cpp
  3. kBuild: Compiling RuntimeR3 - /home/pkgmk/work/virtualbox/src/VirtualBox-4.3.26/src/VBox/Runtime/VBox/log-vbox.cpp
  4. kBuild: Compiling RuntimeR3 - /home/pkgmk/work/virtualbox/src/VirtualBox-4.3.26/src/VBox/Runtime/common/err/errmsgxpcom.cpp
  5. kBuild: Compiling RuntimeR3 - /home/pkgmk/work/virtualbox/src/VirtualBox-4.3.26/src/VBox/Runtime/VBox/dbus.cpp
  6. kBuild: Compiling RuntimeR3 - /home/pkgmk/work/virtualbox/src/VirtualBox-4.3.26/src/VBox/Runtime/generic/cdrom-generic.cpp
  7. kBuild: Compiling RuntimeR3 - /home/pkgmk/work/virtualbox/src/VirtualBox-4.3.26/src/VBox/Runtime/generic/RTDirQueryInfo-generic.cpp
  8. kBuild: Compiling RuntimeR3 - /home/pkgmk/work/virtualbox/src/VirtualBox-4.3.26/src/VBox/Runtime/generic/RTDirSetTimes-generic.cpp
  9. kBuild: Compiling RuntimeR3 - /home/pkgmk/work/virtualbox/src/VirtualBox-4.3.26/src/VBox/Runtime/generic/RTFileMove-generic.cpp
  10. kBuild: Compiling RuntimeR3 - /home/pkgmk/work/virtualbox/src/VirtualBox-4.3.26/src/VBox/Runtime/generic/RTLogWriteDebugger-generic.cpp
  11. kBuild: Compiling RuntimeR3 - /home/pkgmk/work/virtualbox/src/VirtualBox-4.3.26/src/VBox/Runtime/generic/RTPathAbs-generic.cpp
  12. kBuild: Compiling RuntimeR3 - /home/pkgmk/work/virtualbox/src/VirtualBox-4.3.26/src/VBox/Runtime/generic/RTPathGetCurrentOnDrive-generic.cpp
  13. kBuild: Compiling RuntimeR3 - /home/pkgmk/work/virtualbox/src/VirtualBox-4.3.26/src/VBox/Runtime/generic/RTProcDaemonize-generic.cpp
  14. kBuild: Compiling RuntimeR3 - /home/pkgmk/work/virtualbox/src/VirtualBox-4.3.26/src/VBox/Runtime/generic/RTSemEventMultiWait-2-ex-generic.cpp
  15. kBuild: Compiling RuntimeR3 - /home/pkgmk/work/virtualbox/src/VirtualBox-4.3.26/src/VBox/Runtime/generic/RTSemEventMultiWaitNoResume-2-ex-generic.cpp
  16. kBuild: Compiling RuntimeR3 - /home/pkgmk/work/virtualbox/src/VirtualBox-4.3.26/src/VBox/Runtime/generic/RTTimeLocalNow-generic.cpp
  17. kBuild: Compiling RuntimeR3 - /home/pkgmk/work/virtualbox/src/VirtualBox-4.3.26/src/VBox/Runtime/generic/RTTimerCreate-generic.cpp
  18. kBuild: Compiling RuntimeR3 - /home/pkgmk/work/virtualbox/src/VirtualBox-4.3.26/src/VBox/Runtime/generic/RTThreadSetAffinityToCpu-generic.cpp
  19. kBuild: Compiling RuntimeR3 - /home/pkgmk/work/virtualbox/src/VirtualBox-4.3.26/src/VBox/Runtime/generic/RTUuidCreate-generic.cpp
  20. kBuild: Compiling RuntimeR3 - /home/pkgmk/work/virtualbox/src/VirtualBox-4.3.26/src/VBox/Runtime/generic/mppresent-generic.cpp
  21. kBuild: Compiling RuntimeR3 - /home/pkgmk/work/virtualbox/src/VirtualBox-4.3.26/src/VBox/Runtime/generic/utf16locale-generic.cpp
  22. kBuild: Compiling RuntimeR3 - /home/pkgmk/work/virtualbox/src/VirtualBox-4.3.26/src/VBox/Runtime/generic/uuid-generic.cpp
  23. kBuild: Compiling RuntimeR3 - /home/pkgmk/work/virtualbox/src/VirtualBox-4.3.26/src/VBox/Runtime/r3/posix/allocex-r3-posix.cpp
  24. kBuild: Compiling RuntimeR3 - /home/pkgmk/work/virtualbox/src/VirtualBox-4.3.26/src/VBox/Runtime/r3/linux/RTThreadGetNativeState-linux.cpp
  25. kBuild: Compiling RuntimeR3 - /home/pkgmk/work/virtualbox/src/VirtualBox-4.3.26/src/VBox/Runtime/r3/linux/mp-linux.cpp
  26. kBuild: Compiling RuntimeR3 - /home/pkgmk/work/virtualbox/src/VirtualBox-4.3.26/src/VBox/Runtime/r3/linux/rtProcInitExePath-linux.cpp
  27. kBuild: Compiling RuntimeR3 - /home/pkgmk/work/virtualbox/src/VirtualBox-4.3.26/src/VBox/Runtime/r3/linux/sched-linux.cpp
  28. kBuild: Compiling RuntimeR3 - /home/pkgmk/work/virtualbox/src/VirtualBox-4.3.26/src/VBox/Runtime/r3/linux/sysfs.cpp
  29. kBuild: Compiling RuntimeR3 - /home/pkgmk/work/virtualbox/src/VirtualBox-4.3.26/src/VBox/Runtime/r3/linux/time-linux.cpp
  30. kBuild: Compiling RuntimeR3 - /home/pkgmk/work/virtualbox/src/VirtualBox-4.3.26/src/VBox/Runtime/r3/linux/thread-affinity-linux.cpp
  31. kBuild: Compiling RuntimeR3 - /home/pkgmk/work/virtualbox/src/VirtualBox-4.3.26/src/VBox/Runtime/r3/linux/RTProcIsRunningByName-linux.cpp
  32. kBuild: Compiling RuntimeR3 - /home/pkgmk/work/virtualbox/src/VirtualBox-4.3.26/src/VBox/Runtime/r3/linux/RTSystemQueryDmiString-linux.cpp
  33. kBuild: Compiling RuntimeR3 - /home/pkgmk/work/virtualbox/src/VirtualBox-4.3.26/src/VBox/Runtime/r3/linux/RTSystemShutdown-linux.cpp
  34. kBuild: Compiling RuntimeR3 - /home/pkgmk/work/virtualbox/src/VirtualBox-4.3.26/src/VBox/Runtime/r3/posix/RTFileQueryFsSizes-posix.cpp
  35. kBuild: Compiling RuntimeR3 - /home/pkgmk/work/virtualbox/src/VirtualBox-4.3.26/src/VBox/Runtime/r3/posix/RTHandleGetStandard-posix.cpp
  36. kBuild: Compiling RuntimeR3 - /home/pkgmk/work/virtualbox/src/VirtualBox-4.3.26/src/VBox/Runtime/r3/posix/RTMemProtect-posix.cpp
  37. kBuild: Compiling RuntimeR3 - /home/pkgmk/work/virtualbox/src/VirtualBox-4.3.26/src/VBox/Runtime/r3/posix/RTPathUserHome-posix.cpp
  38. kBuild: Compiling RuntimeR3 - /home/pkgmk/work/virtualbox/src/VirtualBox-4.3.26/src/VBox/Runtime/r3/posix/RTSystemQueryOSInfo-posix.cpp
  39. kBuild: Compiling RuntimeR3 - /home/pkgmk/work/virtualbox/src/VirtualBox-4.3.26/src/VBox/Runtime/r3/linux/systemmem-linux.cpp
  40. kBuild: Compiling RuntimeR3 - /home/pkgmk/work/virtualbox/src/VirtualBox-4.3.26/src/VBox/Runtime/r3/posix/RTTimeNow-posix.cpp
  41. kBuild: Compiling RuntimeR3 - /home/pkgmk/work/virtualbox/src/VirtualBox-4.3.26/src/VBox/Runtime/r3/posix/RTTimeSet-posix.cpp
  42. kBuild: Compiling RuntimeR3 - /home/pkgmk/work/virtualbox/src/VirtualBox-4.3.26/src/VBox/Runtime/r3/posix/rtmempage-exec-mmap-heap-posix.cpp
  43. kBuild: Compiling RuntimeR3 - /home/pkgmk/work/virtualbox/src/VirtualBox-4.3.26/src/VBox/Runtime/r3/posix/rtmemlocked-posix.cpp
  44. kBuild: Compiling RuntimeR3 - /home/pkgmk/work/virtualbox/src/VirtualBox-4.3.26/src/VBox/Runtime/r3/posix/dir-posix.cpp
  45. kBuild: Compiling RuntimeR3 - /home/pkgmk/work/virtualbox/src/VirtualBox-4.3.26/src/VBox/Runtime/r3/posix/env-posix.cpp
  46. kBuild: Compiling RuntimeR3 - /home/pkgmk/work/virtualbox/src/VirtualBox-4.3.26/src/VBox/Runtime/r3/posix/errvars-posix.cpp
  47. kBuild: Compiling RuntimeR3 - /home/pkgmk/work/virtualbox/src/VirtualBox-4.3.26/src/VBox/Runtime/r3/posix/fileio-posix.cpp
  48. kBuild: Compiling RuntimeR3 - /home/pkgmk/work/virtualbox/src/VirtualBox-4.3.26/src/VBox/Runtime/r3/posix/fileio2-posix.cpp
  49. kBuild: Compiling RuntimeR3 - /home/pkgmk/work/virtualbox/src/VirtualBox-4.3.26/src/VBox/Runtime/r3/posix/filelock-posix.cpp
  50. kBuild: Compiling RuntimeR3 - /home/pkgmk/work/virtualbox/src/VirtualBox-4.3.26/src/VBox/Runtime/r3/posix/fs-posix.cpp
  51. kBuild: Compiling RuntimeR3 - /home/pkgmk/work/virtualbox/src/VirtualBox-4.3.26/src/VBox/Runtime/r3/posix/fs2-posix.cpp
  52. kBuild: Compiling RuntimeR3 - /home/pkgmk/work/virtualbox/src/VirtualBox-4.3.26/src/VBox/Runtime/r3/posix/fs3-posix.cpp
  53. kBuild: Compiling RuntimeR3 - /home/pkgmk/work/virtualbox/src/VirtualBox-4.3.26/src/VBox/Runtime/r3/posix/ldrNative-posix.cpp
  54. kBuild: Compiling RuntimeR3 - /home/pkgmk/work/virtualbox/src/VirtualBox-4.3.26/src/VBox/Runtime/r3/posix/path-posix.cpp
  55. kBuild: Compiling RuntimeR3 - /home/pkgmk/work/virtualbox/src/VirtualBox-4.3.26/src/VBox/Runtime/r3/posix/path2-posix.cpp
  56. kBuild: Compiling RuntimeR3 - /home/pkgmk/work/virtualbox/src/VirtualBox-4.3.26/src/VBox/Runtime/r3/posix/pathhost-posix.cpp
  57. kBuild: Compiling RuntimeR3 - /home/pkgmk/work/virtualbox/src/VirtualBox-4.3.26/src/VBox/Runtime/r3/posix/RTPathUserDocuments-posix.cpp
  58. kBuild: Compiling RuntimeR3 - /home/pkgmk/work/virtualbox/src/VirtualBox-4.3.26/src/VBox/Runtime/r3/posix/pipe-posix.cpp
  59. kBuild: Compiling RuntimeR3 - /home/pkgmk/work/virtualbox/src/VirtualBox-4.3.26/src/VBox/Runtime/r3/posix/process-posix.cpp
  60. kBuild: Compiling RuntimeR3 - /home/pkgmk/work/virtualbox/src/VirtualBox-4.3.26/src/VBox/Runtime/r3/posix/process-creation-posix.cpp
  61. kBuild: Compiling RuntimeR3 - /home/pkgmk/work/virtualbox/src/VirtualBox-4.3.26/src/VBox/Runtime/r3/posix/rand-posix.cpp
  62. kBuild: Compiling RuntimeR3 - /home/pkgmk/work/virtualbox/src/VirtualBox-4.3.26/src/VBox/Runtime/r3/posix/semrw-posix.cpp
  63. kBuild: Compiling RuntimeR3 - /home/pkgmk/work/virtualbox/src/VirtualBox-4.3.26/src/VBox/Runtime/r3/posix/symlink-posix.cpp
  64. kBuild: Compiling RuntimeR3 - /home/pkgmk/work/virtualbox/src/VirtualBox-4.3.26/src/VBox/Runtime/r3/posix/thread-posix.cpp
  65. kBuild: Compiling RuntimeR3 - /home/pkgmk/work/virtualbox/src/VirtualBox-4.3.26/src/VBox/Runtime/r3/posix/thread2-posix.cpp
  66. kBuild: Compiling RuntimeR3 - /home/pkgmk/work/virtualbox/src/VirtualBox-4.3.26/src/VBox/Runtime/r3/posix/timelocal-posix.cpp
  67. kBuild: Compiling RuntimeR3 - /home/pkgmk/work/virtualbox/src/VirtualBox-4.3.26/src/VBox/Runtime/r3/posix/timer-posix.cpp
  68. kBuild: Compiling RuntimeR3 - /home/pkgmk/work/virtualbox/src/VirtualBox-4.3.26/src/VBox/Runtime/r3/posix/tls-posix.cpp
  69. kBuild: Compiling RuntimeR3 - /home/pkgmk/work/virtualbox/src/VirtualBox-4.3.26/src/VBox/Runtime/r3/posix/utf8-posix.cpp
  70. kBuild: Compiling RuntimeR3 - /home/pkgmk/work/virtualbox/src/VirtualBox-4.3.26/src/VBox/Runtime/r3/linux/semevent-linux.cpp
  71. kBuild: Compiling RuntimeR3 - /home/pkgmk/work/virtualbox/src/VirtualBox-4.3.26/src/VBox/Runtime/r3/linux/semeventmulti-linux.cpp
  72. kBuild: Compiling RuntimeR3 - /home/pkgmk/work/virtualbox/src/VirtualBox-4.3.26/src/VBox/Runtime/r3/posix/semmutex-posix.cpp
  73. kBuild: Compiling RuntimeR3 - /home/pkgmk/work/virtualbox/src/VirtualBox-4.3.26/src/VBox/Runtime/generic/RTMpGetDescription-generic.cpp
  74. kBuild: Compiling RuntimeR3 - /home/pkgmk/work/virtualbox/src/VirtualBox-4.3.26/src/VBox/Runtime/common/asm/ASMCpuIdExSlow.asm
  75. kBuild: Compiling RuntimeR3 - /home/pkgmk/work/virtualbox/src/VirtualBox-4.3.26/src/VBox/Runtime/common/asm/ASMAtomicUoAndU64.asm
  76. kBuild: Compiling RuntimeR3 - /home/pkgmk/work/virtualbox/src/VirtualBox-4.3.26/src/VBox/Runtime/common/asm/ASMAtomicUoAndU32.asm
  77. kBuild: Compiling RuntimeR3 - /home/pkgmk/work/virtualbox/src/VirtualBox-4.3.26/src/VBox/Runtime/common/asm/ASMAtomicUoOrU64.asm
  78. kBuild: Compiling RuntimeR3 - /home/pkgmk/work/virtualbox/src/VirtualBox-4.3.26/src/VBox/Runtime/common/asm/ASMAtomicUoOrU32.asm
  79. kBuild: Compiling RuntimeR3 - /home/pkgmk/work/virtualbox/src/VirtualBox-4.3.26/src/VBox/Runtime/common/asm/ASMRdMsrEx.asm
  80. kBuild: Compiling RuntimeR3 - /home/pkgmk/work/virtualbox/src/VirtualBox-4.3.26/src/VBox/Runtime/common/asm/ASMWrMsrEx.asm
  81. kBuild: Compiling RuntimeR3 - /home/pkgmk/work/virtualbox/src/VirtualBox-4.3.26/src/VBox/Runtime/common/math/bignum-amd64-x86.asm
  82. kBuild: Compiling RuntimeR3 - /home/pkgmk/work/virtualbox/src/VirtualBox-4.3.26/src/VBox/Runtime/common/math/RTUInt128MulByU64.asm
  83. kBuild: Compiling RuntimeR0 - /home/pkgmk/work/virtualbox/src/VirtualBox-4.3.26/src/VBox/Runtime/common/log/logellipsis.cpp
  84. kBuild: Compiling RuntimeR0 - /home/pkgmk/work/virtualbox/src/VirtualBox-4.3.26/src/VBox/Runtime/common/log/logrelellipsis.cpp
  85. kBuild: Compiling RuntimeR0 - /home/pkgmk/work/virtualbox/src/VirtualBox-4.3.26/src/VBox/Runtime/common/log/logcom.cpp
  86. kBuild: Compiling RuntimeR0 - /home/pkgmk/work/virtualbox/src/VirtualBox-4.3.26/src/VBox/Runtime/common/log/logformat.cpp
  87. kBuild: Compiling RuntimeR0 - /home/pkgmk/work/virtualbox/src/VirtualBox-4.3.26/src/VBox/Runtime/common/log/tracebuf.cpp
  88. kBuild: Compiling RuntimeR0 - /home/pkgmk/work/virtualbox/src/VirtualBox-4.3.26/src/VBox/Runtime/common/log/tracedefault.cpp
  89. kBuild: Compiling RuntimeR0 - /home/pkgmk/work/virtualbox/src/VirtualBox-4.3.26/src/VBox/Runtime/common/misc/RTAssertMsg1Weak.cpp
  90. kBuild: Compiling RuntimeR0 - /home/pkgmk/work/virtualbox/src/VirtualBox-4.3.26/src/VBox/Runtime/common/misc/RTAssertMsg2.cpp
  91. kBuild: Compiling RuntimeR0 - /home/pkgmk/work/virtualbox/src/VirtualBox-4.3.26/src/VBox/Runtime/common/misc/RTAssertMsg2Add.cpp
  92. kBuild: Compiling RuntimeR0 - /home/pkgmk/work/virtualbox/src/VirtualBox-4.3.26/src/VBox/Runtime/common/misc/RTAssertMsg2AddWeak.cpp
  93. kBuild: Compiling RuntimeR0 - /home/pkgmk/work/virtualbox/src/VirtualBox-4.3.26/src/VBox/Runtime/common/misc/RTAssertMsg2AddWeakV.cpp
  94. kBuild: Compiling RuntimeR0 - /home/pkgmk/work/virtualbox/src/VirtualBox-4.3.26/src/VBox/Runtime/common/misc/RTAssertMsg2Weak.cppkBuild: Compiling RuntimeR0 - /home/pkgmk/work/virtualbox/src/VirtualBox-4.3.26/src/VBox/Runtime/common/misc/RTAssertMsg2WeakV.cpp
  95. kBuild: Compiling RuntimeR0 - /home/pkgmk/work/virtualbox/src/VirtualBox-4.3.26/src/VBox/Runtime/common/misc/buildconfig.cpp
  96. kBuild: Compiling RuntimeR0 - /home/pkgmk/work/virtualbox/src/VirtualBox-4.3.26/src/VBox/Runtime/common/misc/once.cpp
  97. kBuild: Compiling RuntimeR0 - /home/pkgmk/work/virtualbox/src/VirtualBox-4.3.26/src/VBox/Runtime/common/misc/sanity-c.c
  98. kBuild: Compiling RuntimeR0 - /home/pkgmk/work/virtualbox/src/VirtualBox-4.3.26/src/VBox/Runtime/common/misc/sanity-cpp.cpp
  99. kBuild: Compiling RuntimeR0 - /home/pkgmk/work/virtualbox/src/VirtualBox-4.3.26/src/VBox/Runtime/common/misc/term.cpp
  100. kBuild: Compiling RuntimeR0 - /home/pkgmk/work/virtualbox/src/VirtualBox-4.3.26/src/VBox/Runtime/common/path/RTPathFilename.cpp
  101. kBuild: Compiling RuntimeR0 - /home/pkgmk/work/virtualbox/src/VirtualBox-4.3.26/src/VBox/Runtime/common/string/strhash1.cpp
  102. kBuild: Compiling RuntimeR0 - /home/pkgmk/work/virtualbox/src/VirtualBox-4.3.26/src/VBox/Runtime/common/string/strncmp.cpp
  103. kBuild: Compiling RuntimeR0 - /home/pkgmk/work/virtualbox/src/VirtualBox-4.3.26/src/VBox/Runtime/common/string/strpbrk.cpp
  104. kBuild: Compiling RuntimeR0 - /home/pkgmk/work/virtualbox/src/VirtualBox-4.3.26/src/VBox/Runtime/common/string/RTStrCat.cpp
  105. kBuild: Compiling RuntimeR0 - /home/pkgmk/work/virtualbox/src/VirtualBox-4.3.26/src/VBox/Runtime/common/string/RTStrCatEx.cpp
  106. kBuild: Compiling RuntimeR0 - /home/pkgmk/work/virtualbox/src/VirtualBox-4.3.26/src/VBox/Runtime/common/string/RTStrCatP.cpp
  107. kBuild: Compiling RuntimeR0 - /home/pkgmk/work/virtualbox/src/VirtualBox-4.3.26/src/VBox/Runtime/common/string/RTStrCatPEx.cpp
  108. kBuild: Compiling RuntimeR0 - /home/pkgmk/work/virtualbox/src/VirtualBox-4.3.26/src/VBox/Runtime/common/string/RTStrCopy.cpp
  109. kBuild: Compiling RuntimeR0 - /home/pkgmk/work/virtualbox/src/VirtualBox-4.3.26/src/VBox/Runtime/common/string/RTStrCopyEx.cpp
  110. kBuild: Compiling RuntimeR0 - /home/pkgmk/work/virtualbox/src/VirtualBox-4.3.26/src/VBox/Runtime/common/string/RTStrCopyP.cpp
  111. kBuild: Compiling RuntimeR0 - /home/pkgmk/work/virtualbox/src/VirtualBox-4.3.26/src/VBox/Runtime/common/string/RTStrCopyPEx.cpp
  112. kBuild: Compiling RuntimeR0 - /home/pkgmk/work/virtualbox/src/VirtualBox-4.3.26/src/VBox/Runtime/common/string/RTStrNLen.cpp
  113. kBuild: Compiling RuntimeR0 - /home/pkgmk/work/virtualbox/src/VirtualBox-4.3.26/src/VBox/Runtime/common/string/RTStrNLenEx.cpp
  114. kBuild: Compiling RuntimeR0 - /home/pkgmk/work/virtualbox/src/VirtualBox-4.3.26/src/VBox/Runtime/common/table/avlgcptr.cpp
  115. kBuild: Compiling RuntimeR0 - /home/pkgmk/work/virtualbox/src/VirtualBox-4.3.26/src/VBox/Runtime/common/table/avlhcphys.cpp
  116. kBuild: Compiling RuntimeR0 - /home/pkgmk/work/virtualbox/src/VirtualBox-4.3.26/src/VBox/Runtime/common/table/avllu32.cpp
  117. kBuild: Compiling RuntimeR0 - /home/pkgmk/work/virtualbox/src/VirtualBox-4.3.26/src/VBox/Runtime/common/table/avlogcphys.cpp
  118. kBuild: Compiling RuntimeR0 - /home/pkgmk/work/virtualbox/src/VirtualBox-4.3.26/src/VBox/Runtime/common/table/avlogcptr.cpp
  119. kBuild: Compiling RuntimeR0 - /home/pkgmk/work/virtualbox/src/VirtualBox-4.3.26/src/VBox/Runtime/common/table/avlohcphys.cpp
  120. kBuild: Compiling RuntimeR0 - /home/pkgmk/work/virtualbox/src/VirtualBox-4.3.26/src/VBox/Runtime/common/table/avloioport.cpp
  121. kBuild: Compiling RuntimeR0 - /home/pkgmk/work/virtualbox/src/VirtualBox-4.3.26/src/VBox/Runtime/common/table/avlpv.cpp
  122. kBuild: Compiling RuntimeR0 - /home/pkgmk/work/virtualbox/src/VirtualBox-4.3.26/src/VBox/Runtime/common/table/avlrogcphys.cpp
  123. kBuild: Compiling RuntimeR0 - /home/pkgmk/work/virtualbox/src/VirtualBox-4.3.26/src/VBox/Runtime/common/table/avlrogcptr.cpp
  124. kBuild: Compiling RuntimeR0 - /home/pkgmk/work/virtualbox/src/VirtualBox-4.3.26/src/VBox/Runtime/common/table/avlroioport.cpp
  125. kBuild: Compiling RuntimeR0 - /home/pkgmk/work/virtualbox/src/VirtualBox-4.3.26/src/VBox/Runtime/common/table/avlroogcptr.cpp
  126. kBuild: Compiling RuntimeR0 - /home/pkgmk/work/virtualbox/src/VirtualBox-4.3.26/src/VBox/Runtime/common/table/avlu32.cpp
  127. kBuild: Compiling RuntimeR0 - /home/pkgmk/work/virtualbox/src/VirtualBox-4.3.26/src/VBox/Runtime/common/table/avlou32.cpp
  128. kBuild: Compiling RuntimeR0 - /home/pkgmk/work/virtualbox/src/VirtualBox-4.3.26/src/VBox/Runtime/common/time/timesup.cpp
  129. kBuild: Compiling RuntimeR0 - /home/pkgmk/work/virtualbox/src/VirtualBox-4.3.26/src/VBox/Runtime/generic/RTAssertShouldPanic-generic.cpp
  130. kBuild: Compiling RuntimeR0 - /home/pkgmk/work/virtualbox/src/VirtualBox-4.3.26/src/VBox/Runtime/generic/critsect-generic.cpp
  131. kBuild: Compiling RuntimeR0 - /home/pkgmk/work/virtualbox/src/VirtualBox-4.3.26/src/VBox/Runtime/common/misc/setjmp.asm
  132. kBuild: Compiling RuntimeR0 - /home/pkgmk/work/virtualbox/src/VirtualBox-4.3.26/src/VBox/Runtime/common/string/memchr.asm
  133. kBuild: Compiling RuntimeR0 - /home/pkgmk/work/virtualbox/src/VirtualBox-4.3.26/src/VBox/Runtime/common/string/memcmp.asm
  134. kBuild: Compiling RuntimeR0 - /home/pkgmk/work/virtualbox/src/VirtualBox-4.3.26/src/VBox/Runtime/common/string/memcpy.asm
  135. kBuild: Compiling RuntimeR0 - /home/pkgmk/work/virtualbox/src/VirtualBox-4.3.26/src/VBox/Runtime/common/string/mempcpy.asm
  136. kBuild: Compiling RuntimeR0 - /home/pkgmk/work/virtualbox/src/VirtualBox-4.3.26/src/VBox/Runtime/common/string/memmove.asm
  137. kBuild: Compiling RuntimeR0 - /home/pkgmk/work/virtualbox/src/VirtualBox-4.3.26/src/VBox/Runtime/common/string/memset.asm
  138. kBuild: Compiling RuntimeR0 - /home/pkgmk/work/virtualbox/src/VirtualBox-4.3.26/src/VBox/Runtime/common/string/strchr.asm
  139. kBuild: Compiling RuntimeR0 - /home/pkgmk/work/virtualbox/src/VirtualBox-4.3.26/src/VBox/Runtime/common/string/strcpy.asm
  140. kBuild: Compiling RuntimeR0 - /home/pkgmk/work/virtualbox/src/VirtualBox-4.3.26/src/VBox/Runtime/common/string/strncpy.asm
  141. kBuild: Compiling RuntimeR0 - /home/pkgmk/work/virtualbox/src/VirtualBox-4.3.26/src/VBox/Runtime/common/string/strcmp.asm
  142. kBuild: Compiling RuntimeR0 - /home/pkgmk/work/virtualbox/src/VirtualBox-4.3.26/src/VBox/Runtime/common/string/strlen.asm
  143. kBuild: Compiling RuntimeR0 - /home/pkgmk/work/virtualbox/src/VirtualBox-4.3.26/src/VBox/Runtime/common/time/timesupref.cpp
  144. kBuild: Compiling RuntimeR0 - /home/pkgmk/work/virtualbox/src/VirtualBox-4.3.26/src/VBox/Runtime/common/asm/ASMCpuIdExSlow.asm
  145. kBuild: Compiling RuntimeR0 - /home/pkgmk/work/virtualbox/src/VirtualBox-4.3.26/src/VBox/Runtime/common/asm/ASMAtomicUoAndU64.asmkBuild: Compiling RuntimeR0 - /home/pkgmk/work/virtualbox/src/VirtualBox-4.3.26/src/VBox/Runtime/common/asm/ASMAtomicUoAndU32.asm
  146. kBuild: Compiling RuntimeR0 - /home/pkgmk/work/virtualbox/src/VirtualBox-4.3.26/src/VBox/Runtime/common/asm/ASMAtomicUoOrU64.asm
  147. kBuild: Compiling RuntimeR0 - /home/pkgmk/work/virtualbox/src/VirtualBox-4.3.26/src/VBox/Runtime/common/asm/ASMAtomicUoOrU32.asm
  148. kBuild: Compiling RuntimeR0 - /home/pkgmk/work/virtualbox/src/VirtualBox-4.3.26/src/VBox/Runtime/common/asm/ASMRdMsrEx.asm
  149. kBuild: Compiling RuntimeR0 - /home/pkgmk/work/virtualbox/src/VirtualBox-4.3.26/src/VBox/Runtime/common/asm/ASMWrMsrEx.asm
  150. kBuild: Compiling RuntimeEFCPP - /home/pkgmk/work/virtualbox/src/VirtualBox-4.3.26/src/VBox/Runtime/r3/alloc-ef-cpp.cpp
  151. kBuild: Compiling RuntimeR3NoCRTGCC - /home/pkgmk/work/virtualbox/src/VirtualBox-4.3.26/src/VBox/Runtime/common/misc/sanity-cpp.cpp
  152. kBuild: Compiling RuntimeR3NoCRTGCC - /home/pkgmk/work/virtualbox/src/VirtualBox-4.3.26/src/VBox/Runtime/common/misc/sanity-c.c
  153. kBuild: Compiling RuntimeR3NoCRTGCC - /home/pkgmk/work/virtualbox/src/VirtualBox-4.3.26/src/VBox/Runtime/common/misc/setjmp.asm
  154. kBuild: Compiling RuntimeR3NoCRTGCC - /home/pkgmk/work/virtualbox/src/VirtualBox-4.3.26/src/VBox/Runtime/common/string/memchr.asm
  155. kBuild: Compiling RuntimeR3NoCRTGCC - /home/pkgmk/work/virtualbox/src/VirtualBox-4.3.26/src/VBox/Runtime/common/string/memcmp.asm
  156. kBuild: Compiling RuntimeR3NoCRTGCC - /home/pkgmk/work/virtualbox/src/VirtualBox-4.3.26/src/VBox/Runtime/common/string/memcpy.asm
  157. kBuild: Compiling RuntimeR3NoCRTGCC - /home/pkgmk/work/virtualbox/src/VirtualBox-4.3.26/src/VBox/Runtime/common/string/mempcpy.asm
  158. kBuild: Compiling RuntimeR3NoCRTGCC - /home/pkgmk/work/virtualbox/src/VirtualBox-4.3.26/src/VBox/Runtime/common/string/memmove.asm
  159. kBuild: Compiling RuntimeR3NoCRTGCC - /home/pkgmk/work/virtualbox/src/VirtualBox-4.3.26/src/VBox/Runtime/common/string/memset.asm
  160. kBuild: Compiling RuntimeR3NoCRTGCC - /home/pkgmk/work/virtualbox/src/VirtualBox-4.3.26/src/VBox/Runtime/common/string/strchr.asm
  161. kBuild: Compiling RuntimeR3NoCRTGCC - /home/pkgmk/work/virtualbox/src/VirtualBox-4.3.26/src/VBox/Runtime/common/string/strcpy.asm
  162. kBuild: Compiling RuntimeR3NoCRTGCC - /home/pkgmk/work/virtualbox/src/VirtualBox-4.3.26/src/VBox/Runtime/common/string/strncpy.asm
  163. kBuild: Compiling RuntimeR3NoCRTGCC - /home/pkgmk/work/virtualbox/src/VirtualBox-4.3.26/src/VBox/Runtime/common/string/strcmp.asm
  164. kBuild: Compiling RuntimeR3NoCRTGCC - /home/pkgmk/work/virtualbox/src/VirtualBox-4.3.26/src/VBox/Runtime/common/string/strlen.asm
  165. kBuild: Compiling RuntimeR3NoCRTGCC - /home/pkgmk/work/virtualbox/src/VirtualBox-4.3.26/src/VBox/Runtime/common/math/ceill.asm
  166. kBuild: Compiling RuntimeR3NoCRTGCC - /home/pkgmk/work/virtualbox/src/VirtualBox-4.3.26/src/VBox/Runtime/common/math/cosl.asm
  167. kBuild: Compiling RuntimeR3NoCRTGCC - /home/pkgmk/work/virtualbox/src/VirtualBox-4.3.26/src/VBox/Runtime/common/math/fabs.asm
  168. kBuild: Compiling RuntimeR3NoCRTGCC - /home/pkgmk/work/virtualbox/src/VirtualBox-4.3.26/src/VBox/Runtime/common/math/fabsf.asmkBuild: Compiling RuntimeR3NoCRTGCC - /home/pkgmk/work/virtualbox/src/VirtualBox-4.3.26/src/VBox/Runtime/common/math/fabsl.asm
  169. kBuild: Compiling RuntimeR3NoCRTGCC - /home/pkgmk/work/virtualbox/src/VirtualBox-4.3.26/src/VBox/Runtime/common/math/floor.asm
  170. kBuild: Compiling RuntimeR3NoCRTGCC - /home/pkgmk/work/virtualbox/src/VirtualBox-4.3.26/src/VBox/Runtime/common/math/floorf.asm
  171. kBuild: Compiling RuntimeR3NoCRTGCC - /home/pkgmk/work/virtualbox/src/VirtualBox-4.3.26/src/VBox/Runtime/common/math/floorl.asm
  172. kBuild: Compiling RuntimeR3NoCRTGCC - /home/pkgmk/work/virtualbox/src/VirtualBox-4.3.26/src/VBox/Runtime/common/math/ldexpl.asm
  173. kBuild: Compiling RuntimeR3NoCRTGCC - /home/pkgmk/work/virtualbox/src/VirtualBox-4.3.26/src/VBox/Runtime/common/math/llrint.asm
  174. kBuild: Compiling RuntimeR3NoCRTGCC - /home/pkgmk/work/virtualbox/src/VirtualBox-4.3.26/src/VBox/Runtime/common/math/llrintf.asm
  175. kBuild: Compiling RuntimeR3NoCRTGCC - /home/pkgmk/work/virtualbox/src/VirtualBox-4.3.26/src/VBox/Runtime/common/math/llrintl.asm
  176. kBuild: Compiling RuntimeR3NoCRTGCC - /home/pkgmk/work/virtualbox/src/VirtualBox-4.3.26/src/VBox/Runtime/common/math/logl.asm
  177. kBuild: Compiling RuntimeR3NoCRTGCC - /home/pkgmk/work/virtualbox/src/VirtualBox-4.3.26/src/VBox/Runtime/common/math/lrint.asm
  178. kBuild: Compiling RuntimeR3NoCRTGCC - /home/pkgmk/work/virtualbox/src/VirtualBox-4.3.26/src/VBox/Runtime/common/math/lrintf.asm
  179. kBuild: Compiling RuntimeR3NoCRTGCC - /home/pkgmk/work/virtualbox/src/VirtualBox-4.3.26/src/VBox/Runtime/common/math/lrintl.asm
  180. kBuild: Compiling RuntimeR3NoCRTGCC - /home/pkgmk/work/virtualbox/src/VirtualBox-4.3.26/src/VBox/Runtime/common/math/remainder.asm
  181. kBuild: Compiling RuntimeR3NoCRTGCC - /home/pkgmk/work/virtualbox/src/VirtualBox-4.3.26/src/VBox/Runtime/common/math/remainderf.asm
  182. kBuild: Compiling RuntimeR3NoCRTGCC - /home/pkgmk/work/virtualbox/src/VirtualBox-4.3.26/src/VBox/Runtime/common/math/remainderl.asm
  183. kBuild: Compiling RuntimeR3NoCRTGCC - /home/pkgmk/work/virtualbox/src/VirtualBox-4.3.26/src/VBox/Runtime/common/math/sinl.asm
  184. kBuild: Compiling RuntimeR3NoCRTGCC - /home/pkgmk/work/virtualbox/src/VirtualBox-4.3.26/src/VBox/Runtime/common/math/tanl.asm
  185. kBuild: Compiling RuntimeR3NoCRTGCC - /home/pkgmk/work/virtualbox/src/VirtualBox-4.3.26/src/VBox/Runtime/common/math/trunc.asm
  186. kBuild: Compiling RuntimeR3NoCRTGCC - /home/pkgmk/work/virtualbox/src/VirtualBox-4.3.26/src/VBox/Runtime/common/math/truncf.asm
  187. kBuild: Compiling RuntimeR3NoCRTGCC - /home/pkgmk/work/virtualbox/src/VirtualBox-4.3.26/src/VBox/Runtime/common/math/truncl.asm
  188. kBuild: Compiling RuntimeR3NoCRTGCC - /home/pkgmk/work/virtualbox/src/VirtualBox-4.3.26/src/VBox/Runtime/common/string/memchr_alias.c
  189. kBuild: Compiling RuntimeR3NoCRTGCC - /home/pkgmk/work/virtualbox/src/VirtualBox-4.3.26/src/VBox/Runtime/common/string/memcmp_alias.c
  190. kBuild: Compiling RuntimeR3NoCRTGCC - /home/pkgmk/work/virtualbox/src/VirtualBox-4.3.26/src/VBox/Runtime/common/string/memcpy_alias.c
  191. kBuild: Compiling RuntimeR3NoCRTGCC - /home/pkgmk/work/virtualbox/src/VirtualBox-4.3.26/src/VBox/Runtime/common/string/memmove_alias.c
  192. kBuild: Compiling RuntimeR3NoCRTGCC - /home/pkgmk/work/virtualbox/src/VirtualBox-4.3.26/src/VBox/Runtime/common/string/memset_alias.c
  193. kBuild: Compiling RuntimeR3NoCRTGCC - /home/pkgmk/work/virtualbox/src/VirtualBox-4.3.26/src/VBox/Runtime/common/string/strchr_alias.c
  194. kBuild: Compiling RuntimeR3NoCRTGCC - /home/pkgmk/work/virtualbox/src/VirtualBox-4.3.26/src/VBox/Runtime/common/string/strcmp_alias.c
  195. kBuild: Compiling RuntimeR3NoCRTGCC - /home/pkgmk/work/virtualbox/src/VirtualBox-4.3.26/src/VBox/Runtime/common/string/strlen_alias.c
  196. kBuild: Compiling RuntimeRC - /home/pkgmk/work/virtualbox/src/VirtualBox-4.3.26/src/VBox/Runtime/common/checksum/alt-md5.cpp
  197. kBuild: Compiling RuntimeRC - /home/pkgmk/work/virtualbox/src/VirtualBox-4.3.26/src/VBox/Runtime/common/checksum/crc32.cpp
  198. kBuild: Compiling RuntimeRC - /home/pkgmk/work/virtualbox/src/VirtualBox-4.3.26/src/VBox/Runtime/common/checksum/crc64.cpp
  199. kBuild: Compiling RuntimeRC - /home/pkgmk/work/virtualbox/src/VirtualBox-4.3.26/src/VBox/Runtime/common/log/log.cpp
  200. kBuild: Compiling RuntimeRC - /home/pkgmk/work/virtualbox/src/VirtualBox-4.3.26/src/VBox/Runtime/common/log/logellipsis.cpp
  201. kBuild: Compiling RuntimeRC - /home/pkgmk/work/virtualbox/src/VirtualBox-4.3.26/src/VBox/Runtime/common/log/logrel.cpp
  202. kBuild: Compiling RuntimeRC - /home/pkgmk/work/virtualbox/src/VirtualBox-4.3.26/src/VBox/Runtime/common/log/logrelellipsis.cpp
  203. kBuild: Compiling RuntimeRC - /home/pkgmk/work/virtualbox/src/VirtualBox-4.3.26/src/VBox/Runtime/common/log/logcom.cpp
  204. kBuild: Compiling RuntimeRC - /home/pkgmk/work/virtualbox/src/VirtualBox-4.3.26/src/VBox/Runtime/common/log/logformat.cpp
  205. kBuild: Compiling RuntimeRC - /home/pkgmk/work/virtualbox/src/VirtualBox-4.3.26/src/VBox/Runtime/common/log/tracebuf.cpp
  206. kBuild: Compiling RuntimeRC - /home/pkgmk/work/virtualbox/src/VirtualBox-4.3.26/src/VBox/Runtime/common/log/tracedefault.cpp
  207. kBuild: Compiling RuntimeRC - /home/pkgmk/work/virtualbox/src/VirtualBox-4.3.26/src/VBox/Runtime/common/misc/RTAssertMsg1Weak.cpp
  208. kBuild: Compiling RuntimeRC - /home/pkgmk/work/virtualbox/src/VirtualBox-4.3.26/src/VBox/Runtime/common/misc/RTAssertMsg2.cpp
  209. kBuild: Compiling RuntimeRC - /home/pkgmk/work/virtualbox/src/VirtualBox-4.3.26/src/VBox/Runtime/common/misc/RTAssertMsg2Add.cpp
  210. kBuild: Compiling RuntimeRC - /home/pkgmk/work/virtualbox/src/VirtualBox-4.3.26/src/VBox/Runtime/common/misc/RTAssertMsg2AddWeak.cpp
  211. kBuild: Compiling RuntimeRC - /home/pkgmk/work/virtualbox/src/VirtualBox-4.3.26/src/VBox/Runtime/common/misc/RTAssertMsg2AddWeakV.cpp
  212. kBuild: Compiling RuntimeRC - /home/pkgmk/work/virtualbox/src/VirtualBox-4.3.26/src/VBox/Runtime/common/misc/RTAssertMsg2Weak.cpp
  213. kBuild: Compiling RuntimeRC - /home/pkgmk/work/virtualbox/src/VirtualBox-4.3.26/src/VBox/Runtime/common/misc/RTAssertMsg2WeakV.cpp
  214. kBuild: Compiling RuntimeRC - /home/pkgmk/work/virtualbox/src/VirtualBox-4.3.26/src/VBox/Runtime/common/misc/assert.cpp
  215. kBuild: Compiling RuntimeRC - /home/pkgmk/work/virtualbox/src/VirtualBox-4.3.26/src/VBox/Runtime/common/misc/buildconfig.cpp
  216. kBuild: Compiling RuntimeRC - /home/pkgmk/work/virtualbox/src/VirtualBox-4.3.26/src/VBox/Runtime/common/misc/sanity-c.c
  217. kBuild: Compiling RuntimeRC - /home/pkgmk/work/virtualbox/src/VirtualBox-4.3.26/src/VBox/Runtime/common/misc/sanity-cpp.cpp
  218. kBuild: Compiling RuntimeRC - /home/pkgmk/work/virtualbox/src/VirtualBox-4.3.26/src/VBox/Runtime/common/path/RTPathFilename.cpp
  219. kBuild: Compiling RuntimeRC - /home/pkgmk/work/virtualbox/src/VirtualBox-4.3.26/src/VBox/Runtime/common/string/strformat.cpp
  220. kBuild: Compiling RuntimeRC - /home/pkgmk/work/virtualbox/src/VirtualBox-4.3.26/src/VBox/Runtime/common/string/strformatnum.cpp
  221. kBuild: Compiling RuntimeRC - /home/pkgmk/work/virtualbox/src/VirtualBox-4.3.26/src/VBox/Runtime/common/string/strformatrt.cpp
  222. kBuild: Compiling RuntimeRC - /home/pkgmk/work/virtualbox/src/VirtualBox-4.3.26/src/VBox/Runtime/common/string/strformattype.cpp
  223. kBuild: Compiling RuntimeRC - /home/pkgmk/work/virtualbox/src/VirtualBox-4.3.26/src/VBox/Runtime/common/string/strncmp.cpp
  224. kBuild: Compiling RuntimeRC - /home/pkgmk/work/virtualbox/src/VirtualBox-4.3.26/src/VBox/Runtime/common/string/strpbrk.cpp
  225. kBuild: Compiling RuntimeRC - /home/pkgmk/work/virtualbox/src/VirtualBox-4.3.26/src/VBox/Runtime/common/string/strprintf.cpp
  226. kBuild: Compiling RuntimeRC - /home/pkgmk/work/virtualbox/src/VirtualBox-4.3.26/src/VBox/Runtime/common/string/RTStrCopy.cpp
  227. kBuild: Compiling RuntimeRC - /home/pkgmk/work/virtualbox/src/VirtualBox-4.3.26/src/VBox/Runtime/common/string/RTStrCopyEx.cpp
  228. kBuild: Compiling RuntimeRC - /home/pkgmk/work/virtualbox/src/VirtualBox-4.3.26/src/VBox/Runtime/common/table/avllu32.cpp
  229. kBuild: Compiling RuntimeRC - /home/pkgmk/work/virtualbox/src/VirtualBox-4.3.26/src/VBox/Runtime/common/table/avlou32.cpp
  230. kBuild: Compiling RuntimeRC - /home/pkgmk/work/virtualbox/src/VirtualBox-4.3.26/src/VBox/Runtime/common/table/avlogcphys.cpp
  231. kBuild: Compiling RuntimeRC - /home/pkgmk/work/virtualbox/src/VirtualBox-4.3.26/src/VBox/Runtime/common/table/avlogcptr.cpp
  232. kBuild: Compiling RuntimeRC - /home/pkgmk/work/virtualbox/src/VirtualBox-4.3.26/src/VBox/Runtime/common/table/avlohcphys.cpp
  233. kBuild: Compiling RuntimeRC - /home/pkgmk/work/virtualbox/src/VirtualBox-4.3.26/src/VBox/Runtime/common/table/avloioport.cpp
  234. kBuild: Compiling RuntimeRC - /home/pkgmk/work/virtualbox/src/VirtualBox-4.3.26/src/VBox/Runtime/common/table/avlrogcphys.cpp
  235. kBuild: Compiling RuntimeRC - /home/pkgmk/work/virtualbox/src/VirtualBox-4.3.26/src/VBox/Runtime/common/table/avlrogcptr.cpp
  236. kBuild: Compiling RuntimeRC - /home/pkgmk/work/virtualbox/src/VirtualBox-4.3.26/src/VBox/Runtime/common/table/avlroioport.cpp
  237. kBuild: Compiling RuntimeRC - /home/pkgmk/work/virtualbox/src/VirtualBox-4.3.26/src/VBox/Runtime/common/table/avlroogcptr.cpp
  238. kBuild: Compiling RuntimeRC - /home/pkgmk/work/virtualbox/src/VirtualBox-4.3.26/src/VBox/Runtime/common/table/avlu32.cpp
  239. kBuild: Compiling RuntimeRC - /home/pkgmk/work/virtualbox/src/VirtualBox-4.3.26/src/VBox/Runtime/common/time/timeprog.cpp
  240. kBuild: Compiling RuntimeRC - /home/pkgmk/work/virtualbox/src/VirtualBox-4.3.26/src/VBox/Runtime/common/time/timesup.cpp
  241. kBuild: Compiling RuntimeRC - /home/pkgmk/work/virtualbox/src/VirtualBox-4.3.26/src/VBox/Runtime/gc/initterm-gc.cpp
  242. kBuild: Compiling RuntimeRC - /home/pkgmk/work/virtualbox/src/VirtualBox-4.3.26/src/VBox/Runtime/generic/RTAssertShouldPanic-generic.cpp
  243. kBuild: Compiling RuntimeRC - /home/pkgmk/work/virtualbox/src/VirtualBox-4.3.26/src/VBox/Runtime/generic/errvars-generic.cpp
  244. kBuild: Compiling RuntimeRC - /home/pkgmk/work/virtualbox/src/VirtualBox-4.3.26/src/VBox/Runtime/common/misc/setjmp.asm
  245. kBuild: Compiling RuntimeRC - /home/pkgmk/work/virtualbox/src/VirtualBox-4.3.26/src/VBox/Runtime/common/string/memchr.asm
  246. kBuild: Compiling RuntimeRC - /home/pkgmk/work/virtualbox/src/VirtualBox-4.3.26/src/VBox/Runtime/common/string/memcmp.asm
  247. kBuild: Compiling RuntimeRC - /home/pkgmk/work/virtualbox/src/VirtualBox-4.3.26/src/VBox/Runtime/common/string/memcpy.asm
  248. kBuild: Compiling RuntimeRC - /home/pkgmk/work/virtualbox/src/VirtualBox-4.3.26/src/VBox/Runtime/common/string/mempcpy.asm
  249. kBuild: Compiling RuntimeRC - /home/pkgmk/work/virtualbox/src/VirtualBox-4.3.26/src/VBox/Runtime/common/string/memmove.asm
  250. kBuild: Compiling RuntimeRC - /home/pkgmk/work/virtualbox/src/VirtualBox-4.3.26/src/VBox/Runtime/common/string/memset.asm
  251. kBuild: Compiling RuntimeRC - /home/pkgmk/work/virtualbox/src/VirtualBox-4.3.26/src/VBox/Runtime/common/string/strchr.asm
  252. kBuild: Compiling RuntimeRC - /home/pkgmk/work/virtualbox/src/VirtualBox-4.3.26/src/VBox/Runtime/common/string/strcpy.asm
  253. kBuild: Compiling RuntimeRC - /home/pkgmk/work/virtualbox/src/VirtualBox-4.3.26/src/VBox/Runtime/common/string/strncpy.asm
  254. kBuild: Compiling RuntimeRC - /home/pkgmk/work/virtualbox/src/VirtualBox-4.3.26/src/VBox/Runtime/common/string/strcmp.asm
  255. kBuild: Compiling RuntimeRC - /home/pkgmk/work/virtualbox/src/VirtualBox-4.3.26/src/VBox/Runtime/common/string/strlen.asm
  256. kBuild: Compiling RuntimeRC - /home/pkgmk/work/virtualbox/src/VirtualBox-4.3.26/src/VBox/Runtime/common/time/timesupref.cpp
  257. kBuild: Compiling RuntimeR0Drv - /home/pkgmk/work/virtualbox/src/VirtualBox-4.3.26/src/VBox/Runtime/common/alloc/alloc.cpp
  258. kBuild: Compiling RuntimeR0Drv - /home/pkgmk/work/virtualbox/src/VirtualBox-4.3.26/src/VBox/Runtime/common/alloc/heapsimple.cpp
  259. kBuild: Compiling RuntimeR0Drv - /home/pkgmk/work/virtualbox/src/VirtualBox-4.3.26/src/VBox/Runtime/common/alloc/heapoffset.cpp
  260. kBuild: Compiling RuntimeR0Drv - /home/pkgmk/work/virtualbox/src/VirtualBox-4.3.26/src/VBox/Runtime/common/checksum/alt-md5.cpp
  261. kBuild: Compiling RuntimeR0Drv - /home/pkgmk/work/virtualbox/src/VirtualBox-4.3.26/src/VBox/Runtime/common/checksum/crc32.cpp
  262. kBuild: Compiling RuntimeR0Drv - /home/pkgmk/work/virtualbox/src/VirtualBox-4.3.26/src/VBox/Runtime/common/checksum/crc64.cpp
  263. In file included from /home/pkgmk/work/virtualbox/src/VirtualBox-4.3.26/include/iprt/types.h:116:0,
  264.                  from /home/pkgmk/work/virtualbox/src/VirtualBox-4.3.26/include/iprt/crc.h:30,
  265.                  from /home/pkgmk/work/virtualbox/src/VirtualBox-4.3.26/src/VBox/Runtime/common/checksum/crc64.cpp:36:
  266. /lib/modules/4.0.3/build/include/linux/compiler.h:201:29: error: can't set 'no_instrument_function' attribute after definition
  267.  static __always_inline void data_access_exceeds_word_size(void)
  268.                              ^
  269. /lib/modules/4.0.3/build/include/linux/compiler.h:205:29: error: can't set 'no_instrument_function' attribute after definition
  270.  static __always_inline void __read_once_size(const volatile void *p, void *res, int size)
  271.                              ^
  272. /lib/modules/4.0.3/build/include/linux/compiler.h:222:29: error: can't set 'no_instrument_function' attribute after definition
  273.  static __always_inline void __write_once_size(volatile void *p, void *res, int size)
  274.                              ^
  275. In file included from /home/pkgmk/work/virtualbox/src/VirtualBox-4.3.26/include/iprt/types.h:116:0,
  276.                  from /home/pkgmk/work/virtualbox/src/VirtualBox-4.3.26/include/iprt/crc.h:30,
  277.                  from /home/pkgmk/work/virtualbox/src/VirtualBox-4.3.26/src/VBox/Runtime/common/checksum/crc32.cpp:77:
  278. /lib/modules/4.0.3/build/include/linux/compiler.h:201:29: error: can't set 'no_instrument_function' attribute after definition
  279.  static __always_inline void data_access_exceeds_word_size(void)
  280.                              ^
  281. /lib/modules/4.0.3/build/include/linux/compiler.h:205:29: error: can't set 'no_instrument_function' attribute after definition
  282.  static __always_inline void __read_once_size(const volatile void *p, void *res, int size)
  283.                              ^
  284. /lib/modules/4.0.3/build/include/linux/compiler.h:222:29: error: can't set 'no_instrument_function' attribute after definition
  285.  static __always_inline void __write_once_size(volatile void *p, void *res, int size)
  286.                              ^
  287. kmk: *** [/home/pkgmk/work/virtualbox/src/VirtualBox-4.3.26/out/linux.amd64/release/obj/RuntimeR0Drv/common/checksum/crc32.o] Error 1
  288. The failing command:
  289. @g++ -c -O2 -nostdinc -iwithprefix include -include /lib/modules/4.0.3/build/include/linux/kconfig.h -Wall -Wextra -Wno-missing-field-initializers -Wno-unused -Wno-trigraphs -fdiagnostics-show-option -Wno-unused-parameter -Wno-sign-compare -fdiagnostics-show-option -fno-stack-protector -O2 -mtune=generic -fno-omit-frame-pointer -fno-strict-aliasing -fno-common -include /home/pkgmk/work/virtualbox/src/VirtualBox-4.3.26/include/VBox/SUPDrvMangling.h -m64 -mno-red-zone -mcmodel=kernel -mno-sse -mno-mmx -mno-sse2 -mno-3dnow -fno-reorder-blocks -fno-asynchronous-unwind-tables -funit-at-a-time -Wno-sign-compare -fno-exceptions -fno-rtti -include /home/pkgmk/work/virtualbox/src/VirtualBox-4.3.26/include/VBox/SUPDrvMangling.h -I/home/pkgmk/work/virtualbox/src/VirtualBox-4.3.26/src/VBox/Runtime/r0drv/linux -I/home/pkgmk/work/virtualbox/src/VirtualBox-4.3.26/src/VBox/Runtime -I/home/pkgmk/work/virtualbox/src/VirtualBox-4.3.26/src/VBox/Runtime/include -I/lib/modules/4.0.3/build/include -I/lib/modules/4.0.3/build/include/asm-i386/mach-default -I/lib/modules/4.0.3/build/include/asm-x86/mach-default -I/lib/modules/4.0.3/build/include/drm -I/lib/modules/4.0.3/build/arch/x86/include -I/lib/modules/4.0.3/build/arch/x86/include/asm/mach-default -I/lib/modules/4.0.3/build/arch/x86/include/uapi -I/lib/modules/4.0.3/build/arch/x86/include/generated -I/lib/modules/4.0.3/build/arch/x86/include/generated/uapi -I/lib/modules/4.0.3/build/include/uapi -I/lib/modules/4.0.3/build/include/generated/uapi -I/lib/modules/4.0.3/build/include -I/home/pkgmk/work/virtualbox/src/VirtualBox-4.3.26/out/linux.amd64/release/obj/RuntimeR0Drv/dtrace -I/home/pkgmk/work/virtualbox/src/VirtualBox-4.3.26/include -I/home/pkgmk/work/virtualbox/src/VirtualBox-4.3.26/out/linux.amd64/release -DVBOX -DVBOX_OSE -DVBOX_WITH_64_BITS_GUESTS -DVBOX_WITH_DEBUGGER -DRT_OS_LINUX -D_FILE_OFFSET_BITS=64 -DRT_ARCH_AMD64 -D__AMD64__ -DIN_RING0 -DIN_RT_R0 -DHC_ARCH_BITS=64 -DGC_ARCH_BITS=64 -D__KERNEL__ -DMODULE -DIN_RT_R0 -DRT_WITH_VBOX -DRT_WITHOUT_NOCRT_WRAPPERS -DRT_NO_EXPORT_SYMBOL -DMODULE -DKBUILD_MODNAME=KBUILD_STR\(vboxdrv\) -DKBUILD_BASENAME=KBUILD_STR\(vboxdrv\) -DIN_SUP_R0 -Wp,-MD,/home/pkgmk/work/virtualbox/src/VirtualBox-4.3.26/out/linux.amd64/release/obj/RuntimeR0Drv/common/checksum/crc32.o.dep -Wp,-MT,/home/pkgmk/work/virtualbox/src/VirtualBox-4.3.26/out/linux.amd64/release/obj/RuntimeR0Drv/common/checksum/crc32.o -Wp,-MP -o /home/pkgmk/work/virtualbox/src/VirtualBox-4.3.26/out/linux.amd64/release/obj/RuntimeR0Drv/common/checksum/crc32.o /home/pkgmk/work/virtualbox/src/VirtualBox-4.3.26/src/VBox/Runtime/common/checksum/crc32.cpp
  290. kmk: *** Waiting for unfinished jobs....
  291. kmk: *** [/home/pkgmk/work/virtualbox/src/VirtualBox-4.3.26/out/linux.amd64/release/obj/RuntimeR0Drv/common/checksum/crc64.o] Error 1
  292. The failing command:
  293. @g++ -c -O2 -nostdinc -iwithprefix include -include /lib/modules/4.0.3/build/include/linux/kconfig.h -Wall -Wextra -Wno-missing-field-initializers -Wno-unused -Wno-trigraphs -fdiagnostics-show-option -Wno-unused-parameter -Wno-sign-compare -fdiagnostics-show-option -fno-stack-protector -O2 -mtune=generic -fno-omit-frame-pointer -fno-strict-aliasing -fno-common -include /home/pkgmk/work/virtualbox/src/VirtualBox-4.3.26/include/VBox/SUPDrvMangling.h -m64 -mno-red-zone -mcmodel=kernel -mno-sse -mno-mmx -mno-sse2 -mno-3dnow -fno-reorder-blocks -fno-asynchronous-unwind-tables -funit-at-a-time -Wno-sign-compare -fno-exceptions -fno-rtti -include /home/pkgmk/work/virtualbox/src/VirtualBox-4.3.26/include/VBox/SUPDrvMangling.h -I/home/pkgmk/work/virtualbox/src/VirtualBox-4.3.26/src/VBox/Runtime/r0drv/linux -I/home/pkgmk/work/virtualbox/src/VirtualBox-4.3.26/src/VBox/Runtime -I/home/pkgmk/work/virtualbox/src/VirtualBox-4.3.26/src/VBox/Runtime/include -I/lib/modules/4.0.3/build/include -I/lib/modules/4.0.3/build/include/asm-i386/mach-default -I/lib/modules/4.0.3/build/include/asm-x86/mach-default -I/lib/modules/4.0.3/build/include/drm -I/lib/modules/4.0.3/build/arch/x86/include -I/lib/modules/4.0.3/build/arch/x86/include/asm/mach-default -I/lib/modules/4.0.3/build/arch/x86/include/uapi -I/lib/modules/4.0.3/build/arch/x86/include/generated -I/lib/modules/4.0.3/build/arch/x86/include/generated/uapi -I/lib/modules/4.0.3/build/include/uapi -I/lib/modules/4.0.3/build/include/generated/uapi -I/lib/modules/4.0.3/build/include -I/home/pkgmk/work/virtualbox/src/VirtualBox-4.3.26/out/linux.amd64/release/obj/RuntimeR0Drv/dtrace -I/home/pkgmk/work/virtualbox/src/VirtualBox-4.3.26/include -I/home/pkgmk/work/virtualbox/src/VirtualBox-4.3.26/out/linux.amd64/release -DVBOX -DVBOX_OSE -DVBOX_WITH_64_BITS_GUESTS -DVBOX_WITH_DEBUGGER -DRT_OS_LINUX -D_FILE_OFFSET_BITS=64 -DRT_ARCH_AMD64 -D__AMD64__ -DIN_RING0 -DIN_RT_R0 -DHC_ARCH_BITS=64 -DGC_ARCH_BITS=64 -D__KERNEL__ -DMODULE -DIN_RT_R0 -DRT_WITH_VBOX -DRT_WITHOUT_NOCRT_WRAPPERS -DRT_NO_EXPORT_SYMBOL -DMODULE -DKBUILD_MODNAME=KBUILD_STR\(vboxdrv\) -DKBUILD_BASENAME=KBUILD_STR\(vboxdrv\) -DIN_SUP_R0 -Wp,-MD,/home/pkgmk/work/virtualbox/src/VirtualBox-4.3.26/out/linux.amd64/release/obj/RuntimeR0Drv/common/checksum/crc64.o.dep -Wp,-MT,/home/pkgmk/work/virtualbox/src/VirtualBox-4.3.26/out/linux.amd64/release/obj/RuntimeR0Drv/common/checksum/crc64.o -Wp,-MP -o /home/pkgmk/work/virtualbox/src/VirtualBox-4.3.26/out/linux.amd64/release/obj/RuntimeR0Drv/common/checksum/crc64.o /home/pkgmk/work/virtualbox/src/VirtualBox-4.3.26/src/VBox/Runtime/common/checksum/crc64.cpp
  294. In file included from /home/pkgmk/work/virtualbox/src/VirtualBox-4.3.26/include/iprt/types.h:116:0,
  295.                  from /home/pkgmk/work/virtualbox/src/VirtualBox-4.3.26/include/iprt/mem.h:31,
  296.                  from /home/pkgmk/work/virtualbox/src/VirtualBox-4.3.26/src/VBox/Runtime/common/alloc/alloc.cpp:34:
  297. /lib/modules/4.0.3/build/include/linux/compiler.h:201:29: error: can't set 'no_instrument_function' attribute after definition
  298.  static __always_inline void data_access_exceeds_word_size(void)
  299.                              ^
  300. /lib/modules/4.0.3/build/include/linux/compiler.h:205:29: error: can't set 'no_instrument_function' attribute after definition
  301.  static __always_inline void __read_once_size(const volatile void *p, void *res, int size)
  302.                              ^
  303. /lib/modules/4.0.3/build/include/linux/compiler.h:222:29: error: can't set 'no_instrument_function' attribute after definition
  304.  static __always_inline void __write_once_size(volatile void *p, void *res, int size)
  305.                              ^
  306. In file included from /home/pkgmk/work/virtualbox/src/VirtualBox-4.3.26/include/iprt/types.h:116:0,
  307.                  from /home/pkgmk/work/virtualbox/src/VirtualBox-4.3.26/include/iprt/md5.h:29,
  308.                  from /home/pkgmk/work/virtualbox/src/VirtualBox-4.3.26/src/VBox/Runtime/common/checksum/alt-md5.cpp:51:
  309. /lib/modules/4.0.3/build/include/linux/compiler.h:201:29: error: can't set 'no_instrument_function' attribute after definition
  310.  static __always_inline void data_access_exceeds_word_size(void)
  311.                              ^
  312. /lib/modules/4.0.3/build/include/linux/compiler.h:205:29: error: can't set 'no_instrument_function' attribute after definition
  313.  static __always_inline void __read_once_size(const volatile void *p, void *res, int size)
  314.                              ^
  315. /lib/modules/4.0.3/build/include/linux/compiler.h:222:29: error: can't set 'no_instrument_function' attribute after definition
  316.  static __always_inline void __write_once_size(volatile void *p, void *res, int size)
  317.                              ^
  318. In file included from /home/pkgmk/work/virtualbox/src/VirtualBox-4.3.26/include/iprt/types.h:116:0,
  319.                  from /home/pkgmk/work/virtualbox/src/VirtualBox-4.3.26/include/iprt/heap.h:30,
  320.                  from /home/pkgmk/work/virtualbox/src/VirtualBox-4.3.26/src/VBox/Runtime/common/alloc/heapsimple.cpp:32:
  321. /lib/modules/4.0.3/build/include/linux/compiler.h:201:29: error: can't set 'no_instrument_function' attribute after definition
  322.  static __always_inline void data_access_exceeds_word_size(void)
  323.                              ^
  324. /lib/modules/4.0.3/build/include/linux/compiler.h:205:29: error: can't set 'no_instrument_function' attribute after definition
  325.  static __always_inline void __read_once_size(const volatile void *p, void *res, int size)
  326.                              ^
  327. /lib/modules/4.0.3/build/include/linux/compiler.h:222:29: error: can't set 'no_instrument_function' attribute after definition
  328.  static __always_inline void __write_once_size(volatile void *p, void *res, int size)
  329.                              ^
  330. In file included from /home/pkgmk/work/virtualbox/src/VirtualBox-4.3.26/include/iprt/types.h:116:0,
  331.                  from /home/pkgmk/work/virtualbox/src/VirtualBox-4.3.26/include/iprt/heap.h:30,
  332.                  from /home/pkgmk/work/virtualbox/src/VirtualBox-4.3.26/src/VBox/Runtime/common/alloc/heapoffset.cpp:32:
  333. /lib/modules/4.0.3/build/include/linux/compiler.h:201:29: error: can't set 'no_instrument_function' attribute after definition
  334.  static __always_inline void data_access_exceeds_word_size(void)
  335.                              ^
  336. /lib/modules/4.0.3/build/include/linux/compiler.h:205:29: error: can't set 'no_instrument_function' attribute after definition
  337.  static __always_inline void __read_once_size(const volatile void *p, void *res, int size)
  338.                              ^
  339. /lib/modules/4.0.3/build/include/linux/compiler.h:222:29: error: can't set 'no_instrument_function' attribute after definition
  340.  static __always_inline void __write_once_size(volatile void *p, void *res, int size)
  341.                              ^
  342. kmk: *** [/home/pkgmk/work/virtualbox/src/VirtualBox-4.3.26/out/linux.amd64/release/obj/RuntimeR0Drv/common/alloc/alloc.o] Error 1
  343. The failing command:
  344. @g++ -c -O2 -nostdinc -iwithprefix include -include /lib/modules/4.0.3/build/include/linux/kconfig.h -Wall -Wextra -Wno-missing-field-initializers -Wno-unused -Wno-trigraphs -fdiagnostics-show-option -Wno-unused-parameter -Wno-sign-compare -fdiagnostics-show-option -fno-stack-protector -O2 -mtune=generic -fno-omit-frame-pointer -fno-strict-aliasing -fno-common -include /home/pkgmk/work/virtualbox/src/VirtualBox-4.3.26/include/VBox/SUPDrvMangling.h -m64 -mno-red-zone -mcmodel=kernel -mno-sse -mno-mmx -mno-sse2 -mno-3dnow -fno-reorder-blocks -fno-asynchronous-unwind-tables -funit-at-a-time -Wno-sign-compare -fno-exceptions -fno-rtti -include /home/pkgmk/work/virtualbox/src/VirtualBox-4.3.26/include/VBox/SUPDrvMangling.h -I/home/pkgmk/work/virtualbox/src/VirtualBox-4.3.26/src/VBox/Runtime/r0drv/linux -I/home/pkgmk/work/virtualbox/src/VirtualBox-4.3.26/src/VBox/Runtime -I/home/pkgmk/work/virtualbox/src/VirtualBox-4.3.26/src/VBox/Runtime/include -I/lib/modules/4.0.3/build/include -I/lib/modules/4.0.3/build/include/asm-i386/mach-default -I/lib/modules/4.0.3/build/include/asm-x86/mach-default -I/lib/modules/4.0.3/build/include/drm -I/lib/modules/4.0.3/build/arch/x86/include -I/lib/modules/4.0.3/build/arch/x86/include/asm/mach-default -I/lib/modules/4.0.3/build/arch/x86/include/uapi -I/lib/modules/4.0.3/build/arch/x86/include/generated -I/lib/modules/4.0.3/build/arch/x86/include/generated/uapi -I/lib/modules/4.0.3/build/include/uapi -I/lib/modules/4.0.3/build/include/generated/uapi -I/lib/modules/4.0.3/build/include -I/home/pkgmk/work/virtualbox/src/VirtualBox-4.3.26/out/linux.amd64/release/obj/RuntimeR0Drv/dtrace -I/home/pkgmk/work/virtualbox/src/VirtualBox-4.3.26/include -I/home/pkgmk/work/virtualbox/src/VirtualBox-4.3.26/out/linux.amd64/release -DVBOX -DVBOX_OSE -DVBOX_WITH_64_BITS_GUESTS -DVBOX_WITH_DEBUGGER -DRT_OS_LINUX -D_FILE_OFFSET_BITS=64 -DRT_ARCH_AMD64 -D__AMD64__ -DIN_RING0 -DIN_RT_R0 -DHC_ARCH_BITS=64 -DGC_ARCH_BITS=64 -D__KERNEL__ -DMODULE -DIN_RT_R0 -DRT_WITH_VBOX -DRT_WITHOUT_NOCRT_WRAPPERS -DRT_NO_EXPORT_SYMBOL -DMODULE -DKBUILD_MODNAME=KBUILD_STR\(vboxdrv\) -DKBUILD_BASENAME=KBUILD_STR\(vboxdrv\) -DIN_SUP_R0 -Wp,-MD,/home/pkgmk/work/virtualbox/src/VirtualBox-4.3.26/out/linux.amd64/release/obj/RuntimeR0Drv/common/alloc/alloc.o.dep -Wp,-MT,/home/pkgmk/work/virtualbox/src/VirtualBox-4.3.26/out/linux.amd64/release/obj/RuntimeR0Drv/common/alloc/alloc.o -Wp,-MP -o /home/pkgmk/work/virtualbox/src/VirtualBox-4.3.26/out/linux.amd64/release/obj/RuntimeR0Drv/common/alloc/alloc.o /home/pkgmk/work/virtualbox/src/VirtualBox-4.3.26/src/VBox/Runtime/common/alloc/alloc.cpp
  345. kmk: *** [/home/pkgmk/work/virtualbox/src/VirtualBox-4.3.26/out/linux.amd64/release/obj/RuntimeR0Drv/common/checksum/alt-md5.o] Error 1
  346. The failing command:
  347. @g++ -c -O2 -nostdinc -iwithprefix include -include /lib/modules/4.0.3/build/include/linux/kconfig.h -Wall -Wextra -Wno-missing-field-initializers -Wno-unused -Wno-trigraphs -fdiagnostics-show-option -Wno-unused-parameter -Wno-sign-compare -fdiagnostics-show-option -fno-stack-protector -O2 -mtune=generic -fno-omit-frame-pointer -fno-strict-aliasing -fno-common -include /home/pkgmk/work/virtualbox/src/VirtualBox-4.3.26/include/VBox/SUPDrvMangling.h -m64 -mno-red-zone -mcmodel=kernel -mno-sse -mno-mmx -mno-sse2 -mno-3dnow -fno-reorder-blocks -fno-asynchronous-unwind-tables -funit-at-a-time -Wno-sign-compare -fno-exceptions -fno-rtti -include /home/pkgmk/work/virtualbox/src/VirtualBox-4.3.26/include/VBox/SUPDrvMangling.h -I/home/pkgmk/work/virtualbox/src/VirtualBox-4.3.26/src/VBox/Runtime/r0drv/linux -I/home/pkgmk/work/virtualbox/src/VirtualBox-4.3.26/src/VBox/Runtime -I/home/pkgmk/work/virtualbox/src/VirtualBox-4.3.26/src/VBox/Runtime/include -I/lib/modules/4.0.3/build/include -I/lib/modules/4.0.3/build/include/asm-i386/mach-default -I/lib/modules/4.0.3/build/include/asm-x86/mach-default -I/lib/modules/4.0.3/build/include/drm -I/lib/modules/4.0.3/build/arch/x86/include -I/lib/modules/4.0.3/build/arch/x86/include/asm/mach-default -I/lib/modules/4.0.3/build/arch/x86/include/uapi -I/lib/modules/4.0.3/build/arch/x86/include/generated -I/lib/modules/4.0.3/build/arch/x86/include/generated/uapi -I/lib/modules/4.0.3/build/include/uapi -I/lib/modules/4.0.3/build/include/generated/uapi -I/lib/modules/4.0.3/build/include -I/home/pkgmk/work/virtualbox/src/VirtualBox-4.3.26/out/linux.amd64/release/obj/RuntimeR0Drv/dtrace -I/home/pkgmk/work/virtualbox/src/VirtualBox-4.3.26/include -I/home/pkgmk/work/virtualbox/src/VirtualBox-4.3.26/out/linux.amd64/release -DVBOX -DVBOX_OSE -DVBOX_WITH_64_BITS_GUESTS -DVBOX_WITH_DEBUGGER -DRT_OS_LINUX -D_FILE_OFFSET_BITS=64 -DRT_ARCH_AMD64 -D__AMD64__ -DIN_RING0 -DIN_RT_R0 -DHC_ARCH_BITS=64 -DGC_ARCH_BITS=64 -D__KERNEL__ -DMODULE -DIN_RT_R0 -DRT_WITH_VBOX -DRT_WITHOUT_NOCRT_WRAPPERS -DRT_NO_EXPORT_SYMBOL -DMODULE -DKBUILD_MODNAME=KBUILD_STR\(vboxdrv\) -DKBUILD_BASENAME=KBUILD_STR\(vboxdrv\) -DIN_SUP_R0 -Wp,-MD,/home/pkgmk/work/virtualbox/src/VirtualBox-4.3.26/out/linux.amd64/release/obj/RuntimeR0Drv/common/checksum/alt-md5.o.dep -Wp,-MT,/home/pkgmk/work/virtualbox/src/VirtualBox-4.3.26/out/linux.amd64/release/obj/RuntimeR0Drv/common/checksum/alt-md5.o -Wp,-MP -o /home/pkgmk/work/virtualbox/src/VirtualBox-4.3.26/out/linux.amd64/release/obj/RuntimeR0Drv/common/checksum/alt-md5.o /home/pkgmk/work/virtualbox/src/VirtualBox-4.3.26/src/VBox/Runtime/common/checksum/alt-md5.cpp
  348. kmk: *** [/home/pkgmk/work/virtualbox/src/VirtualBox-4.3.26/out/linux.amd64/release/obj/RuntimeR0Drv/common/alloc/heapsimple.o] Error 1
  349. The failing command:
  350. @g++ -c -O2 -nostdinc -iwithprefix include -include /lib/modules/4.0.3/build/include/linux/kconfig.h -Wall -Wextra -Wno-missing-field-initializers -Wno-unused -Wno-trigraphs -fdiagnostics-show-option -Wno-unused-parameter -Wno-sign-compare -fdiagnostics-show-option -fno-stack-protector -O2 -mtune=generic -fno-omit-frame-pointer -fno-strict-aliasing -fno-common -include /home/pkgmk/work/virtualbox/src/VirtualBox-4.3.26/include/VBox/SUPDrvMangling.h -m64 -mno-red-zone -mcmodel=kernel -mno-sse -mno-mmx -mno-sse2 -mno-3dnow -fno-reorder-blocks -fno-asynchronous-unwind-tables -funit-at-a-time -Wno-sign-compare -fno-exceptions -fno-rtti -include /home/pkgmk/work/virtualbox/src/VirtualBox-4.3.26/include/VBox/SUPDrvMangling.h -I/home/pkgmk/work/virtualbox/src/VirtualBox-4.3.26/src/VBox/Runtime/r0drv/linux -I/home/pkgmk/work/virtualbox/src/VirtualBox-4.3.26/src/VBox/Runtime -I/home/pkgmk/work/virtualbox/src/VirtualBox-4.3.26/src/VBox/Runtime/include -I/lib/modules/4.0.3/build/include -I/lib/modules/4.0.3/build/include/asm-i386/mach-default -I/lib/modules/4.0.3/build/include/asm-x86/mach-default -I/lib/modules/4.0.3/build/include/drm -I/lib/modules/4.0.3/build/arch/x86/include -I/lib/modules/4.0.3/build/arch/x86/include/asm/mach-default -I/lib/modules/4.0.3/build/arch/x86/include/uapi -I/lib/modules/4.0.3/build/arch/x86/include/generated -I/lib/modules/4.0.3/build/arch/x86/include/generated/uapi -I/lib/modules/4.0.3/build/include/uapi -I/lib/modules/4.0.3/build/include/generated/uapi -I/lib/modules/4.0.3/build/include -I/home/pkgmk/work/virtualbox/src/VirtualBox-4.3.26/out/linux.amd64/release/obj/RuntimeR0Drv/dtrace -I/home/pkgmk/work/virtualbox/src/VirtualBox-4.3.26/include -I/home/pkgmk/work/virtualbox/src/VirtualBox-4.3.26/out/linux.amd64/release -DVBOX -DVBOX_OSE -DVBOX_WITH_64_BITS_GUESTS -DVBOX_WITH_DEBUGGER -DRT_OS_LINUX -D_FILE_OFFSET_BITS=64 -DRT_ARCH_AMD64 -D__AMD64__ -DIN_RING0 -DIN_RT_R0 -DHC_ARCH_BITS=64 -DGC_ARCH_BITS=64 -D__KERNEL__ -DMODULE -DIN_RT_R0 -DRT_WITH_VBOX -DRT_WITHOUT_NOCRT_WRAPPERS -DRT_NO_EXPORT_SYMBOL -DMODULE -DKBUILD_MODNAME=KBUILD_STR\(vboxdrv\) -DKBUILD_BASENAME=KBUILD_STR\(vboxdrv\) -DIN_SUP_R0 -Wp,-MD,/home/pkgmk/work/virtualbox/src/VirtualBox-4.3.26/out/linux.amd64/release/obj/RuntimeR0Drv/common/alloc/heapsimple.o.dep -Wp,-MT,/home/pkgmk/work/virtualbox/src/VirtualBox-4.3.26/out/linux.amd64/release/obj/RuntimeR0Drv/common/alloc/heapsimple.o -Wp,-MP -o /home/pkgmk/work/virtualbox/src/VirtualBox-4.3.26/out/linux.amd64/release/obj/RuntimeR0Drv/common/alloc/heapsimple.o /home/pkgmk/work/virtualbox/src/VirtualBox-4.3.26/src/VBox/Runtime/common/alloc/heapsimple.cpp
  351. kmk: *** [/home/pkgmk/work/virtualbox/src/VirtualBox-4.3.26/out/linux.amd64/release/obj/RuntimeR0Drv/common/alloc/heapoffset.o] Error 1
  352. The failing command:
  353. @g++ -c -O2 -nostdinc -iwithprefix include -include /lib/modules/4.0.3/build/include/linux/kconfig.h -Wall -Wextra -Wno-missing-field-initializers -Wno-unused -Wno-trigraphs -fdiagnostics-show-option -Wno-unused-parameter -Wno-sign-compare -fdiagnostics-show-option -fno-stack-protector -O2 -mtune=generic -fno-omit-frame-pointer -fno-strict-aliasing -fno-common -include /home/pkgmk/work/virtualbox/src/VirtualBox-4.3.26/include/VBox/SUPDrvMangling.h -m64 -mno-red-zone -mcmodel=kernel -mno-sse -mno-mmx -mno-sse2 -mno-3dnow -fno-reorder-blocks -fno-asynchronous-unwind-tables -funit-at-a-time -Wno-sign-compare -fno-exceptions -fno-rtti -include /home/pkgmk/work/virtualbox/src/VirtualBox-4.3.26/include/VBox/SUPDrvMangling.h -I/home/pkgmk/work/virtualbox/src/VirtualBox-4.3.26/src/VBox/Runtime/r0drv/linux -I/home/pkgmk/work/virtualbox/src/VirtualBox-4.3.26/src/VBox/Runtime -I/home/pkgmk/work/virtualbox/src/VirtualBox-4.3.26/src/VBox/Runtime/include -I/lib/modules/4.0.3/build/include -I/lib/modules/4.0.3/build/include/asm-i386/mach-default -I/lib/modules/4.0.3/build/include/asm-x86/mach-default -I/lib/modules/4.0.3/build/include/drm -I/lib/modules/4.0.3/build/arch/x86/include -I/lib/modules/4.0.3/build/arch/x86/include/asm/mach-default -I/lib/modules/4.0.3/build/arch/x86/include/uapi -I/lib/modules/4.0.3/build/arch/x86/include/generated -I/lib/modules/4.0.3/build/arch/x86/include/generated/uapi -I/lib/modules/4.0.3/build/include/uapi -I/lib/modules/4.0.3/build/include/generated/uapi -I/lib/modules/4.0.3/build/include -I/home/pkgmk/work/virtualbox/src/VirtualBox-4.3.26/out/linux.amd64/release/obj/RuntimeR0Drv/dtrace -I/home/pkgmk/work/virtualbox/src/VirtualBox-4.3.26/include -I/home/pkgmk/work/virtualbox/src/VirtualBox-4.3.26/out/linux.amd64/release -DVBOX -DVBOX_OSE -DVBOX_WITH_64_BITS_GUESTS -DVBOX_WITH_DEBUGGER -DRT_OS_LINUX -D_FILE_OFFSET_BITS=64 -DRT_ARCH_AMD64 -D__AMD64__ -DIN_RING0 -DIN_RT_R0 -DHC_ARCH_BITS=64 -DGC_ARCH_BITS=64 -D__KERNEL__ -DMODULE -DIN_RT_R0 -DRT_WITH_VBOX -DRT_WITHOUT_NOCRT_WRAPPERS -DRT_NO_EXPORT_SYMBOL -DMODULE -DKBUILD_MODNAME=KBUILD_STR\(vboxdrv\) -DKBUILD_BASENAME=KBUILD_STR\(vboxdrv\) -DIN_SUP_R0 -Wp,-MD,/home/pkgmk/work/virtualbox/src/VirtualBox-4.3.26/out/linux.amd64/release/obj/RuntimeR0Drv/common/alloc/heapoffset.o.dep -Wp,-MT,/home/pkgmk/work/virtualbox/src/VirtualBox-4.3.26/out/linux.amd64/release/obj/RuntimeR0Drv/common/alloc/heapoffset.o -Wp,-MP -o /home/pkgmk/work/virtualbox/src/VirtualBox-4.3.26/out/linux.amd64/release/obj/RuntimeR0Drv/common/alloc/heapoffset.o /home/pkgmk/work/virtualbox/src/VirtualBox-4.3.26/src/VBox/Runtime/common/alloc/heapoffset.cpp
  354. kmk: *** Exiting with status 2
  355. =======> ERROR: Building '/home/pkgmk/pkg/virtualbox#4.3.26-1.pkg.tar.xz' failed.
  356. prt-get: error while install
  357.  
  358. -- Packages where install failed
  359. virtualbox [pre: ok]
  360.  
  361. -- Packages installed
  362. dev86
  363. iasl
  364. makeself
  365. xerces-c
  366. cdrkit
  367.  
  368. -- installed packages with README files:
  369. cdrkit
  370.  
  371. 21:43:12-cezar@razec:~$
  372. sudo prt-get depends virtual-box
  373. Password:
  374. The package 'virtual-box' could not be found:
  375. 21:46:17-cezar@razec:~$
  376. sudo prt-get depends virtualbox
  377. -- dependencies ([i] = installed)
  378. [i] bin86
  379. [i] dev86
  380. [i] alsa-lib
  381. [i] bzip2
  382. [i] xz
  383. [i] zlib
  384. [i] expat
  385. [i] libpthread-stubs
  386. [i] xorg-libpciaccess
  387. [i] db
  388. [i] gdbm
  389. [i] openssl
  390. [i] ncurses
  391. [i] xorg-xproto
  392. [i] xorg-xf86bigfontproto
  393. [i] xorg-xextproto
  394. [i] xorg-util-macros
  395. [i] xorg-dri2proto
  396. [i] xorg-dri3proto
  397. [i] xorg-damageproto
  398. [i] xorg-fixesproto
  399. [i] xorg-videoproto
  400. [i] xorg-presentproto
  401. [i] libpcre
  402. [i] libffi
  403. [i] libjpeg-turbo
  404. [i] xorg-renderproto
  405. [i] xorg-xineramaproto
  406. [i] xorg-randrproto
  407. [i] cdparanoia
  408. [i] libogg
  409. [i] libvisual
  410. [i] orc
  411. [i] xorg-libpixman
  412. [i] kmod
  413. [i] iasl
  414. [i] attr
  415. [i] makeself
  416. [i] yasm
  417. [i] elfutils
  418. [i] libxml2
  419. [i] libpng
  420. [i] file
  421. [i] dbus
  422. [i] libdrm
  423. [i] curl
  424. [i] readline
  425. [i] xorg-libxdmcp
  426. [i] xorg-libxau
  427. [i] xorg-xtrans
  428. [i] xorg-kbproto
  429. [i] xorg-inputproto
  430. [i] xorg-glproto
  431. [i] xorg-libxshmfence
  432. [i] libtiff
  433. [i] libvorbis
  434. [i] eudev
  435. [i] libcap
  436. [i] acl
  437. [i] libvpx
  438. [i] libxslt
  439. [i] freetype
  440. [i] xerces-c
  441. [i] sqlite3
  442. [i] xorg-libice
  443. [i] lcms2
  444. [i] libtheora
  445. [i] util-linux
  446. [i] libarchive
  447. [i] fontconfig
  448. [i] python
  449. [i] xorg-libsm
  450. [i] libmng
  451. [i] cmake
  452. [i] xorg-xcb-proto
  453. [i] llvm
  454. [i] glib
  455. [i] cdrkit
  456. [i] xorg-libxcb
  457. [i] libidl
  458. [i] gobject-introspection
  459. [i] xorg-libx11
  460. [i] xorg-xcb-util
  461. [i] gstreamer-compat
  462. [i] xorg-libxext
  463. [i] xorg-libxfixes
  464. [i] xorg-libxrender
  465. [i] xorg-libxt
  466. [i] libvdpau
  467. [i] xorg-libxv
  468. [i] xorg-libxinerama
  469. [i] xorg-libxdamage
  470. [i] xorg-libxi
  471. [i] xorg-libxcursor
  472. [i] xorg-libxrandr
  473. [i] cairo
  474. [i] xorg-libxft
  475. [i] xorg-libxmu
  476. [i] xorg-libxvmc
  477. [i] harfbuzz
  478. [i] mesa3d
  479. [i] pango
  480. [i] libsdl
  481. [i] glu
  482. [i] gst-plugins-base-compat
  483. [i] qt4
  484. [ ] virtualbox
  485. 21:46:37-cezar@razec:~$
RAW Paste Data
We use cookies for various purposes including analytics. By continuing to use Pastebin, you agree to our use of cookies as described in the Cookies Policy. OK, I Understand
 
Top