Sunka

Untitled

Dec 6th, 2018
6
Never
Not a member of Pastebin yet? Sign Up, it unlocks many cool features!
  1. [root@upcloud ~]# yum reinstall openssl openssl-devel
  2. Loaded plugins: fastestmirror, priorities, versionlock
  3. Loading mirror speeds from cached hostfile
  4.  * base: mirror.imt-systems.com
  5.  * epel: mirror.de.leaseweb.net
  6.  * extras: mirror.fra10.de.leaseweb.net
  7.  * rpmforge: mirror.de.leaseweb.net
  8.  * updates: ftp.plusline.net
  9. 286 packages excluded due to repository priority protections
  10. Resolving Dependencies
  11. --> Running transaction check
  12. ---> Package openssl.x86_64 1:1.0.2k-16.el7 will be reinstalled
  13. ---> Package openssl-devel.x86_64 1:1.0.2k-16.el7 will be reinstalled
  14. --> Finished Dependency Resolution
  15.  
  16. Dependencies Resolved
  17.  
  18. ===============================================================================================================
  19.  Package                      Arch                  Version                          Repository           Size
  20. ===============================================================================================================
  21. Reinstalling:
  22.  openssl                      x86_64                1:1.0.2k-16.el7                  base                493 k
  23.  openssl-devel                x86_64                1:1.0.2k-16.el7                  base                1.5 M
  24.  
  25. Transaction Summary
  26. ===============================================================================================================
  27. Reinstall  2 Packages
  28.  
  29. Total download size: 2.0 M
  30. Installed size: 3.9 M
  31. Is this ok [y/d/N]: y
  32. Downloading packages:
  33. (1/2): openssl-1.0.2k-16.el7.x86_64.rpm                                                 | 493 kB  00:00:00    
  34. (2/2): openssl-devel-1.0.2k-16.el7.x86_64.rpm                                           | 1.5 MB  00:00:00    
  35. ---------------------------------------------------------------------------------------------------------------
  36. Total                                                                           13 MB/s | 2.0 MB  00:00:00    
  37. Running transaction check
  38. Running transaction test
  39. Transaction test succeeded
  40. Running transaction
  41.   Installing : 1:openssl-1.0.2k-16.el7.x86_64                                                              1/2
  42.   Installing : 1:openssl-devel-1.0.2k-16.el7.x86_64                                                        2/2
  43.   Verifying  : 1:openssl-devel-1.0.2k-16.el7.x86_64                                                        1/2
  44.   Verifying  : 1:openssl-1.0.2k-16.el7.x86_64                                                              2/2
  45.  
  46. Installed:
  47.   openssl.x86_64 1:1.0.2k-16.el7                      openssl-devel.x86_64 1:1.0.2k-16.el7                    
  48.  
  49. Complete!
  50. [root@upcloud ~]# centmin
  51. /usr/local/src/centminmod ~
  52.  
  53. update wget to 1.20 version... one time task
  54. Download wget-1.20.tar.gz ...
  55. wget-1.20.tar.gz Archive found, skipping download...
  56. wget-1.20.tar.gz valid file.
  57.  
  58. Making clean in lib
  59. make[1]: Entering directory `/svr-setup/wget-1.20/lib'
  60. make[2]: Entering directory `/svr-setup/wget-1.20/lib'
  61. test -z "" || rm -f
  62. test -z "libgnu.a" || rm -f libgnu.a
  63. test -z "" || rm -f
  64. rm -f *.o
  65. rm -f glthread/*.o
  66. rm -f unicase/*.o
  67. rm -f unictype/*.o
  68. rm -f uninorm/*.o
  69. rm -f unistr/*.o
  70. rm -f uniwidth/*.o
  71. test -z "core *.stackdump alloca.h alloca.h-t arpa/inet.h arpa/inet.h-t byteswap.h byteswap.h-t errno.h errno.h-t fcntl.h fcntl.h-t float.h float.h-t fnmatch.h fnmatch.h-t getopt.h getopt.h-t getopt-cdefs.h getopt-cdefs.h-t iconv.h iconv.h-t inttypes.h inttypes.h-t langinfo.h langinfo.h-t limits.h limits.h-t locale.h locale.h-t netdb.h netdb.h-t netinet/in.h netinet/in.h-t sched.h sched.h-t signal.h signal.h-t spawn.h spawn.h-t stdalign.h stdalign.h-t stdbool.h stdbool.h-t stddef.h stddef.h-t stdint.h stdint.h-t stdio.h stdio.h-t stdlib.h stdlib.h-t string.h string.h-t strings.h strings.h-t sys/file.h sys/file.h-t sys/ioctl.h sys/ioctl.h-t sys/select.h sys/select.h-t sys/socket.h sys/socket.h-t sys/stat.h sys/stat.h-t sys/time.h sys/time.h-t sys/types.h sys/types.h-t sys/uio.h sys/uio.h-t sys/wait.h sys/wait.h-t time.h time.h-t unicase.h unicase.h-t unicase/special-casing-table.h-t unicase/special-casing.h unicase/special-casing.h-t unictype.h unictype.h-t uninorm.h uninorm.h-t unistd.h unistd.h-t unistr.h unistr.h-t unitypes.h unitypes.h-t uniwidth.h uniwidth.h-t utime.h utime.h-t wchar.h wchar.h-t wctype.h wctype.h-t" || rm -f core *.stackdump alloca.h alloca.h-t arpa/inet.h arpa/inet.h-t byteswap.h byteswap.h-t errno.h errno.h-t fcntl.h fcntl.h-t float.h float.h-t fnmatch.h fnmatch.h-t getopt.h getopt.h-t getopt-cdefs.h getopt-cdefs.h-t iconv.h iconv.h-t inttypes.h inttypes.h-t langinfo.h langinfo.h-t limits.h limits.h-t locale.h locale.h-t netdb.h netdb.h-t netinet/in.h netinet/in.h-t sched.h sched.h-t signal.h signal.h-t spawn.h spawn.h-t stdalign.h stdalign.h-t stdbool.h stdbool.h-t stddef.h stddef.h-t stdint.h stdint.h-t stdio.h stdio.h-t stdlib.h stdlib.h-t string.h string.h-t strings.h strings.h-t sys/file.h sys/file.h-t sys/ioctl.h sys/ioctl.h-t sys/select.h sys/select.h-t sys/socket.h sys/socket.h-t sys/stat.h sys/stat.h-t sys/time.h sys/time.h-t sys/types.h sys/types.h-t sys/uio.h sys/uio.h-t sys/wait.h sys/wait.h-t time.h time.h-t unicase.h unicase.h-t unicase/special-casing-table.h-t unicase/special-casing.h unicase/special-casing.h-t unictype.h unictype.h-t uninorm.h uninorm.h-t unistd.h unistd.h-t unistr.h unistr.h-t unitypes.h unitypes.h-t uniwidth.h uniwidth.h-t utime.h utime.h-t wchar.h wchar.h-t wctype.h wctype.h-t
  72. rmdir arpa
  73. rmdir sys
  74. make[2]: Leaving directory `/svr-setup/wget-1.20/lib'
  75. make[1]: Leaving directory `/svr-setup/wget-1.20/lib'
  76. Making clean in src
  77. make[1]: Entering directory `/svr-setup/wget-1.20/src'
  78. test -z "wget" || rm -f wget
  79. test -z "libunittest.a" || rm -f libunittest.a
  80. test -z "*~ *.bak core core.[0-9]* build_info.c version.c" || rm -f *~ *.bak core core.[0-9]* build_info.c version.c
  81. rm -f *.o
  82. make[1]: Leaving directory `/svr-setup/wget-1.20/src'
  83. Making clean in doc
  84. make[1]: Entering directory `/svr-setup/wget-1.20/doc'
  85. test -z "wget.dvi wget.pdf wget.ps wget.html" \
  86. || rm -rf wget.dvi wget.pdf wget.ps wget.html
  87. test -z "*~ *.bak *.cat *.pod" || rm -f *~ *.bak *.cat *.pod
  88. rm -rf wget.t2d wget.t2p
  89. rm -f vti.tmp* ./version.texi.tmp*
  90. make[1]: Leaving directory `/svr-setup/wget-1.20/doc'
  91. Making clean in po
  92. make[1]: Entering directory `/svr-setup/wget-1.20/po'
  93. rm -f *.insert-header
  94. rm -f remove-potcdate.sed
  95. rm -f stamp-poT
  96. rm -f core core.* wget.po wget.1po wget.2po *.new.po
  97. rm -fr *.o
  98. make[1]: Leaving directory `/svr-setup/wget-1.20/po'
  99. Making clean in util
  100. make[1]: Entering directory `/svr-setup/wget-1.20/util'
  101. make[1]: Nothing to be done for `clean'.
  102. make[1]: Leaving directory `/svr-setup/wget-1.20/util'
  103. Making clean in fuzz
  104. make[1]: Entering directory `/svr-setup/wget-1.20/fuzz'
  105. test -z "" || rm -f
  106. test -z "wget_css_fuzzer wget_cookie_fuzzer wget_ftpls_fuzzer wget_html_fuzzer wget_netrc_fuzzer wget_options_fuzzer wget_robots_fuzzer wget_url_fuzzer" || rm -f wget_css_fuzzer wget_cookie_fuzzer wget_ftpls_fuzzer wget_html_fuzzer wget_netrc_fuzzer wget_options_fuzzer wget_robots_fuzzer wget_url_fuzzer
  107. rm -rf *.gc?? *.log lcov
  108. rm -f *.o
  109. test -z "wget_css_fuzzer.log wget_cookie_fuzzer.log wget_ftpls_fuzzer.log wget_html_fuzzer.log wget_netrc_fuzzer.log wget_options_fuzzer.log wget_robots_fuzzer.log wget_url_fuzzer.log" || rm -f wget_css_fuzzer.log wget_cookie_fuzzer.log wget_ftpls_fuzzer.log wget_html_fuzzer.log wget_netrc_fuzzer.log wget_options_fuzzer.log wget_robots_fuzzer.log wget_url_fuzzer.log
  110. test -z "wget_css_fuzzer.trs wget_cookie_fuzzer.trs wget_ftpls_fuzzer.trs wget_html_fuzzer.trs wget_netrc_fuzzer.trs wget_options_fuzzer.trs wget_robots_fuzzer.trs wget_url_fuzzer.trs" || rm -f wget_css_fuzzer.trs wget_cookie_fuzzer.trs wget_ftpls_fuzzer.trs wget_html_fuzzer.trs wget_netrc_fuzzer.trs wget_options_fuzzer.trs wget_robots_fuzzer.trs wget_url_fuzzer.trs
  111. test -z "test-suite.log" || rm -f test-suite.log
  112. make[1]: Leaving directory `/svr-setup/wget-1.20/fuzz'
  113. Making clean in tests
  114. make[1]: Entering directory `/svr-setup/wget-1.20/tests'
  115. test -z "unit-tests" || rm -f unit-tests
  116. test -z "*~ *.bak core core.[0-9]*" || rm -f *~ *.bak core core.[0-9]*
  117. rm -f *.o
  118. test -z "./unit-tests.log Test-auth-basic.log Test-auth-no-challenge.log Test-auth-no-challenge-url.log Test-auth-with-content-disposition.log Test-auth-retcode.log Test-c-full.log Test-c-partial.log Test-c.log Test-c-shorter.log Test-cookies.log Test-cookies-401.log Test-E-k-K.log Test-E-k.log Test-ftp.log Test-ftp-pasv-fail.log Test-ftp-bad-list.log Test-ftp-recursive.log Test-ftp-iri.log Test-ftp-iri-fallback.log Test-ftp-iri-recursive.log Test-ftp-iri-disabled.log Test-ftp-list-Multinet.log Test-ftp-list-Unknown.log Test-ftp-list-Unknown-a.log Test-ftp-list-Unknown-hidden.log Test-ftp-list-Unknown-list-a-fails.log Test-ftp-list-UNIX-hidden.log Test-ftp--start-pos.log Test-HTTP-Content-Disposition-1.log Test-HTTP-Content-Disposition-2.log Test-HTTP-Content-Disposition.log Test-i-ftp.log Test-i-http.log Test-idn-headers.log Test-idn-meta.log Test-idn-cmd.log Test-idn-cmd-utf8.log Test-idn-robots.log Test-idn-robots-utf8.log Test-iri.log Test-iri-percent.log Test-iri-disabled.log Test-iri-forced-remote.log Test-iri-list.log Test-k.log Test-meta-robots.log Test-N-current.log Test-N-HTTP-Content-Disposition.log Test-N--no-content-disposition.log Test-N--no-content-disposition-trivial.log Test-N-no-info.log Test--no-content-disposition.log Test--no-content-disposition-trivial.log Test-N-old.log Test-nonexisting-quiet.log Test-noop.log Test-np.log Test-N.log Test-N-smaller.log Test-O-HTTP-Content-Disposition.log Test-O-nc.log Test-O--no-content-disposition.log Test-O--no-content-disposition-trivial.log Test-O-nonexisting.log Test-O.log Test--post-file.log Test-proxied-https-auth.log Test-proxied-https-auth-keepalive.log Test-proxy-auth-basic.log Test-restrict-ascii.log Test-Restrict-Lowercase.log Test-Restrict-Uppercase.log Test-stdouterr.log Test--spider-fail.log Test--spider.log Test--spider-r-HTTP-Content-Disposition.log Test--spider-r--no-content-disposition.log Test--spider-r--no-content-disposition-trivial.log Test--spider-r.log Test--start-pos.log Test--start-pos--continue.log Test--httpsonly-r.log Test-204.log Test-ftp-pasv-not-supported.log Test-https-pfs.log Test-https-tlsv1.log Test-https-tlsv1x.log Test-https-selfsigned.log Test-https-weboftrust.log Test-https-clientcert.log Test-https-crl.log Test-https-badcerts.log" || rm -f ./unit-tests.log Test-auth-basic.log Test-auth-no-challenge.log Test-auth-no-challenge-url.log Test-auth-with-content-disposition.log Test-auth-retcode.log Test-c-full.log Test-c-partial.log Test-c.log Test-c-shorter.log Test-cookies.log Test-cookies-401.log Test-E-k-K.log Test-E-k.log Test-ftp.log Test-ftp-pasv-fail.log Test-ftp-bad-list.log Test-ftp-recursive.log Test-ftp-iri.log Test-ftp-iri-fallback.log Test-ftp-iri-recursive.log Test-ftp-iri-disabled.log Test-ftp-list-Multinet.log Test-ftp-list-Unknown.log Test-ftp-list-Unknown-a.log Test-ftp-list-Unknown-hidden.log Test-ftp-list-Unknown-list-a-fails.log Test-ftp-list-UNIX-hidden.log Test-ftp--start-pos.log Test-HTTP-Content-Disposition-1.log Test-HTTP-Content-Disposition-2.log Test-HTTP-Content-Disposition.log Test-i-ftp.log Test-i-http.log Test-idn-headers.log Test-idn-meta.log Test-idn-cmd.log Test-idn-cmd-utf8.log Test-idn-robots.log Test-idn-robots-utf8.log Test-iri.log Test-iri-percent.log Test-iri-disabled.log Test-iri-forced-remote.log Test-iri-list.log Test-k.log Test-meta-robots.log Test-N-current.log Test-N-HTTP-Content-Disposition.log Test-N--no-content-disposition.log Test-N--no-content-disposition-trivial.log Test-N-no-info.log Test--no-content-disposition.log Test--no-content-disposition-trivial.log Test-N-old.log Test-nonexisting-quiet.log Test-noop.log Test-np.log Test-N.log Test-N-smaller.log Test-O-HTTP-Content-Disposition.log Test-O-nc.log Test-O--no-content-disposition.log Test-O--no-content-disposition-trivial.log Test-O-nonexisting.log Test-O.log Test--post-file.log Test-proxied-https-auth.log Test-proxied-https-auth-keepalive.log Test-proxy-auth-basic.log Test-restrict-ascii.log Test-Restrict-Lowercase.log Test-Restrict-Uppercase.log Test-stdouterr.log Test--spider-fail.log Test--spider.log Test--spider-r-HTTP-Content-Disposition.log Test--spider-r--no-content-disposition.log Test--spider-r--no-content-disposition-trivial.log Test--spider-r.log Test--start-pos.log Test--start-pos--continue.log Test--httpsonly-r.log Test-204.log Test-ftp-pasv-not-supported.log Test-https-pfs.log Test-https-tlsv1.log Test-https-tlsv1x.log Test-https-selfsigned.log Test-https-weboftrust.log Test-https-clientcert.log Test-https-crl.log Test-https-badcerts.log
  119. test -z "./unit-tests.trs Test-auth-basic.trs Test-auth-no-challenge.trs Test-auth-no-challenge-url.trs Test-auth-with-content-disposition.trs Test-auth-retcode.trs Test-c-full.trs Test-c-partial.trs Test-c.trs Test-c-shorter.trs Test-cookies.trs Test-cookies-401.trs Test-E-k-K.trs Test-E-k.trs Test-ftp.trs Test-ftp-pasv-fail.trs Test-ftp-bad-list.trs Test-ftp-recursive.trs Test-ftp-iri.trs Test-ftp-iri-fallback.trs Test-ftp-iri-recursive.trs Test-ftp-iri-disabled.trs Test-ftp-list-Multinet.trs Test-ftp-list-Unknown.trs Test-ftp-list-Unknown-a.trs Test-ftp-list-Unknown-hidden.trs Test-ftp-list-Unknown-list-a-fails.trs Test-ftp-list-UNIX-hidden.trs Test-ftp--start-pos.trs Test-HTTP-Content-Disposition-1.trs Test-HTTP-Content-Disposition-2.trs Test-HTTP-Content-Disposition.trs Test-i-ftp.trs Test-i-http.trs Test-idn-headers.trs Test-idn-meta.trs Test-idn-cmd.trs Test-idn-cmd-utf8.trs Test-idn-robots.trs Test-idn-robots-utf8.trs Test-iri.trs Test-iri-percent.trs Test-iri-disabled.trs Test-iri-forced-remote.trs Test-iri-list.trs Test-k.trs Test-meta-robots.trs Test-N-current.trs Test-N-HTTP-Content-Disposition.trs Test-N--no-content-disposition.trs Test-N--no-content-disposition-trivial.trs Test-N-no-info.trs Test--no-content-disposition.trs Test--no-content-disposition-trivial.trs Test-N-old.trs Test-nonexisting-quiet.trs Test-noop.trs Test-np.trs Test-N.trs Test-N-smaller.trs Test-O-HTTP-Content-Disposition.trs Test-O-nc.trs Test-O--no-content-disposition.trs Test-O--no-content-disposition-trivial.trs Test-O-nonexisting.trs Test-O.trs Test--post-file.trs Test-proxied-https-auth.trs Test-proxied-https-auth-keepalive.trs Test-proxy-auth-basic.trs Test-restrict-ascii.trs Test-Restrict-Lowercase.trs Test-Restrict-Uppercase.trs Test-stdouterr.trs Test--spider-fail.trs Test--spider.trs Test--spider-r-HTTP-Content-Disposition.trs Test--spider-r--no-content-disposition.trs Test--spider-r--no-content-disposition-trivial.trs Test--spider-r.trs Test--start-pos.trs Test--start-pos--continue.trs Test--httpsonly-r.trs Test-204.trs Test-ftp-pasv-not-supported.trs Test-https-pfs.trs Test-https-tlsv1.trs Test-https-tlsv1x.trs Test-https-selfsigned.trs Test-https-weboftrust.trs Test-https-clientcert.trs Test-https-crl.trs Test-https-badcerts.trs" || rm -f ./unit-tests.trs Test-auth-basic.trs Test-auth-no-challenge.trs Test-auth-no-challenge-url.trs Test-auth-with-content-disposition.trs Test-auth-retcode.trs Test-c-full.trs Test-c-partial.trs Test-c.trs Test-c-shorter.trs Test-cookies.trs Test-cookies-401.trs Test-E-k-K.trs Test-E-k.trs Test-ftp.trs Test-ftp-pasv-fail.trs Test-ftp-bad-list.trs Test-ftp-recursive.trs Test-ftp-iri.trs Test-ftp-iri-fallback.trs Test-ftp-iri-recursive.trs Test-ftp-iri-disabled.trs Test-ftp-list-Multinet.trs Test-ftp-list-Unknown.trs Test-ftp-list-Unknown-a.trs Test-ftp-list-Unknown-hidden.trs Test-ftp-list-Unknown-list-a-fails.trs Test-ftp-list-UNIX-hidden.trs Test-ftp--start-pos.trs Test-HTTP-Content-Disposition-1.trs Test-HTTP-Content-Disposition-2.trs Test-HTTP-Content-Disposition.trs Test-i-ftp.trs Test-i-http.trs Test-idn-headers.trs Test-idn-meta.trs Test-idn-cmd.trs Test-idn-cmd-utf8.trs Test-idn-robots.trs Test-idn-robots-utf8.trs Test-iri.trs Test-iri-percent.trs Test-iri-disabled.trs Test-iri-forced-remote.trs Test-iri-list.trs Test-k.trs Test-meta-robots.trs Test-N-current.trs Test-N-HTTP-Content-Disposition.trs Test-N--no-content-disposition.trs Test-N--no-content-disposition-trivial.trs Test-N-no-info.trs Test--no-content-disposition.trs Test--no-content-disposition-trivial.trs Test-N-old.trs Test-nonexisting-quiet.trs Test-noop.trs Test-np.trs Test-N.trs Test-N-smaller.trs Test-O-HTTP-Content-Disposition.trs Test-O-nc.trs Test-O--no-content-disposition.trs Test-O--no-content-disposition-trivial.trs Test-O-nonexisting.trs Test-O.trs Test--post-file.trs Test-proxied-https-auth.trs Test-proxied-https-auth-keepalive.trs Test-proxy-auth-basic.trs Test-restrict-ascii.trs Test-Restrict-Lowercase.trs Test-Restrict-Uppercase.trs Test-stdouterr.trs Test--spider-fail.trs Test--spider.trs Test--spider-r-HTTP-Content-Disposition.trs Test--spider-r--no-content-disposition.trs Test--spider-r--no-content-disposition-trivial.trs Test--spider-r.trs Test--start-pos.trs Test--start-pos--continue.trs Test--httpsonly-r.trs Test-204.trs Test-ftp-pasv-not-supported.trs Test-https-pfs.trs Test-https-tlsv1.trs Test-https-tlsv1x.trs Test-https-selfsigned.trs Test-https-weboftrust.trs Test-https-clientcert.trs Test-https-crl.trs Test-https-badcerts.trs
  120. test -z "test-suite.log" || rm -f test-suite.log
  121. make[1]: Leaving directory `/svr-setup/wget-1.20/tests'
  122. Making clean in testenv
  123. make[1]: Entering directory `/svr-setup/wget-1.20/testenv'
  124. test -z "" || rm -f
  125. test -z "" || rm -f
  126. test -z "test-suite.log" || rm -f test-suite.log
  127. make[1]: Leaving directory `/svr-setup/wget-1.20/testenv'
  128. make[1]: Entering directory `/svr-setup/wget-1.20'
  129. rm -f install-info
  130. make[1]: Leaving directory `/svr-setup/wget-1.20'
  131. configure: configuring for GNU Wget 1.20
  132. checking for a BSD-compatible install... /bin/install -c
  133. checking whether build environment is sane... yes
  134. checking for a thread-safe mkdir -p... /bin/mkdir -p
  135. checking for gawk... gawk
  136. checking whether make sets $(MAKE)... yes
  137. checking whether make supports nested variables... yes
  138. checking build system type... x86_64-pc-linux-gnu
  139. checking host system type... x86_64-pc-linux-gnu
  140. checking whether make supports nested variables... (cached) yes
  141. checking for gcc... ccache gcc
  142. checking whether the C compiler works... yes
  143. checking for C compiler default output file name... a.out
  144. checking for suffix of executables...
  145. checking whether we are cross compiling... no
  146. checking for suffix of object files... o
  147. checking whether we are using the GNU C compiler... yes
  148. checking whether ccache gcc accepts -g... yes
  149. checking for ccache gcc option to enable C11 features... -std=gnu11
  150. checking whether make supports the include directive... yes (GNU style)
  151. checking dependency style of ccache gcc -std=gnu11... gcc3
  152. checking how to run the C preprocessor... ccache gcc -std=gnu11 -E
  153. checking for grep that handles long lines and -e... /bin/grep
  154. checking for egrep... /bin/grep -E
  155. checking for ANSI C header files... yes
  156. checking for sys/types.h... yes
  157. checking for sys/stat.h... yes
  158. checking for stdlib.h... yes
  159. checking for string.h... yes
  160. checking for memory.h... yes
  161. checking for strings.h... yes
  162. checking for inttypes.h... yes
  163. checking for stdint.h... yes
  164. checking for unistd.h... yes
  165. checking minix/config.h usability... no
  166. checking minix/config.h presence... no
  167. checking for minix/config.h... no
  168. checking whether it is safe to define __EXTENSIONS__... yes
  169. checking whether _XOPEN_SOURCE should be defined... no
  170. checking for Minix Amsterdam compiler... no
  171. checking for ar... ar
  172. checking for ranlib... ranlib
  173. checking for _LARGEFILE_SOURCE value needed for large files... no
  174. checking for special C compiler options needed for large files... no
  175. checking for _FILE_OFFSET_BITS value needed for large files... no
  176. checking for a Python interpreter with version >= 3.0... none
  177. checking whether NLS is requested... yes
  178. checking for msgfmt... /bin/msgfmt
  179. checking for gmsgfmt... /bin/msgfmt
  180. checking for xgettext... /bin/xgettext
  181. checking for msgmerge... /bin/msgmerge
  182. checking for ld used by ccache gcc -std=gnu11... /bin/ld
  183. checking if the linker (/bin/ld) is GNU ld... yes
  184. checking for shared library run path origin... done
  185. checking 32-bit host C ABI... no
  186. checking for the common suffixes of directories in the library search path... lib64,lib64
  187. checking for CFPreferencesCopyAppValue... no
  188. checking for CFLocaleCopyCurrent... no
  189. checking for GNU gettext in libc... yes
  190. checking whether to use NLS... yes
  191. checking where the gettext function comes from... libc
  192. checking for ranlib... (cached) ranlib
  193. checking for flex... flex
  194. checking lex output file root... lex.yy
  195. checking lex library... none needed
  196. checking whether yytext is a pointer... no
  197. checking for an ANSI C-conforming const... yes
  198. checking for inline... inline
  199. checking for working volatile... yes
  200. checking for ANSI C header files... (cached) yes
  201. checking for special C compiler options needed for large files... (cached) no
  202. checking for _FILE_OFFSET_BITS value needed for large files... (cached) no
  203. checking size of off_t... 8
  204. checking for stdbool.h that conforms to C99... yes
  205. checking for _Bool... yes
  206. checking for unistd.h... (cached) yes
  207. checking sys/time.h usability... yes
  208. checking sys/time.h presence... yes
  209. checking for sys/time.h... yes
  210. checking termios.h usability... yes
  211. checking termios.h presence... yes
  212. checking for termios.h... yes
  213. checking sys/ioctl.h usability... yes
  214. checking sys/ioctl.h presence... yes
  215. checking for sys/ioctl.h... yes
  216. checking sys/select.h usability... yes
  217. checking sys/select.h presence... yes
  218. checking for sys/select.h... yes
  219. checking utime.h usability... yes
  220. checking utime.h presence... yes
  221. checking for utime.h... yes
  222. checking sys/utime.h usability... no
  223. checking sys/utime.h presence... no
  224. checking for sys/utime.h... no
  225. checking for stdint.h... (cached) yes
  226. checking for inttypes.h... (cached) yes
  227. checking pwd.h usability... yes
  228. checking pwd.h presence... yes
  229. checking for pwd.h... yes
  230. checking wchar.h usability... yes
  231. checking wchar.h presence... yes
  232. checking for wchar.h... yes
  233. checking dlfcn.h usability... yes
  234. checking dlfcn.h presence... yes
  235. checking for dlfcn.h... yes
  236. checking whether h_errno is declared... yes
  237. checking size of short... 2
  238. checking size of int... 4
  239. checking size of long... 8
  240. checking size of long long... 8
  241. checking size of void *... 8
  242. checking for size_t... yes
  243. checking for pid_t... yes
  244. checking for uint32_t... yes
  245. checking for uintptr_t... yes
  246. checking for intptr_t... yes
  247. checking for int64_t... yes
  248. checking for sig_atomic_t... yes
  249. checking for sys/socket.h... yes
  250. checking for arpa/inet.h... yes
  251. checking for features.h... yes
  252. checking for unistd.h... (cached) yes
  253. checking for fnmatch.h... yes
  254. checking for wctype.h... yes
  255. checking for sys/stat.h... (cached) yes
  256. checking for netdb.h... yes
  257. checking for netinet/in.h... yes
  258. checking for getopt.h... yes
  259. checking for sys/cdefs.h... yes
  260. checking for stdio_ext.h... yes
  261. checking for termios.h... (cached) yes
  262. checking for sys/time.h... (cached) yes
  263. checking for iconv.h... yes
  264. checking for limits.h... yes
  265. checking for wchar.h... (cached) yes
  266. checking for stdint.h... (cached) yes
  267. checking for inttypes.h... (cached) yes
  268. checking for crtdefs.h... no
  269. checking for langinfo.h... yes
  270. checking for xlocale.h... yes
  271. checking for sys/mman.h... yes
  272. checking for sys/select.h... (cached) yes
  273. checking for sys/param.h... yes
  274. checking for malloc.h... yes
  275. checking for spawn.h... yes
  276. checking for strings.h... (cached) yes
  277. checking for sys/file.h... yes
  278. checking for sys/ioctl.h... (cached) yes
  279. checking for sys/uio.h... yes
  280. checking for sys/wait.h... yes
  281. checking for utime.h... (cached) yes
  282. checking for stdlib.h... (cached) yes
  283. checking whether the preprocessor supports include_next... yes
  284. checking whether system header files limit the line length... no
  285. checking whether <sys/socket.h> is self-contained... yes
  286. checking for shutdown... yes
  287. checking whether <sys/socket.h> defines the SHUT_* macros... yes
  288. checking for struct sockaddr_storage... yes
  289. checking for sa_family_t... yes
  290. checking for struct sockaddr_storage.ss_family... yes
  291. checking for working alloca.h... yes
  292. checking for alloca... yes
  293. checking for C/C++ restrict keyword... __restrict
  294. checking whether <wchar.h> uses 'inline' correctly... yes
  295. checking for btowc... yes
  296. checking for _set_invalid_parameter_handler... no
  297. checking for fcntl... yes
  298. checking for symlink... yes
  299. checking for flock... yes
  300. checking for fnmatch... yes
  301. checking for isblank... yes
  302. checking for iswctype... yes
  303. checking for mbsrtowcs... yes
  304. checking for mempcpy... yes
  305. checking for wmemchr... yes
  306. checking for wmemcpy... yes
  307. checking for wmempcpy... yes
  308. checking for fpurge... no
  309. checking for __fpurge... yes
  310. checking for __freading... yes
  311. checking for futimens... yes
  312. checking for getdelim... yes
  313. checking for getdtablesize... yes
  314. checking for getpass... yes
  315. checking for __fsetlocking... yes
  316. checking for getprogname... no
  317. checking for getexecname... no
  318. checking for gettimeofday... yes
  319. checking for iswcntrl... yes
  320. checking for iswblank... yes
  321. checking for link... yes
  322. checking for lstat... yes
  323. checking for mbsinit... yes
  324. checking for mbrtowc... yes
  325. checking for mprotect... yes
  326. checking for mkostemp... yes
  327. checking for mkstemp... yes
  328. checking for tzset... yes
  329. checking for nl_langinfo... yes
  330. checking for pipe... yes
  331. checking for pipe2... yes
  332. checking for secure_getenv... yes
  333. checking for getuid... yes
  334. checking for geteuid... yes
  335. checking for getgid... yes
  336. checking for getegid... yes
  337. checking for sigaction... yes
  338. checking for sigaltstack... yes
  339. checking for siginterrupt... yes
  340. checking for snprintf... yes
  341. checking for strdup... yes
  342. checking for strerror_r... yes
  343. checking for __xpg_strerror_r... yes
  344. checking for catgets... yes
  345. checking for strndup... yes
  346. checking for strptime... yes
  347. checking for localtime_r... yes
  348. checking for timegm... yes
  349. checking for utime... yes
  350. checking for futimes... yes
  351. checking for futimesat... yes
  352. checking for utimensat... yes
  353. checking for lutimes... yes
  354. checking for vasnprintf... no
  355. checking for wcrtomb... yes
  356. checking for wcwidth... yes
  357. checking for nl_langinfo and CODESET... yes
  358. checking for a traditional french locale... fr_FR
  359. checking whether linux/if_alg.h has struct sockaddr_alg.... yes
  360. checking whether byte ordering is bigendian... no
  361. checking whether // is distinct from /... no
  362. checking if environ is properly declared... yes
  363. checking for complete errno.h... yes
  364. checking whether strerror_r is declared... yes
  365. checking for strerror_r... (cached) yes
  366. checking whether strerror_r returns char *... yes
  367. checking for sig_atomic_t... (cached) yes
  368. checking for working fcntl.h... yes
  369. checking for mode_t... yes
  370. checking for mbstate_t... yes
  371. checking whether stdin defaults to large file offsets... yes
  372. checking whether fseeko is declared... yes
  373. checking for fseeko... yes
  374. checking whether fflush works on input streams... no
  375. checking whether stat file-mode macros are broken... no
  376. checking for nlink_t... yes
  377. checking whether ftello is declared... yes
  378. checking for ftello... yes
  379. checking whether ftello works... yes
  380. checking for library containing gethostbyname... none required
  381. checking for gethostbyname... yes
  382. checking for library containing getservbyname... none required
  383. checking for getservbyname... yes
  384. checking for library containing inet_ntop... none required
  385. checking whether inet_ntop is declared... yes
  386. checking for IPv4 sockets... yes
  387. checking for IPv6 sockets... yes
  388. checking whether getdelim is declared... yes
  389. checking whether getdtablesize is declared... yes
  390. checking for uid_t in sys/types.h... yes
  391. checking type of array argument to getgroups... gid_t
  392. checking whether getline is declared... yes
  393. checking for getopt.h... (cached) yes
  394. checking for getopt_long_only... yes
  395. checking whether getopt is POSIX compatible... yes
  396. checking for working GNU getopt function... yes
  397. checking for working GNU getopt_long function... yes
  398. checking whether fflush_unlocked is declared... yes
  399. checking whether flockfile is declared... yes
  400. checking whether fputs_unlocked is declared... yes
  401. checking whether funlockfile is declared... yes
  402. checking whether putc_unlocked is declared... yes
  403. checking for struct timeval... yes
  404. checking for wide-enough struct timeval.tv_sec member... yes
  405. checking for iconv... yes
  406. checking for working iconv... yes
  407. checking for iconv declaration...
  408.         extern size_t iconv (iconv_t cd, char * *inbuf, size_t *inbytesleft, char * *outbuf, size_t *outbytesleft);
  409. checking whether limits.h has LLONG_MAX, WORD_BIT, ULLONG_WIDTH etc.... no
  410. checking for wint_t... yes
  411. checking whether wint_t is too small... no
  412. checking for unsigned long long int... yes
  413. checking for long long int... yes
  414. checking whether stdint.h conforms to C99... no
  415. checking sys/inttypes.h usability... no
  416. checking sys/inttypes.h presence... no
  417. checking for sys/inttypes.h... no
  418. checking sys/bitypes.h usability... yes
  419. checking sys/bitypes.h presence... yes
  420. checking for sys/bitypes.h... yes
  421. checking for bit size of ptrdiff_t... 64
  422. checking for bit size of size_t... 64
  423. checking for bit size of sig_atomic_t... 32
  424. checking for bit size of wchar_t... 32
  425. checking for bit size of wint_t... 32
  426. checking whether sig_atomic_t is signed... yes
  427. checking whether wchar_t is signed... yes
  428. checking whether wint_t is signed... no
  429. checking for ptrdiff_t integer literal suffix... l
  430. checking for size_t integer literal suffix... ul
  431. checking for sig_atomic_t integer literal suffix...
  432. checking for wchar_t integer literal suffix...
  433. checking for wint_t integer literal suffix... u
  434. checking for inttypes.h... (cached) yes
  435. checking whether the inttypes.h PRIxNN macros are broken... no
  436. checking whether iswcntrl works... yes
  437. checking for towlower... yes
  438. checking for wctype_t... yes
  439. checking for wctrans_t... yes
  440. checking whether included libunistring is requested... no
  441. checking for libunistring... no, consider installing GNU libunistring
  442. checking for wchar_t... yes
  443. checking for good max_align_t... yes
  444. checking whether NULL can be used in arbitrary expressions... yes
  445. checking whether imported symbols can be declared weak... yes
  446. checking whether the linker supports --as-needed... yes
  447. checking whether the linker supports --push-state... yes
  448. checking pthread.h usability... yes
  449. checking pthread.h presence... yes
  450. checking for pthread.h... yes
  451. checking for multithread API to use... posix
  452. checking whether lstat correctly handles trailing slash... yes
  453. checking for a sed that does not truncate output... /bin/sed
  454. checking whether malloc, realloc, calloc are POSIX compliant... yes
  455. checking for stdlib.h... (cached) yes
  456. checking for GNU libc compatible malloc... yes
  457. checking for a traditional japanese locale... ja_JP
  458. checking for a transitional chinese locale... zh_CN.GB18030
  459. checking for a french Unicode locale... fr_FR.UTF-8
  460. checking for mmap... yes
  461. checking for MAP_ANONYMOUS... yes
  462. checking whether memchr works... yes
  463. checking whether memrchr is declared... yes
  464. checking whether <limits.h> defines MIN and MAX... no
  465. checking whether <sys/param.h> defines MIN and MAX... yes
  466. checking whether time_t is signed... yes
  467. checking whether alarm is declared... yes
  468. checking for working mktime... yes
  469. checking whether <sys/select.h> is self-contained... yes
  470. checking for library containing setsockopt... none needed
  471. checking whether select supports a 0 argument... yes
  472. checking whether select detects invalid fds... yes
  473. checking for O_CLOEXEC... yes
  474. checking for promoted mode_t type... mode_t
  475. checking for library containing posix_spawn... none required
  476. checking for posix_spawn... yes
  477. checking whether posix_spawn works... yes
  478. checking whether posix_spawnattr_setschedpolicy is supported... yes
  479. checking whether posix_spawnattr_setschedparam is supported... yes
  480. checking for sigset_t... yes
  481. checking for SIGPIPE... yes
  482. checking whether we are using the GNU C Library >= 2.1 or uClibc... yes
  483. checking whether C symbols are prefixed with underscore at the linker level... no
  484. checking whether snprintf returns a byte count as in C99... yes
  485. checking whether snprintf is declared... yes
  486. checking whether strdup is declared... yes
  487. checking whether strerror(0) succeeds... yes
  488. checking for strerror_r with POSIX signature... no
  489. checking whether __xpg_strerror_r works... yes
  490. checking whether strerror_r is declared... (cached) yes
  491. checking whether strndup is declared... yes
  492. checking whether strnlen is declared... yes
  493. checking for struct tm.tm_gmtoff... yes
  494. checking whether strtok_r is declared... yes
  495. checking for struct timespec in <time.h>... yes
  496. checking whether clearerr_unlocked is declared... yes
  497. checking whether feof_unlocked is declared... yes
  498. checking whether ferror_unlocked is declared... yes
  499. checking whether fgets_unlocked is declared... yes
  500. checking whether fputc_unlocked is declared... yes
  501. checking whether fread_unlocked is declared... yes
  502. checking whether fwrite_unlocked is declared... yes
  503. checking whether getc_unlocked is declared... yes
  504. checking whether getchar_unlocked is declared... yes
  505. checking whether putchar_unlocked is declared... yes
  506. checking whether the utimes function works... yes
  507. checking for inttypes.h... yes
  508. checking for stdint.h... yes
  509. checking for intmax_t... yes
  510. checking where to find the exponent in a 'double'... word 1 bit 20
  511. checking for snprintf... (cached) yes
  512. checking for strnlen... yes
  513. checking for wcslen... yes
  514. checking for wcsnlen... yes
  515. checking for mbrtowc... (cached) yes
  516. checking for wcrtomb... (cached) yes
  517. checking whether _snprintf is declared... no
  518. checking whether vsnprintf is declared... yes
  519. checking for alloca as a compiler built-in... yes
  520. checking whether btowc(0) is correct... yes
  521. checking whether btowc(EOF) is correct... yes
  522. checking for __builtin_expect... yes
  523. checking byteswap.h usability... yes
  524. checking byteswap.h presence... yes
  525. checking for byteswap.h... yes
  526. checking for library containing clock_gettime... none required
  527. checking for clock_gettime... yes
  528. checking for clock_settime... yes
  529. checking whether // is distinct from /... (cached) no
  530. checking whether dup2 works... yes
  531. checking for error_at_line... yes
  532. checking whether fcntl handles F_DUPFD correctly... yes
  533. checking whether fcntl understands F_DUPFD_CLOEXEC... needs runtime check
  534. checking whether fflush works on input streams... (cached) no
  535. checking for flexible array member... yes
  536. checking whether conversion from 'int' to 'long double' works... yes
  537. checking for working POSIX fnmatch... yes
  538. checking whether fopen recognizes a trailing slash... yes
  539. checking whether fpurge is declared... no
  540. checking for fseeko... (cached) yes
  541. checking whether fflush works on input streams... (cached) no
  542. checking for _fseeki64... no
  543. checking for ftello... (cached) yes
  544. checking whether ftello works... (cached) yes
  545. checking whether futimens works... yes
  546. checking how to do getaddrinfo, freeaddrinfo and getnameinfo... checking for library containing getaddrinfo... none required
  547. checking for getaddrinfo... yes
  548. checking whether gai_strerror is declared... yes
  549. checking whether gai_strerrorA is declared... no
  550. checking for gai_strerror with POSIX signature... yes
  551. checking for struct sockaddr.sa_len... no
  552. checking whether getaddrinfo is declared... yes
  553. checking whether freeaddrinfo is declared... yes
  554. checking whether getnameinfo is declared... yes
  555. checking for struct addrinfo... yes
  556. checking for working getdelim function... yes
  557. checking whether getdtablesize works... yes
  558. checking for getgroups... yes
  559. checking for working getgroups... yes
  560. checking whether getgroups handles negative values... yes
  561. checking for getline... yes
  562. checking for working getline function... yes
  563. checking for getpass without length limitations... yes
  564. checking whether program_invocation_name is declared... yes
  565. checking whether program_invocation_short_name is declared... yes
  566. checking whether __argv is declared... no
  567. checking whether gettimeofday clobbers localtime buffer... no
  568. checking for gettimeofday with POSIX signature... almost
  569. checking for group_member... yes
  570. checking for library containing gethostbyname... (cached) none required
  571. checking for gethostbyname... (cached) yes
  572. checking for library containing inet_ntop... (cached) none required
  573. checking whether inet_ntop is declared... (cached) yes
  574. checking whether the compiler generally respects inline... yes
  575. checking whether INT32_MAX < INTMAX_MAX... yes
  576. checking whether INT64_MAX == LONG_MAX... yes
  577. checking whether UINT32_MAX < UINTMAX_MAX... yes
  578. checking whether UINT64_MAX == ULONG_MAX... yes
  579. checking for ioctl... yes
  580. checking for ioctl with POSIX signature... no
  581. checking whether iswblank is declared... yes
  582. checking whether langinfo.h defines CODESET... yes
  583. checking whether langinfo.h defines T_FMT_AMPM... yes
  584. checking whether langinfo.h defines ALTMON_1... no
  585. checking whether langinfo.h defines ERA... yes
  586. checking whether langinfo.h defines YESEXPR... yes
  587. checking whether the compiler supports the __inline keyword... yes
  588. checking whether to use the included libunistring... yes
  589. checking whether link obeys POSIX... yes
  590. checking whether locale.h conforms to POSIX:2001... yes
  591. checking whether locale.h defines locale_t... yes
  592. checking whether struct lconv is properly defined... yes
  593. checking for pthread_rwlock_t... yes
  594. checking whether pthread_rwlock_rdlock prefers a writer to a reader... no
  595. checking whether lseek detects pipes... yes
  596. checking whether mbrtowc handles incomplete characters... yes
  597. checking whether mbrtowc works as well as mbtowc... yes
  598. checking whether mbrtowc handles a NULL pwc argument... yes
  599. checking whether mbrtowc handles a NULL string argument... yes
  600. checking whether mbrtowc has a correct return value... yes
  601. checking whether mbrtowc returns 0 when parsing a NUL character... yes
  602. checking whether mbrtowc works on empty input... no
  603. checking whether the C locale is free of encoding errors... no
  604. checking whether mbrtowc handles incomplete characters... (cached) yes
  605. checking whether mbrtowc works as well as mbtowc... (cached) yes
  606. checking whether mbrtowc handles incomplete characters... (cached) yes
  607. checking whether mbrtowc works as well as mbtowc... (cached) yes
  608. checking whether mbsrtowcs works... yes
  609. checking for memrchr... yes
  610. checking whether mkdir handles trailing slash... yes
  611. checking whether mkdir handles trailing dot... yes
  612. checking for working mkstemp... yes
  613. checking for __mktime_internal... no
  614. checking for library containing nanosleep... none required
  615. checking for working nanosleep... no (mishandles large arguments)
  616. checking whether <netinet/in.h> is self-contained... yes
  617. checking whether YESEXPR works... yes
  618. checking whether open recognizes a trailing slash... yes
  619. checking whether posix_spawn_file_actions_addclose works... yes
  620. checking whether posix_spawn_file_actions_adddup2 works... yes
  621. checking whether posix_spawn_file_actions_addopen works... yes
  622. checking for raise... yes
  623. checking for sigprocmask... yes
  624. checking for rawmemchr... yes
  625. checking for working re_compile_pattern... yes
  626. checking whether select supports a 0 argument... (cached) yes
  627. checking whether select detects invalid fds... (cached) yes
  628. checking for library containing getservbyname... (cached) none required
  629. checking for getservbyname... (cached) yes
  630. checking for struct sigaction.sa_sigaction... yes
  631. checking for volatile sig_atomic_t... yes
  632. checking for sighandler_t... yes
  633. checking for sigprocmask... (cached) yes
  634. checking for stdint.h... (cached) yes
  635. checking for SIZE_MAX... yes
  636. checking for snprintf... (cached) yes
  637. checking whether snprintf respects a size of 1... yes
  638. checking whether printf supports POSIX/XSI format strings with positions... yes
  639. checking for socklen_t... yes
  640. checking for posix_spawnattr_t... yes
  641. checking for posix_spawn_file_actions_t... yes
  642. checking for ssize_t... yes
  643. checking whether stat handles trailing slashes on files... yes
  644. checking for struct stat.st_atim.tv_nsec... yes
  645. checking whether struct stat.st_atim is of type struct timespec... yes
  646. checking for struct stat.st_birthtimespec.tv_nsec... no
  647. checking for struct stat.st_birthtimensec... no
  648. checking for struct stat.st_birthtim.tv_nsec... no
  649. checking for working stdalign.h... yes
  650. checking for good max_align_t... (cached) yes
  651. checking whether NULL can be used in arbitrary expressions... (cached) yes
  652. checking which flavor of printf attribute matches inttypes macros... system
  653. checking for strcasecmp... yes
  654. checking for strncasecmp... yes
  655. checking whether strncasecmp is declared... yes
  656. checking for strchrnul... yes
  657. checking whether strchrnul works... yes
  658. checking for working strerror function... yes
  659. checking for working strndup... yes
  660. checking for working strnlen... yes
  661. checking for strpbrk... yes
  662. checking for strtok_r... yes
  663. checking whether strtok_r works... yes
  664. checking for strtol... yes
  665. checking for strtoll... yes
  666. checking whether symlink handles trailing slash correctly... yes
  667. checking whether <sys/ioctl.h> declares ioctl... yes
  668. checking for nlink_t... (cached) yes
  669. checking whether localtime_r is declared... yes
  670. checking whether localtime_r is compatible with its POSIX signature... yes
  671. checking whether unlink honors trailing slashes... yes
  672. checking whether unlink of a parent directory fails as it should... guessing yes
  673. checking for ptrdiff_t... yes
  674. checking for vasprintf... yes
  675. checking for vsnprintf... yes
  676. checking whether snprintf respects a size of 1... (cached) yes
  677. checking whether printf supports POSIX/XSI format strings with positions... (cached) yes
  678. checking for waitid... yes
  679. checking whether mbrtowc handles incomplete characters... (cached) yes
  680. checking whether mbrtowc works as well as mbtowc... (cached) yes
  681. checking whether wcrtomb return value is correct... yes
  682. checking whether iswcntrl works... (cached) yes
  683. checking for towlower... (cached) yes
  684. checking for wctype_t... (cached) yes
  685. checking for wctrans_t... (cached) yes
  686. checking whether wcwidth is declared... yes
  687. checking whether wcwidth works reasonably in UTF-8 locales... yes
  688. checking for stdint.h... (cached) yes
  689. checking for getpagesize... yes
  690. checking for working mmap... yes
  691. checking for _LARGEFILE_SOURCE value needed for large files... (cached) no
  692. checking for strptime... (cached) yes
  693. checking for timegm... (cached) yes
  694. checking for vsnprintf... (cached) yes
  695. checking for vasprintf... (cached) yes
  696. checking for drand48... yes
  697. checking for pathconf... yes
  698. checking for strtoll... (cached) yes
  699. checking for usleep... yes
  700. checking for ftello... yes
  701. checking for sigblock... yes
  702. checking for sigsetjmp... no
  703. checking for memrchr... (cached) yes
  704. checking for wcwidth... (cached) yes
  705. checking for mbtowc... yes
  706. checking for sleep... yes
  707. checking for symlink... (cached) yes
  708. checking for utime... (cached) yes
  709. checking for strlcpy... no
  710. checking for random... yes
  711. checking for fmemopen... yes
  712. checking for pkg-config... /bin/pkg-config
  713. checking pkg-config is at least version 0.9.0... yes
  714. checking for LIBPSL... no
  715. checking for library containing psl_builtin... no
  716. configure: WARNING: *** libpsl was not found. Fallback to builtin cookie checking.
  717. checking for ZLIB... yes
  718. checking for OPENSSL... yes
  719. configure: compiling in support for SSL via OpenSSL
  720. checking for RAND_egd... yes
  721. checking for INET6 protocol support... yes
  722. checking for struct sockaddr_in6... yes
  723. checking for struct sockaddr_storage... (cached) yes
  724. checking for struct sockaddr_in6.sin6_scope_id... yes
  725. configure: Enabling support for IPv6.
  726. checking for makeinfo... ${SHELL} /svr-setup/wget-1.20/build-aux/missing makeinfo
  727. checking for perl5... no
  728. checking for perl... /bin/perl
  729. checking for pod2man... /bin/pod2man
  730. checking for library containing idn2_lookup_u8... no
  731. configure: WARNING: *** LIBIDN2 was not found. You will not be able to use IDN2008 support
  732. checking uuid.h usability... no
  733. checking uuid.h presence... no
  734. checking for uuid.h... no
  735. checking uuid/uuid.h usability... yes
  736. checking uuid/uuid.h presence... yes
  737. checking for uuid/uuid.h... yes
  738. checking for library containing uuid_generate... -luuid
  739. checking for PCRE2... no
  740. checking pcre2.h usability... no
  741. checking pcre2.h presence... no
  742. checking for pcre2.h... no
  743. checking for PCRE... yes
  744. checking pcre.h usability... yes
  745. checking pcre.h presence... yes
  746. checking for pcre.h... yes
  747. checking for gpgme-config... no
  748. checking for METALINK... no
  749. checking for fsetxattr... yes
  750. checking that generated files are newer than configure... done
  751. configure: creating ./config.status
  752. config.status: creating Makefile
  753. config.status: creating src/Makefile
  754. config.status: creating doc/Makefile
  755. config.status: creating util/Makefile
  756. config.status: creating po/Makefile.in
  757. config.status: creating tests/Makefile
  758. config.status: creating fuzz/Makefile
  759. config.status: creating lib/Makefile
  760. config.status: creating testenv/Makefile
  761. config.status: creating tests/certs/interca.conf
  762. config.status: creating tests/certs/rootca.conf
  763. config.status: creating src/config.h
  764. config.status: src/config.h is unchanged
  765. config.status: executing depfiles commands
  766. config.status: executing po-directories commands
  767. config.status: creating po/POTFILES
  768. config.status: creating po/Makefile
  769. configure: Summary of build options:
  770.  
  771.  Version:           1.20
  772.  Host OS:           linux-gnu
  773.  Install prefix:    /usr/local
  774.  Compiler:          ccache gcc -std=gnu11
  775.  CFlags:            -I /usr/local/include   -DHAVE_LIBSSL   -DNDEBUG -O2 -g -pipe -Wall -Wp,-D_FORTIFY_SOURCE=2 -fexceptions -fstack-protector-strong --param=ssp-buffer-size=4 -grecord-gcc-switches -m64 -mtune=generic
  776.  LDFlags:          
  777.  Libs:              -L /usr/local/lib -lpcre -luuid -lssl -lcrypto   -lz  
  778.  SSL:               openssl
  779.  Zlib:              yes
  780.  PSL:               no
  781.  PCRE:              yes, via libpcre
  782.  Digest:            yes
  783.  NTLM:              yes
  784.  OPIE:              yes
  785.  POSIX xattr:       yes
  786.  Debugging:         yes
  787.  Assertions:        no
  788.  Valgrind:          Valgrind testing not enabled
  789.  Metalink:          no
  790.  Resolver:          libc, --bind-dns-address and --dns-servers not available
  791.  GPGME:             no
  792.  IRI:               no
  793.  Fuzzing build:     no,
  794.  
  795. make  all-recursive
  796. make[1]: Entering directory `/svr-setup/wget-1.20'
  797. Making all in lib
  798. make[2]: Entering directory `/svr-setup/wget-1.20/lib'
  799.  GEN      alloca.h
  800.  GEN      fcntl.h
  801.  GEN      inttypes.h
  802.  GEN      langinfo.h
  803.  GEN      arpa/inet.h
  804.  GEN      limits.h
  805.  GEN      locale.h
  806.  GEN      netdb.h
  807.  GEN      signal.h
  808.  GEN      spawn.h
  809.  GEN      stdint.h
  810.  GEN      stdio.h
  811.  GEN      stdlib.h
  812.  GEN      string.h
  813.  GEN      strings.h
  814.  GEN      sys/file.h
  815.  GEN      sys/socket.h
  816.  GEN      sys/select.h
  817.  GEN      sys/ioctl.h
  818.  GEN      sys/stat.h
  819.  GEN      sys/time.h
  820.  GEN      sys/types.h
  821.  GEN      sys/uio.h
  822.  GEN      sys/wait.h
  823.  GEN      unicase.h
  824.  GEN      time.h
  825.  GEN      unictype.h
  826.  GEN      unicase/special-casing.h
  827.  GEN      uninorm.h
  828.  GEN      unistd.h
  829.  GEN      unistr.h
  830.  GEN      unitypes.h
  831.  GEN      uniwidth.h
  832.  GEN      wchar.h
  833.  GEN      wctype.h
  834. make  all-recursive
  835. make[3]: Entering directory `/svr-setup/wget-1.20/lib'
  836. make[4]: Entering directory `/svr-setup/wget-1.20/lib'
  837.  CC       base32.o
  838.  CC       c-ctype.o
  839.  CC       binary-io.o
  840.  CC       c-strcasecmp.o
  841.  CC       c-strncasecmp.o
  842.  CC       c-strcasestr.o
  843.  CC       cloexec.o
  844.  CC       af_alg.o
  845.  CC       md2.o
  846.  CC       md4.o
  847.  CC       md5.o
  848.  CC       sha1.o
  849.  CC       sha256.o
  850.  CC       dirname.o
  851.  CC       sha512.o
  852.  CC       basename.o
  853.  CC       dirname-lgpl.o
  854.  CC       basename-lgpl.o
  855.  CC       stripslash.o
  856.  CC       exitfail.o
  857.  CC       fatal-signal.o
  858.  CC       fd-hook.o
  859.  CC       fd-safer-flag.o
  860.  CC       dup-safer-flag.o
  861.  CC       freading.o
  862.  CC       getprogname.o
  863.  CC       gettime.o
  864.  CC       hard-locale.o
  865.  CC       localcharset.o
  866.  CC       glthread/lock.o
  867.  CC       malloca.o
  868.  CC       mbchar.o
  869.  CC       mbiter.o
  870.  CC       pipe2.o
  871.  CC       pipe2-safer.o
  872.  CC       quotearg.o
  873.  CC       sig-handler.o
  874.  CC       sockets.o
  875.  CC       spawn-pipe.o
  876.  CC       stat-time.o
  877.  CC       strnlen1.o
  878.  CC       sys_socket.o
  879.  CC       tempname.o
  880.  CC       glthread/threadlib.o
  881.  CC       timespec.o
  882.  CC       tmpdir.o
  883.  CC       u64.o
  884.  CC       unicase/cased.o
  885.  CC       unicase/empty-prefix-context.o
  886.  CC       unicase/empty-suffix-context.o
  887.  CC       unicase/ignorable.o
  888.  CC       unicase/special-casing.o
  889.  CC       unicase/tolower.o
  890.  CC       unicase/u8-casemap.o
  891.  CC       unicase/u8-tolower.o
  892.  CC       unictype/combiningclass.o
  893.  CC       unictype/pr_soft_dotted.o
  894.  CC       uninorm/decompose-internal.o
  895.  CC       uninorm/u8-normalize.o
  896.  CC       dup-safer.o
  897.  CC       unistd.o
  898.  CC       fd-safer.o
  899.  CC       pipe-safer.o
  900.  CC       unistr/u8-cpy.o
  901.  CC       unistr/u8-mbtouc-unsafe.o
  902.  CC       unistr/u8-mbtouc-unsafe-aux.o
  903.  CC       unistr/u8-strlen.o
  904.  CC       unistr/u8-uctomb.o
  905.  CC       unistr/u8-uctomb-aux.o
  906.  CC       uniwidth/width.o
  907.  CC       utimens.o
  908.  CC       wait-process.o
  909.  CC       wctype-h.o
  910.  CC       xmalloc.o
  911.  CC       xalloc-die.o
  912.  CC       xsize.o
  913.  CC       xstrndup.o
  914.  CC       asnprintf.o
  915.  CC       fcntl.o
  916.  CC       fflush.o
  917.  CC       fpurge.o
  918.  CC       fseek.o
  919.  CC       fseeko.o
  920.  CC       ioctl.o
  921.  CC       localtime-buffer.o
  922.  CC       mbrtowc.o
  923.  CC       mktime.o
  924.  CC       nanosleep.o
  925.  CC       nl_langinfo.o
  926.  CC       printf-args.o
  927.  CC       printf-parse.o
  928.  CC       strerror_r.o
  929.  CC       vasnprintf.o
  930.  CC       xmemdup0.o
  931.  AR       libgnu.a
  932. make[4]: Leaving directory `/svr-setup/wget-1.20/lib'
  933. make[3]: Leaving directory `/svr-setup/wget-1.20/lib'
  934. make[2]: Leaving directory `/svr-setup/wget-1.20/lib'
  935. Making all in src
  936. make[2]: Entering directory `/svr-setup/wget-1.20/src'
  937. make  all-am
  938. make[3]: Entering directory `/svr-setup/wget-1.20/src'
  939. if test -n ""; then cp "./build_info.c.in" .; fi
  940. /bin/perl "../build-aux/build_info.pl" \
  941.     "../src/build_info.c"
  942.   CC       connect.o
  943.   CC       convert.o
  944.   CC       cookies.o
  945.   CC       ftp.o
  946. if test -n ""; then rm -f build_info.c.in; fi
  947.   CC       css_.o
  948.   CC       css-url.o
  949.   CC       ftp-basic.o
  950.   CC       ftp-ls.o
  951.   CC       hash.o
  952.   CC       host.o
  953.   CC       hsts.o
  954.   CC       html-parse.o
  955.   CC       html-url.o
  956.   CC       http.o
  957.   CC       init.o
  958. hsts.c: In function 'hsts_store_save':
  959. hsts.c:577:21: warning: ignoring return value of 'ftruncate', declared with attribute warn_unused_result [-Wunused-result]
  960.            ftruncate (fd, 0);
  961.                      ^
  962.   CC       log.o
  963.   CC       main.o
  964.   CC       netrc.o
  965.   CC       progress.o
  966.   CC       ptimer.o
  967.   CC       recur.o
  968.   CC       res.o
  969.   CC       retr.o
  970.   CC       spider.o
  971.   CC       warc.o
  972.   CC       url.o
  973.   CC       xattr.o
  974.   CC       utils.o
  975.   CC       exits.o
  976.   CC       build_info.o
  977. echo '/* version.c */' > version.c
  978.   CC       ftp-opie.o
  979. echo '/* Autogenerated by Makefile - DO NOT EDIT */' >> version.c
  980. echo '' >> version.c
  981. echo '#include "version.h"' >> version.c
  982. echo 'const char *version_string = "1.20";' >> version.c
  983.   CC       openssl.o
  984. echo 'const char *compilation_string = "'ccache gcc -std=gnu11 -DHAVE_CONFIG_H -DSYSTEM_WGETRC=\"/usr/local/etc/wgetrc\" -DLOCALEDIR=\"/usr/local/share/locale\" -I.  -I../lib -I../lib   -I /usr/local/include   -DHAVE_LIBSSL   -DNDEBUG -O2 -g -pipe -Wall -Wp,-D_FORTIFY_SOURCE=2 -fexceptions -fstack-protector-strong --param=ssp-buffer-size=4 -grecord-gcc-switches -m64 -mtune=generic'";' \
  985.     | sed -e 's/[\\"]/\\&/g' -e 's/\\"/"/' -e 's/\\";$/";/' >> version.c
  986.   CC       http-ntlm.o
  987. echo 'const char *link_string = "'ccache gcc -std=gnu11  -I /usr/local/include   -DHAVE_LIBSSL   -DNDEBUG -O2 -g -pipe -Wall -Wp,-D_FORTIFY_SOURCE=2 -fexceptions -fstack-protector-strong --param=ssp-buffer-size=4 -grecord-gcc-switches -m64 -mtune=generic \
  988.   -L /usr/local/lib -lpcre -luuid -lssl -lcrypto   -lz    ftp-opie.o openssl.o http-ntlm.o ../lib/libgnu.a              '";' \
  989.     | sed -e 's/[\\"]/\\&/g' -e 's/\\"/"/' -e 's/\\";$/";/' >> version.c
  990.   CC       version.o
  991.   CCLD     wget
  992. openssl.o: In function `init_prng':
  993. /svr-setup/wget-1.20/src/openssl.c:92: undefined reference to `RAND_egd'
  994. openssl.o: In function `ssl_init':
  995. /svr-setup/wget-1.20/src/openssl.c:207: undefined reference to `SSL_library_init'
  996. /svr-setup/wget-1.20/src/openssl.c:208: undefined reference to `SSL_load_error_strings'
  997. /svr-setup/wget-1.20/src/openssl.c:211: undefined reference to `OPENSSL_add_all_algorithms_noconf'
  998. /svr-setup/wget-1.20/src/openssl.c:212: undefined reference to `SSL_library_init'
  999. /svr-setup/wget-1.20/src/openssl.c:225: undefined reference to `SSLv3_client_method'
  1000. /svr-setup/wget-1.20/src/openssl.c:231: undefined reference to `SSLv23_client_method'
  1001. openssl.o: In function `ssl_connect_wget':
  1002. /svr-setup/wget-1.20/src/openssl.c:650: undefined reference to `SSL_state'
  1003. openssl.o: In function `ssl_check_certificate':
  1004. /svr-setup/wget-1.20/src/openssl.c:918: undefined reference to `sk_num'
  1005. /svr-setup/wget-1.20/src/openssl.c:922: undefined reference to `sk_value'
  1006. /svr-setup/wget-1.20/src/openssl.c:963: undefined reference to `sk_pop_free'
  1007. /svr-setup/wget-1.20/src/openssl.c:963: undefined reference to `sk_pop_free'
  1008. /svr-setup/wget-1.20/src/openssl.c:963: undefined reference to `sk_pop_free'
  1009. collect2: error: ld returned 1 exit status
  1010. make[3]: *** [wget] Error 1
  1011. make[3]: Leaving directory `/svr-setup/wget-1.20/src'
  1012. make[2]: *** [all] Error 2
  1013. make[2]: Leaving directory `/svr-setup/wget-1.20/src'
  1014. make[1]: *** [all-recursive] Error 1
  1015. make[1]: Leaving directory `/svr-setup/wget-1.20'
  1016. make: *** [all] Error 2
  1017. make  install-recursive
  1018. make[1]: Entering directory `/svr-setup/wget-1.20'
  1019. Making install in lib
  1020. make[2]: Entering directory `/svr-setup/wget-1.20/lib'
  1021. make  install-recursive
  1022. make[3]: Entering directory `/svr-setup/wget-1.20/lib'
  1023. make[4]: Entering directory `/svr-setup/wget-1.20/lib'
  1024. make[5]: Entering directory `/svr-setup/wget-1.20/lib'
  1025. make[5]: Nothing to be done for `install-exec-am'.
  1026. make[5]: Nothing to be done for `install-data-am'.
  1027. make[5]: Leaving directory `/svr-setup/wget-1.20/lib'
  1028. make[4]: Leaving directory `/svr-setup/wget-1.20/lib'
  1029. make[3]: Leaving directory `/svr-setup/wget-1.20/lib'
  1030. make[2]: Leaving directory `/svr-setup/wget-1.20/lib'
  1031. Making install in src
  1032. make[2]: Entering directory `/svr-setup/wget-1.20/src'
  1033.   CCLD     wget
  1034. openssl.o: In function `init_prng':
  1035. /svr-setup/wget-1.20/src/openssl.c:92: undefined reference to `RAND_egd'
  1036. openssl.o: In function `ssl_init':
  1037. /svr-setup/wget-1.20/src/openssl.c:207: undefined reference to `SSL_library_init'
  1038. /svr-setup/wget-1.20/src/openssl.c:208: undefined reference to `SSL_load_error_strings'
  1039. /svr-setup/wget-1.20/src/openssl.c:211: undefined reference to `OPENSSL_add_all_algorithms_noconf'
  1040. /svr-setup/wget-1.20/src/openssl.c:212: undefined reference to `SSL_library_init'
  1041. /svr-setup/wget-1.20/src/openssl.c:225: undefined reference to `SSLv3_client_method'
  1042. /svr-setup/wget-1.20/src/openssl.c:231: undefined reference to `SSLv23_client_method'
  1043. openssl.o: In function `ssl_connect_wget':
  1044. /svr-setup/wget-1.20/src/openssl.c:650: undefined reference to `SSL_state'
  1045. openssl.o: In function `ssl_check_certificate':
  1046. /svr-setup/wget-1.20/src/openssl.c:918: undefined reference to `sk_num'
  1047. /svr-setup/wget-1.20/src/openssl.c:922: undefined reference to `sk_value'
  1048. /svr-setup/wget-1.20/src/openssl.c:963: undefined reference to `sk_pop_free'
  1049. /svr-setup/wget-1.20/src/openssl.c:963: undefined reference to `sk_pop_free'
  1050. /svr-setup/wget-1.20/src/openssl.c:963: undefined reference to `sk_pop_free'
  1051. collect2: error: ld returned 1 exit status
  1052. make[2]: *** [wget] Error 1
  1053. make[2]: Leaving directory `/svr-setup/wget-1.20/src'
  1054. make[1]: *** [install-recursive] Error 1
  1055. make[1]: Leaving directory `/svr-setup/wget-1.20'
  1056. make: *** [install] Error 2
  1057.  
  1058. --------------------------------------------------------
  1059. ldconfig -p | grep libpcre.so.1
  1060.        libpcre.so.1 (libc6,x86-64) => /usr/local/lib/libpcre.so.1
  1061.        libpcre.so.1 (libc6,x86-64) => /lib64/libpcre.so.1
  1062.  
  1063. ldd alias wget='/usr/local/bin/wget'
  1064.        /usr/local/bin/wget
  1065. alias:
  1066. ldd: ./alias: No such file or directory
  1067. wget='/usr/local/bin/wget':
  1068. ldd: wget='/usr/local/bin/wget': No such file or directory
  1069. /usr/local/bin/wget:
  1070.        linux-vdso.so.1 =>  (0x00007ffd6fca2000)
  1071.        libpcre.so.1 => /usr/local/lib/libpcre.so.1 (0x00007ff365d09000)
  1072.        libssl.so.10 => /lib64/libssl.so.10 (0x00007ff365a97000)
  1073.        libcrypto.so.10 => /lib64/libcrypto.so.10 (0x00007ff365636000)
  1074.        libz.so.1 => /lib64/libz.so.1 (0x00007ff365420000)
  1075.        libc.so.6 => /lib64/libc.so.6 (0x00007ff365053000)
  1076.        libpthread.so.0 => /lib64/libpthread.so.0 (0x00007ff364e37000)
  1077.        libgssapi_krb5.so.2 => /lib64/libgssapi_krb5.so.2 (0x00007ff364bea000)
  1078.        libkrb5.so.3 => /lib64/libkrb5.so.3 (0x00007ff364901000)
  1079.        libcom_err.so.2 => /lib64/libcom_err.so.2 (0x00007ff3646fd000)
  1080.        libk5crypto.so.3 => /lib64/libk5crypto.so.3 (0x00007ff3644e2000)
  1081.        libdl.so.2 => /lib64/libdl.so.2 (0x00007ff3642de000)
  1082.        /lib64/ld-linux-x86-64.so.2 (0x00007ff365f78000)
  1083.        libkrb5support.so.0 => /lib64/libkrb5support.so.0 (0x00007ff3640cf000)
  1084.        libkeyutils.so.1 => /lib64/libkeyutils.so.1 (0x00007ff363ecb000)
  1085.        libresolv.so.2 => /lib64/libresolv.so.2 (0x00007ff363cb2000)
  1086.        libselinux.so.1 => /lib64/libselinux.so.1 (0x00007ff363a8b000)
  1087. --------------------------------------------------------
  1088. wget -V
  1089. GNU Wget 1.19.4 built on linux-gnu.
  1090.  
  1091. -cares +digest -gpgme +https +ipv6 -iri +large-file -metalink +nls
  1092. +ntlm +opie -psl +ssl/openssl
  1093.  
  1094. Wgetrc:
  1095.    /usr/local/etc/wgetrc (system)
  1096. Locale:
  1097.    /usr/local/share/locale
  1098. Compile:
  1099.    ccache gcc -DHAVE_CONFIG_H -DSYSTEM_WGETRC="/usr/local/etc/wgetrc"
  1100.    -DLOCALEDIR="/usr/local/share/locale" -I. -I../lib -I../lib -I
  1101.    /usr/local/include -DHAVE_LIBSSL -DNDEBUG -O2 -g -pipe -Wall
  1102.    -Wp,-D_FORTIFY_SOURCE=2 -fexceptions -fstack-protector-strong
  1103.    --param=ssp-buffer-size=4 -grecord-gcc-switches -m64 -mtune=generic
  1104. Link:
  1105.    ccache gcc -I /usr/local/include -DHAVE_LIBSSL -DNDEBUG -O2 -g
  1106.    -pipe -Wall -Wp,-D_FORTIFY_SOURCE=2 -fexceptions
  1107.    -fstack-protector-strong --param=ssp-buffer-size=4
  1108.    -grecord-gcc-switches -m64 -mtune=generic -L /usr/local/lib -lpcre
  1109.    -lssl -lcrypto -lz ftp-opie.o openssl.o http-ntlm.o ../lib/libgnu.a
  1110.  
  1111. Copyright (C) 2015 Free Software Foundation, Inc.
  1112. License GPLv3+: GNU GPL version 3 or later
  1113. <http://www.gnu.org/licenses/gpl.html>.
  1114. This is free software: you are free to change and redistribute it.
  1115. There is NO WARRANTY, to the extent permitted by law.
  1116.  
  1117. Originally written by Hrvoje Niksic <hniksic@xemacs.org>.
  1118. Please send bug reports and questions to <bug-wget@gnu.org>.
  1119. --------------------------------------------------------
  1120. wget 1.20 failed to update, still using system wget
RAW Paste Data