SHARE
TWEET

runClient Error

Kartixx May 25th, 2019 80 Never
Not a member of Pastebin yet? Sign Up, it unlocks many cool features!
  1. >Task :runClient FAILED
  2.  
  3.  
  4. FAILURE: Build failed with an exception.
  5.  
  6.  
  7. What went wrong:
  8. Execution failed for task ':runClient'.
  9. >Process 'command 'C:\Program Files\Java\jdk1.8.0212\bin\java.exe' ' finised with non-zero exit value 1
  10.  
  11.  
  12. * Try:
  13. run with --stacktrace option to get the stack trace. Run with --info or --debug option to get more log output. Run with
  14. --scan to get full insights.
  15.  
  16.  
  17. * Get more help at https://help.gradle.org
  18.  
  19.  
  20. Deprecated Gradle features were used in this build, making it incompatible with Gradle 5.0.
  21. Use '--warning-mode all' to show the individual deprecation warnings.
  22. See https://docs.gradle.org/4.9/userguide/command_line_interface.html#sec:command_line_warnings
  23.  
  24.  
  25. BUILD FAILED in 17s
  26. 6 actionable tasks: 2 executed, 4 up-to-date
RAW Paste Data
We use cookies for various purposes including analytics. By continuing to use Pastebin, you agree to our use of cookies as described in the Cookies Policy. OK, I Understand
 
Top