Guest User

Untitled

a guest
Nov 2nd, 2013
56
Never
Not a member of Pastebin yet? Sign Up, it unlocks many cool features!
  1. ==> Making package: dbacl 1.14.1-1 (Sa 2. Nov 09:46:19 CET 2013)
  2. ==> Checking runtime dependencies...
  3. ==> Checking buildtime dependencies...
  4. ==> Retrieving sources...
  5. -> Found dbacl-1.14.1.tar.gz
  6. ==> Validating source files with md5sums...
  7. dbacl-1.14.1.tar.gz ... Passed
  8. ==> Extracting sources...
  9. -> Extracting dbacl-1.14.1.tar.gz with bsdtar
  10. ==> Removing existing pkg/ directory...
  11. ==> Starting build()...
  12. checking build system type... x86_64-unknown-linux-gnu
  13. checking host system type... x86_64-unknown-linux-gnu
  14. checking target system type... x86_64-unknown-linux-gnu
  15. checking for gcc... gcc
  16. checking whether the C compiler works... yes
  17. checking for C compiler default output file name... a.out
  18. checking for suffix of executables...
  19. checking whether we are cross compiling... no
  20. checking for suffix of object files... o
  21. checking whether we are using the GNU C compiler... yes
  22. checking whether gcc accepts -g... yes
  23. checking for gcc option to accept ISO C89... none needed
  24. checking how to run the C preprocessor... gcc -E
  25. checking for grep that handles long lines and -e... /usr/bin/grep
  26. checking for egrep... /usr/bin/grep -E
  27. checking for ANSI C header files... yes
  28. checking for sys/types.h... yes
  29. checking for sys/stat.h... yes
  30. checking for stdlib.h... yes
  31. checking for string.h... yes
  32. checking for memory.h... yes
  33. checking for strings.h... yes
  34. checking for inttypes.h... yes
  35. checking for stdint.h... yes
  36. checking for unistd.h... yes
  37. checking minix/config.h usability... no
  38. checking minix/config.h presence... no
  39. checking for minix/config.h... no
  40. checking whether it is safe to define __EXTENSIONS__... yes
  41. checking for a BSD-compatible install... /usr/bin/install -c
  42. checking whether build environment is sane... yes
  43. checking for a thread-safe mkdir -p... /usr/bin/mkdir -p
  44. checking for gawk... gawk
  45. checking whether make sets $(MAKE)... yes
  46. checking for style of include used by make... GNU
  47. checking dependency style of gcc... gcc3
  48. checking for gcc... (cached) gcc
  49. checking whether we are using the GNU C compiler... (cached) yes
  50. checking whether gcc accepts -g... (cached) yes
  51. checking for gcc option to accept ISO C89... (cached) none needed
  52. checking for flex... flex
  53. checking lex output file root... lex.yy
  54. checking lex library... -lfl
  55. checking whether yytext is a pointer... yes
  56. checking for bison... bison -y
  57. checking for log in -lm... yes
  58. checking for initscr in -lncurses... yes
  59. checking for readline in -lreadline... yes
  60. checking for SLsmg_init_smg in -lslang... yes
  61. checking for ANSI C header files... (cached) yes
  62. checking features.h usability... yes
  63. checking features.h presence... yes
  64. checking for features.h... yes
  65. checking langinfo.h usability... yes
  66. checking langinfo.h presence... yes
  67. checking for langinfo.h... yes
  68. checking for unistd.h... (cached) yes
  69. checking sys/mman.h usability... yes
  70. checking sys/mman.h presence... yes
  71. checking for sys/mman.h... yes
  72. checking mman.h usability... no
  73. checking mman.h presence... no
  74. checking for mman.h... no
  75. checking netinet/in.h usability... yes
  76. checking netinet/in.h presence... yes
  77. checking for netinet/in.h... yes
  78. checking wchar.h usability... yes
  79. checking wchar.h presence... yes
  80. checking for wchar.h... yes
  81. checking wctype.h usability... yes
  82. checking wctype.h presence... yes
  83. checking for wctype.h... yes
  84. checking for an ANSI C-conforming const... yes
  85. checking for size_t... yes
  86. checking whether mbrtowc and mbstate_t are properly declared... yes
  87. checking for stdlib.h... (cached) yes
  88. checking for unistd.h... (cached) yes
  89. checking for sys/param.h... yes
  90. checking for getpagesize... yes
  91. checking for working mmap... yes
  92. checking for vprintf... yes
  93. checking for _doprnt... no
  94. checking for getpagesize... (cached) yes
  95. checking for madvise... yes
  96. checking for sigaction... yes
  97. checking for working posix_memalign... yes
  98. checking for wcstol... yes
  99. configure: creating ./config.status
  100. config.status: creating Makefile
  101. config.status: creating doc/Makefile
  102. config.status: creating src/Makefile
  103. config.status: creating src/tests/Makefile
  104. config.status: creating man/Makefile
  105. config.status: creating ts/Makefile
  106. config.status: creating TREC/Makefile
  107. config.status: creating contrib/Makefile
  108. config.status: creating doc/chess/Makefile
  109. config.status: creating src/config.h
  110. config.status: src/config.h is unchanged
  111. config.status: executing depfiles commands
  112. Making all in doc
  113. make[1]: Entering directory '/tmp/packerbuild-1000/dbacl/dbacl/src/dbacl-1.14.1/doc'
  114. Making all in chess
  115. make[2]: Entering directory '/tmp/packerbuild-1000/dbacl/dbacl/src/dbacl-1.14.1/doc/chess'
  116. make[2]: Nothing to be done for 'all'.
  117. make[2]: Leaving directory '/tmp/packerbuild-1000/dbacl/dbacl/src/dbacl-1.14.1/doc/chess'
  118. make[2]: Entering directory '/tmp/packerbuild-1000/dbacl/dbacl/src/dbacl-1.14.1/doc'
  119. make[2]: Nothing to be done for 'all-am'.
  120. make[2]: Leaving directory '/tmp/packerbuild-1000/dbacl/dbacl/src/dbacl-1.14.1/doc'
  121. make[1]: Leaving directory '/tmp/packerbuild-1000/dbacl/dbacl/src/dbacl-1.14.1/doc'
  122. Making all in src
  123. make[1]: Entering directory '/tmp/packerbuild-1000/dbacl/dbacl/src/dbacl-1.14.1/src'
  124. make all-recursive
  125. make[2]: Entering directory '/tmp/packerbuild-1000/dbacl/dbacl/src/dbacl-1.14.1/src'
  126. Making all in .
  127. make[3]: Entering directory '/tmp/packerbuild-1000/dbacl/dbacl/src/dbacl-1.14.1/src'
  128. make[3]: Leaving directory '/tmp/packerbuild-1000/dbacl/dbacl/src/dbacl-1.14.1/src'
  129. Making all in tests
  130. make[3]: Entering directory '/tmp/packerbuild-1000/dbacl/dbacl/src/dbacl-1.14.1/src/tests'
  131. make[3]: Nothing to be done for 'all'.
  132. make[3]: Leaving directory '/tmp/packerbuild-1000/dbacl/dbacl/src/dbacl-1.14.1/src/tests'
  133. make[2]: Leaving directory '/tmp/packerbuild-1000/dbacl/dbacl/src/dbacl-1.14.1/src'
  134. make[1]: Leaving directory '/tmp/packerbuild-1000/dbacl/dbacl/src/dbacl-1.14.1/src'
  135. Making all in man
  136. make[1]: Entering directory '/tmp/packerbuild-1000/dbacl/dbacl/src/dbacl-1.14.1/man'
  137. make[1]: Nothing to be done for 'all'.
  138. make[1]: Leaving directory '/tmp/packerbuild-1000/dbacl/dbacl/src/dbacl-1.14.1/man'
  139. Making all in ts
  140. make[1]: Entering directory '/tmp/packerbuild-1000/dbacl/dbacl/src/dbacl-1.14.1/ts'
  141. make[1]: Nothing to be done for 'all'.
  142. make[1]: Leaving directory '/tmp/packerbuild-1000/dbacl/dbacl/src/dbacl-1.14.1/ts'
  143. Making all in TREC
  144. make[1]: Entering directory '/tmp/packerbuild-1000/dbacl/dbacl/src/dbacl-1.14.1/TREC'
  145. make[1]: Nothing to be done for 'all'.
  146. make[1]: Leaving directory '/tmp/packerbuild-1000/dbacl/dbacl/src/dbacl-1.14.1/TREC'
  147. Making all in contrib
  148. make[1]: Entering directory '/tmp/packerbuild-1000/dbacl/dbacl/src/dbacl-1.14.1/contrib'
  149. make[1]: Nothing to be done for 'all'.
  150. make[1]: Leaving directory '/tmp/packerbuild-1000/dbacl/dbacl/src/dbacl-1.14.1/contrib'
  151. make[1]: Entering directory '/tmp/packerbuild-1000/dbacl/dbacl/src/dbacl-1.14.1'
  152. make[1]: Nothing to be done for 'all-am'.
  153. make[1]: Leaving directory '/tmp/packerbuild-1000/dbacl/dbacl/src/dbacl-1.14.1'
  154. ==> Starting check()...
  155. Making check in doc
  156. make[1]: Entering directory '/tmp/packerbuild-1000/dbacl/dbacl/src/dbacl-1.14.1/doc'
  157. Making check in chess
  158. make[2]: Entering directory '/tmp/packerbuild-1000/dbacl/dbacl/src/dbacl-1.14.1/doc/chess'
  159. make[2]: Nothing to be done for 'check'.
  160. make[2]: Leaving directory '/tmp/packerbuild-1000/dbacl/dbacl/src/dbacl-1.14.1/doc/chess'
  161. make[2]: Entering directory '/tmp/packerbuild-1000/dbacl/dbacl/src/dbacl-1.14.1/doc'
  162. make[2]: Nothing to be done for 'check-am'.
  163. make[2]: Leaving directory '/tmp/packerbuild-1000/dbacl/dbacl/src/dbacl-1.14.1/doc'
  164. make[1]: Leaving directory '/tmp/packerbuild-1000/dbacl/dbacl/src/dbacl-1.14.1/doc'
  165. Making check in src
  166. make[1]: Entering directory '/tmp/packerbuild-1000/dbacl/dbacl/src/dbacl-1.14.1/src'
  167. Making check in .
  168. make[2]: Entering directory '/tmp/packerbuild-1000/dbacl/dbacl/src/dbacl-1.14.1/src'
  169. make icheck pcheck
  170. make[3]: Entering directory '/tmp/packerbuild-1000/dbacl/dbacl/src/dbacl-1.14.1/src'
  171. make[3]: 'pcheck' is up to date.
  172. make[3]: Leaving directory '/tmp/packerbuild-1000/dbacl/dbacl/src/dbacl-1.14.1/src'
  173. make[2]: Leaving directory '/tmp/packerbuild-1000/dbacl/dbacl/src/dbacl-1.14.1/src'
  174. Making check in tests
  175. make[2]: Entering directory '/tmp/packerbuild-1000/dbacl/dbacl/src/dbacl-1.14.1/src/tests'
  176. make dbacl-V.sh bayesol-V.sh mailinspect-V.sh dbacl-l.sh dbacl-j.sh dbacl-w3.sh dbacl-alpha.sh dbacl-alnum.sh dbacl-graph.sh dbacl-cef.sh dbacl-adp.sh dbacl-cef2.sh dbacl-g.sh dbacl-jap.sh dbacl-a.sh dbacl-o.sh dbacl-O.sh dbacl-z.sh dbacl-zo.sh html.sh html-links.sh html-alt.sh xml.sh email-mbox.sh email-maildir.sh email-l.sh email-pgp.sh email-uu.sh email-headers.sh email-xheaders.sh email-theaders.sh email-badmime1.sh email-badmime2.sh email-uri.sh email-forms.sh email-scripts.sh email-2047.sh email-style.sh icheck.sh lscheck.sh model-sym1.sh model-sym2.sh model-sym3.sh model-sum1.sh class-unknown1.sh class-unknown2.sh shannon.sh shannon-1.sh shannon-2.sh score-1.sh score-2.sh reservoir.sh pcheck-822g.sh pcheck-822b.sh pcheck-821g.sh pcheck-821b.sh pcheck-2822g.sh pcheck-2822b.sh pcheck-2821g.sh pcheck-2821b.sh
  177. make[3]: Entering directory '/tmp/packerbuild-1000/dbacl/dbacl/src/dbacl-1.14.1/src/tests'
  178. make[3]: 'dbacl-V.sh' is up to date.
  179. make[3]: 'bayesol-V.sh' is up to date.
  180. make[3]: 'mailinspect-V.sh' is up to date.
  181. make[3]: 'dbacl-l.sh' is up to date.
  182. make[3]: 'dbacl-j.sh' is up to date.
  183. make[3]: 'dbacl-w3.sh' is up to date.
  184. make[3]: 'dbacl-alpha.sh' is up to date.
  185. make[3]: 'dbacl-alnum.sh' is up to date.
  186. make[3]: 'dbacl-graph.sh' is up to date.
  187. make[3]: 'dbacl-cef.sh' is up to date.
  188. make[3]: 'dbacl-adp.sh' is up to date.
  189. make[3]: 'dbacl-cef2.sh' is up to date.
  190. make[3]: 'dbacl-g.sh' is up to date.
  191. make[3]: 'dbacl-jap.sh' is up to date.
  192. make[3]: 'dbacl-a.sh' is up to date.
  193. make[3]: 'dbacl-o.sh' is up to date.
  194. make[3]: 'dbacl-O.sh' is up to date.
  195. make[3]: 'dbacl-z.sh' is up to date.
  196. make[3]: 'dbacl-zo.sh' is up to date.
  197. make[3]: 'html.sh' is up to date.
  198. make[3]: 'html-links.sh' is up to date.
  199. make[3]: 'html-alt.sh' is up to date.
  200. make[3]: 'xml.sh' is up to date.
  201. make[3]: 'email-mbox.sh' is up to date.
  202. make[3]: 'email-maildir.sh' is up to date.
  203. make[3]: 'email-l.sh' is up to date.
  204. make[3]: 'email-pgp.sh' is up to date.
  205. make[3]: 'email-uu.sh' is up to date.
  206. make[3]: 'email-headers.sh' is up to date.
  207. make[3]: 'email-xheaders.sh' is up to date.
  208. make[3]: 'email-theaders.sh' is up to date.
  209. make[3]: 'email-badmime1.sh' is up to date.
  210. make[3]: 'email-badmime2.sh' is up to date.
  211. make[3]: 'email-uri.sh' is up to date.
  212. make[3]: 'email-forms.sh' is up to date.
  213. make[3]: 'email-scripts.sh' is up to date.
  214. make[3]: 'email-2047.sh' is up to date.
  215. make[3]: 'email-style.sh' is up to date.
  216. make[3]: 'icheck.sh' is up to date.
  217. make[3]: 'lscheck.sh' is up to date.
  218. make[3]: 'model-sym1.sh' is up to date.
  219. make[3]: 'model-sym2.sh' is up to date.
  220. make[3]: 'model-sym3.sh' is up to date.
  221. make[3]: 'model-sum1.sh' is up to date.
  222. make[3]: 'class-unknown1.sh' is up to date.
  223. make[3]: 'class-unknown2.sh' is up to date.
  224. make[3]: 'shannon.sh' is up to date.
  225. make[3]: 'shannon-1.sh' is up to date.
  226. make[3]: 'shannon-2.sh' is up to date.
  227. make[3]: 'score-1.sh' is up to date.
  228. make[3]: 'score-2.sh' is up to date.
  229. make[3]: 'reservoir.sh' is up to date.
  230. make[3]: 'pcheck-822g.sh' is up to date.
  231. make[3]: 'pcheck-822b.sh' is up to date.
  232. make[3]: 'pcheck-821g.sh' is up to date.
  233. make[3]: 'pcheck-821b.sh' is up to date.
  234. make[3]: 'pcheck-2822g.sh' is up to date.
  235. make[3]: 'pcheck-2822b.sh' is up to date.
  236. make[3]: 'pcheck-2821g.sh' is up to date.
  237. make[3]: 'pcheck-2821b.sh' is up to date.
  238. make[3]: Leaving directory '/tmp/packerbuild-1000/dbacl/dbacl/src/dbacl-1.14.1/src/tests'
  239. make check-TESTS
  240. make[3]: Entering directory '/tmp/packerbuild-1000/dbacl/dbacl/src/dbacl-1.14.1/src/tests'
  241. PASS: dbacl-V.sh
  242. PASS: bayesol-V.sh
  243. PASS: mailinspect-V.sh
  244. PASS: dbacl-l.sh
  245. PASS: dbacl-j.sh
  246. PASS: dbacl-w3.sh
  247. dbacl:warning: dirichlet measure did not converge.
  248. PASS: dbacl-alpha.sh
  249. PASS: dbacl-alnum.sh
  250. PASS: dbacl-graph.sh
  251. dbacl:warning: dirichlet measure did not converge.
  252. PASS: dbacl-cef.sh
  253. PASS: dbacl-adp.sh
  254. PASS: dbacl-cef2.sh
  255. PASS: dbacl-g.sh
  256. PASS: dbacl-jap.sh
  257. PASS: dbacl-a.sh
  258. PASS: dbacl-o.sh
  259. PASS: dbacl-O.sh
  260. PASS: dbacl-z.sh
  261. PASS: dbacl-zo.sh
  262. PASS: html.sh
  263. PASS: html-links.sh
  264. PASS: html-alt.sh
  265. PASS: xml.sh
  266. PASS: email-mbox.sh
  267. PASS: email-maildir.sh
  268. PASS: email-l.sh
  269. PASS: email-pgp.sh
  270. PASS: email-uu.sh
  271. PASS: email-headers.sh
  272. PASS: email-xheaders.sh
  273. PASS: email-theaders.sh
  274. PASS: email-badmime1.sh
  275. PASS: email-badmime2.sh
  276. PASS: email-uri.sh
  277. PASS: email-forms.sh
  278. PASS: email-scripts.sh
  279. PASS: email-2047.sh
  280. PASS: email-style.sh
  281. PASS: icheck.sh
  282. PASS: lscheck.sh
  283. PASS: model-sym1.sh
  284. PASS: model-sym2.sh
  285. PASS: model-sym3.sh
  286. PASS: model-sum1.sh
  287. PASS: class-unknown1.sh
  288. PASS: class-unknown2.sh
  289. PASS: shannon.sh
  290. PASS: shannon-1.sh
  291. FAIL: shannon-2.sh
  292. PASS: score-1.sh
  293. PASS: score-2.sh
  294. PASS: reservoir.sh
  295. PASS: pcheck-822g.sh
  296. PASS: pcheck-822b.sh
  297. PASS: pcheck-821g.sh
  298. PASS: pcheck-821b.sh
  299. PASS: pcheck-2822g.sh
  300. PASS: pcheck-2822b.sh
  301. PASS: pcheck-2821g.sh
  302. PASS: pcheck-2821b.sh
  303. ==================================
  304. 1 of 60 tests failed
  305. Please report to laird@lbreyer.com
  306. ==================================
  307. Makefile:316: recipe for target 'check-TESTS' failed
  308. make[3]: *** [check-TESTS] Error 1
  309. make[3]: Leaving directory '/tmp/packerbuild-1000/dbacl/dbacl/src/dbacl-1.14.1/src/tests'
  310. Makefile:439: recipe for target 'check-am' failed
  311. make[2]: *** [check-am] Error 2
  312. make[2]: Target 'check' not remade because of errors.
  313. make[2]: Leaving directory '/tmp/packerbuild-1000/dbacl/dbacl/src/dbacl-1.14.1/src/tests'
  314. Makefile:546: recipe for target 'check-recursive' failed
  315. make[1]: *** [check-recursive] Error 1
  316. make[1]: Target 'check' not remade because of errors.
  317. make[1]: Leaving directory '/tmp/packerbuild-1000/dbacl/dbacl/src/dbacl-1.14.1/src'
  318. Making check in man
  319. make[1]: Entering directory '/tmp/packerbuild-1000/dbacl/dbacl/src/dbacl-1.14.1/man'
  320. make[1]: Nothing to be done for 'check'.
  321. make[1]: Leaving directory '/tmp/packerbuild-1000/dbacl/dbacl/src/dbacl-1.14.1/man'
  322. Making check in ts
  323. make[1]: Entering directory '/tmp/packerbuild-1000/dbacl/dbacl/src/dbacl-1.14.1/ts'
  324. make[1]: Nothing to be done for 'check'.
  325. make[1]: Leaving directory '/tmp/packerbuild-1000/dbacl/dbacl/src/dbacl-1.14.1/ts'
  326. Making check in TREC
  327. make[1]: Entering directory '/tmp/packerbuild-1000/dbacl/dbacl/src/dbacl-1.14.1/TREC'
  328. make[1]: Nothing to be done for 'check'.
  329. make[1]: Leaving directory '/tmp/packerbuild-1000/dbacl/dbacl/src/dbacl-1.14.1/TREC'
  330. Making check in contrib
  331. make[1]: Entering directory '/tmp/packerbuild-1000/dbacl/dbacl/src/dbacl-1.14.1/contrib'
  332. make[1]: Nothing to be done for 'check'.
  333. make[1]: Leaving directory '/tmp/packerbuild-1000/dbacl/dbacl/src/dbacl-1.14.1/contrib'
  334. make[1]: Entering directory '/tmp/packerbuild-1000/dbacl/dbacl/src/dbacl-1.14.1'
  335. make[1]: Nothing to be done for 'check-am'.
  336. make[1]: Leaving directory '/tmp/packerbuild-1000/dbacl/dbacl/src/dbacl-1.14.1'
  337. Makefile:293: recipe for target 'check-recursive' failed
  338. make: *** [check-recursive] Error 1
  339. make: Target 'check' not remade because of errors.
  340. ==> ERROR: A failure occurred in check().
  341. Aborting...
  342. The build failed.
  343. Dependencies for `afew-git' are not met, not building...
  344. packer afew 7,75user 1,96s system 12% cpu 1:15,30 total
RAW Paste Data