daily pastebin goal
5%
SHARE
TWEET

Untitled

a guest Dec 30th, 2010 441 Never
Not a member of Pastebin yet? Sign Up, it unlocks many cool features!
  1. [  6%] Building CXX object cmake-rpcminer/CMakeFiles/rpcminer.dir/__/src/rpcminer/rpcminerclient.cpp.o
  2. In file included from /home/uncaer9/bitcoin-remote-rpc-20101229-src/src/rpcminer/rpcminerclient.cpp:22:0:                                                                                                                                                
  3. /home/uncaer9/bitcoin-remote-rpc-20101229-src/src/rpcminer/hex.h:33:8: warning: extra tokens at end of #endif directive
  4. In file included from /home/uncaer9/bitcoin-remote-rpc-20101229-src/src/rpcminer/../minercommon/minerheaders.h:46:0,
  5.                  from /home/uncaer9/bitcoin-remote-rpc-20101229-src/src/rpcminer/rpcminerclient.h:26,
  6.                  from /home/uncaer9/bitcoin-remote-rpc-20101229-src/src/rpcminer/rpcminerclient.cpp:19:
  7. /home/uncaer9/bitcoin-remote-rpc-20101229-src/src/rpcminer/../minercommon/../serialize.h: In function ‘void Unserialize_impl(Stream&, std::vector<T, A>&, int, int, const boost::true_type&)’:
  8. /home/uncaer9/bitcoin-remote-rpc-20101229-src/src/rpcminer/../minercommon/../serialize.h:475:82: error: there are no arguments to ‘min’ that depend on a template parameter, so a declaration of ‘min’ must be available
  9. /home/uncaer9/bitcoin-remote-rpc-20101229-src/src/rpcminer/../minercommon/../serialize.h:475:82: note: (if you use ‘-fpermissive’, G++ will accept your code, but allowing the use of an undeclared name is deprecated)
  10. /home/uncaer9/bitcoin-remote-rpc-20101229-src/src/rpcminer/../minercommon/../serialize.h: In function ‘void Unserialize(Stream&, std::map<K, T, Pred, A>&, int, int)’:
  11. /home/uncaer9/bitcoin-remote-rpc-20101229-src/src/rpcminer/../minercommon/../serialize.h:588:9: error: ‘pair’ was not declared in this scope
  12. /home/uncaer9/bitcoin-remote-rpc-20101229-src/src/rpcminer/../minercommon/../serialize.h:588:15: error: expected primary-expression before ‘,’ token
  13. /home/uncaer9/bitcoin-remote-rpc-20101229-src/src/rpcminer/../minercommon/../serialize.h:588:18: error: expected primary-expression before ‘>’ token
  14. /home/uncaer9/bitcoin-remote-rpc-20101229-src/src/rpcminer/../minercommon/../serialize.h:588:20: error: ‘item’ was not declared in this scope
  15. /home/uncaer9/bitcoin-remote-rpc-20101229-src/src/rpcminer/../minercommon/../serialize.h: In member function ‘void secure_allocator<T>::deallocate(T*, size_t)’:
  16. /home/uncaer9/bitcoin-remote-rpc-20101229-src/src/rpcminer/../minercommon/../serialize.h:700:9: error: ‘allocator’ was not declared in this scope
  17. /home/uncaer9/bitcoin-remote-rpc-20101229-src/src/rpcminer/../minercommon/../serialize.h:700:20: error: expected primary-expression before ‘>’ token
  18. /home/uncaer9/bitcoin-remote-rpc-20101229-src/src/rpcminer/../minercommon/../serialize.h:700:21: error: ‘::deallocate’ has not been declared
  19. /home/uncaer9/bitcoin-remote-rpc-20101229-src/src/rpcminer/../minercommon/../serialize.h: In member function ‘void CAutoFile::fclose()’:
  20. /home/uncaer9/bitcoin-remote-rpc-20101229-src/src/rpcminer/../minercommon/../serialize.h:1104:37: error: ‘stdin’ was not declared in this scope
  21. /home/uncaer9/bitcoin-remote-rpc-20101229-src/src/rpcminer/../minercommon/../serialize.h:1104:54: error: ‘stdout’ was not declared in this scope
  22. /home/uncaer9/bitcoin-remote-rpc-20101229-src/src/rpcminer/../minercommon/../serialize.h:1104:72: error: ‘stderr’ was not declared in this scope
  23. /home/uncaer9/bitcoin-remote-rpc-20101229-src/src/rpcminer/../minercommon/../serialize.h:1105:13: error: ‘::fclose’ has not been declared
  24. /home/uncaer9/bitcoin-remote-rpc-20101229-src/src/rpcminer/../minercommon/../serialize.h: In member function ‘CAutoFile& CAutoFile::read(char*, int)’:
  25. /home/uncaer9/bitcoin-remote-rpc-20101229-src/src/rpcminer/../minercommon/../serialize.h:1145:38: error: ‘fread’ was not declared in this scope
  26. /home/uncaer9/bitcoin-remote-rpc-20101229-src/src/rpcminer/../minercommon/../serialize.h:1146:41: error: ‘feof’ was not declared in this scope
  27. /home/uncaer9/bitcoin-remote-rpc-20101229-src/src/rpcminer/../minercommon/../serialize.h: In member function ‘CAutoFile& CAutoFile::write(const char*, int)’:
  28. /home/uncaer9/bitcoin-remote-rpc-20101229-src/src/rpcminer/../minercommon/../serialize.h:1154:39: error: ‘fwrite’ was not declared in this scope
  29. In file included from /home/uncaer9/bitcoin-remote-rpc-20101229-src/src/rpcminer/../minercommon/minerheaders.h:47:0,
  30.                  from /home/uncaer9/bitcoin-remote-rpc-20101229-src/src/rpcminer/rpcminerclient.h:26,
  31.                  from /home/uncaer9/bitcoin-remote-rpc-20101229-src/src/rpcminer/rpcminerclient.cpp:19:
  32. /home/uncaer9/bitcoin-remote-rpc-20101229-src/src/rpcminer/../minercommon/../uint256.h: In function ‘int Testuint256AdHoc(std::vector<std::basic_string<char> >)’:
  33. /home/uncaer9/bitcoin-remote-rpc-20101229-src/src/rpcminer/../minercommon/../uint256.h:638:40: error: ‘printf’ was not declared in this scope
  34. In file included from /home/uncaer9/bitcoin-remote-rpc-20101229-src/src/rpcminer/../minercommon/minerheaders.h:48:0,
  35.                  from /home/uncaer9/bitcoin-remote-rpc-20101229-src/src/rpcminer/rpcminerclient.h:26,
  36.                  from /home/uncaer9/bitcoin-remote-rpc-20101229-src/src/rpcminer/rpcminerclient.cpp:19:
  37. /home/uncaer9/bitcoin-remote-rpc-20101229-src/src/rpcminer/../minercommon/../util.h: At global scope:
  38. /home/uncaer9/bitcoin-remote-rpc-20101229-src/src/rpcminer/../minercommon/../util.h:214:5: error: ‘interprocess’ in namespace ‘boost’ does not name a type
  39. /home/uncaer9/bitcoin-remote-rpc-20101229-src/src/rpcminer/../minercommon/../util.h: In member function ‘void CCriticalSection::Enter()’:
  40. /home/uncaer9/bitcoin-remote-rpc-20101229-src/src/rpcminer/../minercommon/../util.h:218:20: error: ‘mutex’ was not declared in this scope
  41. /home/uncaer9/bitcoin-remote-rpc-20101229-src/src/rpcminer/../minercommon/../util.h: In member function ‘void CCriticalSection::Leave()’:
  42. /home/uncaer9/bitcoin-remote-rpc-20101229-src/src/rpcminer/../minercommon/../util.h:219:20: error: ‘mutex’ was not declared in this scope
  43. /home/uncaer9/bitcoin-remote-rpc-20101229-src/src/rpcminer/../minercommon/../util.h: In member function ‘bool CCriticalSection::TryEnter()’:
  44. /home/uncaer9/bitcoin-remote-rpc-20101229-src/src/rpcminer/../minercommon/../util.h:220:30: error: ‘mutex’ was not declared in this scope
  45. /home/uncaer9/bitcoin-remote-rpc-20101229-src/src/rpcminer/../minercommon/../util.h: In function ‘void SetThreadPriority(int)’:
  46. /home/uncaer9/bitcoin-remote-rpc-20101229-src/src/rpcminer/../minercommon/../util.h:614:17: error: ‘PRIO_PROCESS’ was not declared in this scope
  47. /home/uncaer9/bitcoin-remote-rpc-20101229-src/src/rpcminer/../minercommon/../util.h:614:43: error: ‘setpriority’ was not declared in this scope
  48. In file included from /usr/include/openssl/bn.h:130:0,
  49.                  from /home/uncaer9/bitcoin-remote-rpc-20101229-src/src/rpcminer/../minercommon/../bignum.h:11,
  50.                  from /home/uncaer9/bitcoin-remote-rpc-20101229-src/src/rpcminer/../minercommon/minerheaders.h:49,
  51.                  from /home/uncaer9/bitcoin-remote-rpc-20101229-src/src/rpcminer/rpcminerclient.h:26,
  52.                  from /home/uncaer9/bitcoin-remote-rpc-20101229-src/src/rpcminer/rpcminerclient.cpp:19:
  53. /home/uncaer9/bitcoin-remote-rpc-20101229-src/src/rpcminer/../minercommon/../util.h: At global scope:
  54. /home/uncaer9/bitcoin-remote-rpc-20101229-src/src/rpcminer/../minercommon/../util.h:155:5: error: previous declaration of ‘int OutputDebugStringF(const char*, ...)’ with ‘C++’ linkage
  55. /usr/include/stdio.h:359:58: error: conflicts with new declaration with ‘C’ linkage
  56. /home/uncaer9/bitcoin-remote-rpc-20101229-src/src/rpcminer/../minercommon/../util.h:156:5: error: previous declaration of ‘int my_snprintf(char*, size_t, const char*, ...)’ with ‘C++’ linkage
  57. /usr/include/stdio.h:385:60: error: conflicts with new declaration with ‘C’ linkage
  58. /usr/include/stdio.h:385:60: error: declaration of ‘int my_snprintf(char*, size_t, const char*, ...) throw ()’ throws different exceptions
  59. /home/uncaer9/bitcoin-remote-rpc-20101229-src/src/rpcminer/../minercommon/../util.h:156:5: error: from previous declaration ‘int my_snprintf(char*, size_t, const char*, ...)’
  60. In file included from /home/uncaer9/bitcoin-remote-rpc-20101229-src/src/rpcminer/../minercommon/minerheaders.h:49:0,
  61.                  from /home/uncaer9/bitcoin-remote-rpc-20101229-src/src/rpcminer/rpcminerclient.h:26,
  62.                  from /home/uncaer9/bitcoin-remote-rpc-20101229-src/src/rpcminer/rpcminerclient.cpp:19:
  63. /home/uncaer9/bitcoin-remote-rpc-20101229-src/src/rpcminer/../minercommon/../bignum.h: In member function ‘void CBigNum::Unserialize(Stream&, int, int)’:
  64. /home/uncaer9/bitcoin-remote-rpc-20101229-src/src/rpcminer/../minercommon/../bignum.h:355:9: error: ‘vector’ was not declared in this scope
  65. /home/uncaer9/bitcoin-remote-rpc-20101229-src/src/rpcminer/../minercommon/../bignum.h:355:16: error: expected primary-expression before ‘unsigned’
  66. /home/uncaer9/bitcoin-remote-rpc-20101229-src/src/rpcminer/../minercommon/../bignum.h:355:16: error: expected ‘;’ before ‘unsigned’
  67. /home/uncaer9/bitcoin-remote-rpc-20101229-src/src/rpcminer/../minercommon/../bignum.h:356:26: error: ‘vch’ was not declared in this scope
  68. In file included from /usr/lib/gcc/x86_64-unknown-linux-gnu/4.5.2/../../../../include/c++/4.5.2/fstream:43:0,
  69.                  from /home/uncaer9/bitcoin-remote-rpc-20101229-src/src/rpcminer/rpcminerclient.cpp:25:
  70. /usr/lib/gcc/x86_64-unknown-linux-gnu/4.5.2/../../../../include/c++/4.5.2/cstdio: At global scope:
  71. /usr/lib/gcc/x86_64-unknown-linux-gnu/4.5.2/../../../../include/c++/4.5.2/cstdio:121:11: error: ‘::printf’ has not been declared
  72. /usr/lib/gcc/x86_64-unknown-linux-gnu/4.5.2/../../../../include/c++/4.5.2/cstdio:167:11: error: ‘::snprintf’ has not been declared
  73. /usr/lib/gcc/x86_64-unknown-linux-gnu/4.5.2/../../../../include/c++/4.5.2/cstdio:178:22: error: ‘__gnu_cxx::snprintf’ has not been declared
  74. make[2]: *** [cmake-rpcminer/CMakeFiles/rpcminer.dir/__/src/rpcminer/rpcminerclient.cpp.o] Błąd 1
  75. make[1]: *** [cmake-rpcminer/CMakeFiles/rpcminer.dir/all] Błąd 2
  76. make: *** [all] Błąd 2
RAW Paste Data
We use cookies for various purposes including analytics. By continuing to use Pastebin, you agree to our use of cookies as described in the Cookies Policy. OK, I Understand
 
Top