SHARE
TWEET

NVIDIA make.log

rooseal Oct 7th, 2015 (edited) 128 Never
Not a member of Pastebin yet? Sign Up, it unlocks many cool features!
  1. DKMS make.log for nvidia-340.76 for kernel 4.1.7-200.fc22.x86_64 (x86_64)
  2. Wed Sep 30 15:12:21 PDT 2015
  3. NVIDIA: calling KBUILD...
  4. make[1]: Entering directory '/usr/src/kernels/4.1.7-200.fc22.x86_64'
  5. make -C /lib/modules/4.1.7-200.fc22.x86_64/build KBUILD_SRC=/usr/src/kernels/4.1.7-200.fc22.x86_64 \
  6. -f /usr/src/kernels/4.1.7-200.fc22.x86_64/Makefile modules
  7. make[2]: Entering directory '/usr/src/kernels/4.1.7-200.fc22.x86_64'
  8. test -e include/generated/autoconf.h -a -e include/config/auto.conf || (                \
  9. echo >&2;                                                       \
  10. echo >&2 "  ERROR: Kernel configuration is invalid.";           \
  11. echo >&2 "         include/generated/autoconf.h or include/config/auto.conf are missing.";\
  12. echo >&2 "         Run 'make oldconfig && make prepare' on kernel src to fix it.";      \
  13. echo >&2 ;                                                      \
  14. /bin/false)
  15. mkdir -p /var/lib/dkms/nvidia/340.76/build/.tmp_versions ; rm -f /var/lib/dkms/nvidia/340.76/build/.tmp_versions/*
  16. make -f /usr/src/kernels/4.1.7-200.fc22.x86_64/scripts/Makefile.build obj=/var/lib/dkms/nvidia/340.76/build
  17.   cc -Wp,-MD,/var/lib/dkms/nvidia/340.76/build/.nv.o.d  -nostdinc -isystem /usr/lib/gcc/x86_64-redhat-linux/5.1.1/include -I/usr/src/kernels/4.1.7-200.fc22.x86_64/arch/x86/include -Iarch/x86/include/generated/uapi -Iarch/x86/include/generated  -I/usr/src/kernels/4.1.7-200.fc22.x86_64/include -Iinclude -I/usr/src/kernels/4.1.7-200.fc22.x86_64/arch/x86/include/uapi -Iarch/x86/include/generated/uapi -I/usr/src/kernels/4.1.7-200.fc22.x86_64/include/uapi -Iinclude/generated/uapi -include /usr/src/kernels/4.1.7-200.fc22.x86_64/include/linux/kconfig.h   -I/var/lib/dkms/nvidia/340.76/build -D__KERNEL__ -Wall -Wundef -Wstrict-prototypes -Wno-trigraphs -fno-strict-aliasing -fno-common -Werror-implicit-function-declaration -Wno-format-security -std=gnu89 -m64 -mno-80387 -mno-fp-ret-in-387 -mtune=generic -mno-red-zone -mcmodel=kernel -funit-at-a-time -maccumulate-outgoing-args -DCONFIG_AS_CFI=1 -DCONFIG_AS_CFI_SIGNAL_FRAME=1 -DCONFIG_AS_CFI_SECTIONS=1 -DCONFIG_AS_FXSAVEQ=1 -DCONFIG_AS_SSSE3=1 -DCONFIG_AS_CRC32=1 -DCONFIG_AS_AVX=1 -DCONFIG_AS_AVX2=1 -pipe -Wno-sign-compare -fno-asynchronous-unwind-tables -mno-sse -mno-mmx -mno-sse2 -mno-3dnow -mno-avx -fno-delete-null-pointer-checks -O2 --param=allow-store-data-races=0 -Wframe-larger-than=2048 -fstack-protector-strong -Wno-unused-but-set-variable -fno-omit-frame-pointer -fno-optimize-sibling-calls -fvar-tracking-assignments -g -pg -mfentry -DCC_USING_FENTRY -Wdeclaration-after-statement -Wno-pointer-sign -fno-strict-overflow -fconserve-stack -Werror=implicit-int -Werror=strict-prototypes -Werror=date-time -DCC_HAVE_ASM_GOTO -DNV_MODULE_INSTANCE=0 -DNV_BUILD_MODULE_INSTANCES=0 -UDEBUG -U_DEBUG -DNDEBUG   -I/var/lib/dkms/nvidia/340.76/build -Wall -MD -Wsign-compare -Wno-cast-qual -Wno-error -D__KERNEL__ -DMODULE -DNVRM -DNV_VERSION_STRING=\"340.76\" -Wno-unused-function -Wuninitialized -fno-strict-aliasing -mno-red-zone -mcmodel=kernel -DNV_UVM_ENABLE -D__linux__ -DNV_DEV_NAME=\"nvidia\"  -DMODULE  -D"KBUILD_STR(s)=#s" -D"KBUILD_BASENAME=KBUILD_STR(nv)"  -D"KBUILD_MODNAME=KBUILD_STR(nvidia)" -c -o /var/lib/dkms/nvidia/340.76/build/nv.o /var/lib/dkms/nvidia/340.76/build/nv.c
  18. In file included from /usr/src/kernels/4.1.7-200.fc22.x86_64/include/uapi/linux/stddef.h:1:0,
  19.                  from /usr/src/kernels/4.1.7-200.fc22.x86_64/include/linux/stddef.h:4,
  20.                  from /usr/src/kernels/4.1.7-200.fc22.x86_64/include/uapi/linux/posix_types.h:4,
  21.                  from /usr/src/kernels/4.1.7-200.fc22.x86_64/include/uapi/linux/types.h:13,
  22.                  from /usr/src/kernels/4.1.7-200.fc22.x86_64/include/linux/types.h:5,
  23.                  from /usr/src/kernels/4.1.7-200.fc22.x86_64/include/uapi/linux/capability.h:16,
  24.                  from /usr/src/kernels/4.1.7-200.fc22.x86_64/include/linux/capability.h:15,
  25.                  from /usr/src/kernels/4.1.7-200.fc22.x86_64/include/linux/sched.h:15,
  26.                  from /usr/src/kernels/4.1.7-200.fc22.x86_64/include/linux/utsname.h:5,
  27.                  from /var/lib/dkms/nvidia/340.76/build/nv-linux.h:44,
  28.                  from /var/lib/dkms/nvidia/340.76/build/nv.c:13:
  29. /usr/src/kernels/4.1.7-200.fc22.x86_64/include/asm-generic/qrwlock.h: In function ‘queue_write_trylock’:
  30. /usr/src/kernels/4.1.7-200.fc22.x86_64/include/asm-generic/qrwlock.h:93:35: warning: comparison between signed and unsigned integer expressions [-Wsign-compare]
  31.           cnts, cnts | _QW_LOCKED) == cnts);
  32.                                    ^
  33. /usr/src/kernels/4.1.7-200.fc22.x86_64/include/linux/compiler.h:163:40: note: in definition of macro ‘likely’
  34.  # define likely(x) __builtin_expect(!!(x), 1)
  35.                                         ^
  36. In file included from /usr/src/kernels/4.1.7-200.fc22.x86_64/include/uapi/linux/stddef.h:1:0,
  37.                  from /usr/src/kernels/4.1.7-200.fc22.x86_64/include/linux/stddef.h:4,
  38.                  from /usr/src/kernels/4.1.7-200.fc22.x86_64/include/uapi/linux/posix_types.h:4,
  39.                  from /usr/src/kernels/4.1.7-200.fc22.x86_64/include/uapi/linux/types.h:13,
  40.                  from /usr/src/kernels/4.1.7-200.fc22.x86_64/include/linux/types.h:5,
  41.                  from /usr/src/kernels/4.1.7-200.fc22.x86_64/include/uapi/linux/capability.h:16,
  42.                  from /usr/src/kernels/4.1.7-200.fc22.x86_64/include/linux/capability.h:15,
  43.                  from /usr/src/kernels/4.1.7-200.fc22.x86_64/include/linux/sched.h:15,
  44.                  from /usr/src/kernels/4.1.7-200.fc22.x86_64/include/linux/utsname.h:5,
  45.                  from /var/lib/dkms/nvidia/340.76/build/nv-linux.h:44,
  46.                  from /var/lib/dkms/nvidia/340.76/build/nv.c:13:
  47. /usr/src/kernels/4.1.7-200.fc22.x86_64/arch/x86/include/asm/uaccess.h: In function ‘copy_from_user’:
  48. /usr/src/kernels/4.1.7-200.fc22.x86_64/arch/x86/include/asm/uaccess.h:712:26: warning: comparison between signed and unsigned integer expressions [-Wsign-compare]
  49.   if (likely(sz < 0 || sz >= n))
  50.                           ^
  51. /usr/src/kernels/4.1.7-200.fc22.x86_64/include/linux/compiler.h:163:40: note: in definition of macro ‘likely’
  52.  # define likely(x) __builtin_expect(!!(x), 1)
  53.                                         ^
  54. /usr/src/kernels/4.1.7-200.fc22.x86_64/arch/x86/include/asm/uaccess.h: In function ‘copy_to_user’:
  55. /usr/src/kernels/4.1.7-200.fc22.x86_64/arch/x86/include/asm/uaccess.h:730:26: warning: comparison between signed and unsigned integer expressions [-Wsign-compare]
  56.   if (likely(sz < 0 || sz >= n))
  57.                           ^
  58. /usr/src/kernels/4.1.7-200.fc22.x86_64/include/linux/compiler.h:163:40: note: in definition of macro ‘likely’
  59.  # define likely(x) __builtin_expect(!!(x), 1)
  60.                                         ^
  61.   if [ "-pg" = "-pg" ]; then if [ /var/lib/dkms/nvidia/340.76/build/nv.o != "scripts/mod/empty.o" ]; then ./scripts/recordmcount  "/var/lib/dkms/nvidia/340.76/build/nv.o"; fi; fi;
  62.   cc -Wp,-MD,/var/lib/dkms/nvidia/340.76/build/.nv-acpi.o.d  -nostdinc -isystem /usr/lib/gcc/x86_64-redhat-linux/5.1.1/include -I/usr/src/kernels/4.1.7-200.fc22.x86_64/arch/x86/include -Iarch/x86/include/generated/uapi -Iarch/x86/include/generated  -I/usr/src/kernels/4.1.7-200.fc22.x86_64/include -Iinclude -I/usr/src/kernels/4.1.7-200.fc22.x86_64/arch/x86/include/uapi -Iarch/x86/include/generated/uapi -I/usr/src/kernels/4.1.7-200.fc22.x86_64/include/uapi -Iinclude/generated/uapi -include /usr/src/kernels/4.1.7-200.fc22.x86_64/include/linux/kconfig.h   -I/var/lib/dkms/nvidia/340.76/build -D__KERNEL__ -Wall -Wundef -Wstrict-prototypes -Wno-trigraphs -fno-strict-aliasing -fno-common -Werror-implicit-function-declaration -Wno-format-security -std=gnu89 -m64 -mno-80387 -mno-fp-ret-in-387 -mtune=generic -mno-red-zone -mcmodel=kernel -funit-at-a-time -maccumulate-outgoing-args -DCONFIG_AS_CFI=1 -DCONFIG_AS_CFI_SIGNAL_FRAME=1 -DCONFIG_AS_CFI_SECTIONS=1 -DCONFIG_AS_FXSAVEQ=1 -DCONFIG_AS_SSSE3=1 -DCONFIG_AS_CRC32=1 -DCONFIG_AS_AVX=1 -DCONFIG_AS_AVX2=1 -pipe -Wno-sign-compare -fno-asynchronous-unwind-tables -mno-sse -mno-mmx -mno-sse2 -mno-3dnow -mno-avx -fno-delete-null-pointer-checks -O2 --param=allow-store-data-races=0 -Wframe-larger-than=2048 -fstack-protector-strong -Wno-unused-but-set-variable -fno-omit-frame-pointer -fno-optimize-sibling-calls -fvar-tracking-assignments -g -pg -mfentry -DCC_USING_FENTRY -Wdeclaration-after-statement -Wno-pointer-sign -fno-strict-overflow -fconserve-stack -Werror=implicit-int -Werror=strict-prototypes -Werror=date-time -DCC_HAVE_ASM_GOTO -DNV_MODULE_INSTANCE=0 -DNV_BUILD_MODULE_INSTANCES=0 -UDEBUG -U_DEBUG -DNDEBUG   -I/var/lib/dkms/nvidia/340.76/build -Wall -MD -Wsign-compare -Wno-cast-qual -Wno-error -D__KERNEL__ -DMODULE -DNVRM -DNV_VERSION_STRING=\"340.76\" -Wno-unused-function -Wuninitialized -fno-strict-aliasing -mno-red-zone -mcmodel=kernel -DNV_UVM_ENABLE -D__linux__ -DNV_DEV_NAME=\"nvidia\"  -DMODULE  -D"KBUILD_STR(s)=#s" -D"KBUILD_BASENAME=KBUILD_STR(nv_acpi)"  -D"KBUILD_MODNAME=KBUILD_STR(nvidia)" -c -o /var/lib/dkms/nvidia/340.76/build/nv-acpi.o /var/lib/dkms/nvidia/340.76/build/nv-acpi.c
  63. In file included from /usr/src/kernels/4.1.7-200.fc22.x86_64/include/uapi/linux/stddef.h:1:0,
  64.                  from /usr/src/kernels/4.1.7-200.fc22.x86_64/include/linux/stddef.h:4,
  65.                  from /usr/src/kernels/4.1.7-200.fc22.x86_64/include/uapi/linux/posix_types.h:4,
  66.                  from /usr/src/kernels/4.1.7-200.fc22.x86_64/include/uapi/linux/types.h:13,
  67.                  from /usr/src/kernels/4.1.7-200.fc22.x86_64/include/linux/types.h:5,
  68.                  from /usr/src/kernels/4.1.7-200.fc22.x86_64/include/uapi/linux/capability.h:16,
  69.                  from /usr/src/kernels/4.1.7-200.fc22.x86_64/include/linux/capability.h:15,
  70.                  from /usr/src/kernels/4.1.7-200.fc22.x86_64/include/linux/sched.h:15,
  71.                  from /usr/src/kernels/4.1.7-200.fc22.x86_64/include/linux/utsname.h:5,
  72.                  from /var/lib/dkms/nvidia/340.76/build/nv-linux.h:44,
  73.                  from /var/lib/dkms/nvidia/340.76/build/nv-acpi.c:15:
  74. /usr/src/kernels/4.1.7-200.fc22.x86_64/include/asm-generic/qrwlock.h: In function ‘queue_write_trylock’:
  75. /usr/src/kernels/4.1.7-200.fc22.x86_64/include/asm-generic/qrwlock.h:93:35: warning: comparison between signed and unsigned integer expressions [-Wsign-compare]
  76.           cnts, cnts | _QW_LOCKED) == cnts);
  77.                                    ^
  78. /usr/src/kernels/4.1.7-200.fc22.x86_64/include/linux/compiler.h:163:40: note: in definition of macro ‘likely’
  79.  # define likely(x) __builtin_expect(!!(x), 1)
  80.                                         ^
  81. In file included from /usr/src/kernels/4.1.7-200.fc22.x86_64/include/uapi/linux/stddef.h:1:0,
  82.                  from /usr/src/kernels/4.1.7-200.fc22.x86_64/include/linux/stddef.h:4,
  83.                  from /usr/src/kernels/4.1.7-200.fc22.x86_64/include/uapi/linux/posix_types.h:4,
  84.                  from /usr/src/kernels/4.1.7-200.fc22.x86_64/include/uapi/linux/types.h:13,
  85.                  from /usr/src/kernels/4.1.7-200.fc22.x86_64/include/linux/types.h:5,
  86.                  from /usr/src/kernels/4.1.7-200.fc22.x86_64/include/uapi/linux/capability.h:16,
  87.                  from /usr/src/kernels/4.1.7-200.fc22.x86_64/include/linux/capability.h:15,
  88.                  from /usr/src/kernels/4.1.7-200.fc22.x86_64/include/linux/sched.h:15,
  89.                  from /usr/src/kernels/4.1.7-200.fc22.x86_64/include/linux/utsname.h:5,
  90.                  from /var/lib/dkms/nvidia/340.76/build/nv-linux.h:44,
  91.                  from /var/lib/dkms/nvidia/340.76/build/nv-acpi.c:15:
  92. /usr/src/kernels/4.1.7-200.fc22.x86_64/arch/x86/include/asm/uaccess.h: In function ‘copy_from_user’:
  93. /usr/src/kernels/4.1.7-200.fc22.x86_64/arch/x86/include/asm/uaccess.h:712:26: warning: comparison between signed and unsigned integer expressions [-Wsign-compare]
  94.   if (likely(sz < 0 || sz >= n))
  95.                           ^
  96. /usr/src/kernels/4.1.7-200.fc22.x86_64/include/linux/compiler.h:163:40: note: in definition of macro ‘likely’
  97.  # define likely(x) __builtin_expect(!!(x), 1)
  98.                                         ^
  99. /usr/src/kernels/4.1.7-200.fc22.x86_64/arch/x86/include/asm/uaccess.h: In function ‘copy_to_user’:
  100. /usr/src/kernels/4.1.7-200.fc22.x86_64/arch/x86/include/asm/uaccess.h:730:26: warning: comparison between signed and unsigned integer expressions [-Wsign-compare]
  101.   if (likely(sz < 0 || sz >= n))
  102.                           ^
  103. /usr/src/kernels/4.1.7-200.fc22.x86_64/include/linux/compiler.h:163:40: note: in definition of macro ‘likely’
  104.  # define likely(x) __builtin_expect(!!(x), 1)
  105.                                         ^
  106.   if [ "-pg" = "-pg" ]; then if [ /var/lib/dkms/nvidia/340.76/build/nv-acpi.o != "scripts/mod/empty.o" ]; then ./scripts/recordmcount  "/var/lib/dkms/nvidia/340.76/build/nv-acpi.o"; fi; fi;
  107.   cc -Wp,-MD,/var/lib/dkms/nvidia/340.76/build/.nv-chrdev.o.d  -nostdinc -isystem /usr/lib/gcc/x86_64-redhat-linux/5.1.1/include -I/usr/src/kernels/4.1.7-200.fc22.x86_64/arch/x86/include -Iarch/x86/include/generated/uapi -Iarch/x86/include/generated  -I/usr/src/kernels/4.1.7-200.fc22.x86_64/include -Iinclude -I/usr/src/kernels/4.1.7-200.fc22.x86_64/arch/x86/include/uapi -Iarch/x86/include/generated/uapi -I/usr/src/kernels/4.1.7-200.fc22.x86_64/include/uapi -Iinclude/generated/uapi -include /usr/src/kernels/4.1.7-200.fc22.x86_64/include/linux/kconfig.h   -I/var/lib/dkms/nvidia/340.76/build -D__KERNEL__ -Wall -Wundef -Wstrict-prototypes -Wno-trigraphs -fno-strict-aliasing -fno-common -Werror-implicit-function-declaration -Wno-format-security -std=gnu89 -m64 -mno-80387 -mno-fp-ret-in-387 -mtune=generic -mno-red-zone -mcmodel=kernel -funit-at-a-time -maccumulate-outgoing-args -DCONFIG_AS_CFI=1 -DCONFIG_AS_CFI_SIGNAL_FRAME=1 -DCONFIG_AS_CFI_SECTIONS=1 -DCONFIG_AS_FXSAVEQ=1 -DCONFIG_AS_SSSE3=1 -DCONFIG_AS_CRC32=1 -DCONFIG_AS_AVX=1 -DCONFIG_AS_AVX2=1 -pipe -Wno-sign-compare -fno-asynchronous-unwind-tables -mno-sse -mno-mmx -mno-sse2 -mno-3dnow -mno-avx -fno-delete-null-pointer-checks -O2 --param=allow-store-data-races=0 -Wframe-larger-than=2048 -fstack-protector-strong -Wno-unused-but-set-variable -fno-omit-frame-pointer -fno-optimize-sibling-calls -fvar-tracking-assignments -g -pg -mfentry -DCC_USING_FENTRY -Wdeclaration-after-statement -Wno-pointer-sign -fno-strict-overflow -fconserve-stack -Werror=implicit-int -Werror=strict-prototypes -Werror=date-time -DCC_HAVE_ASM_GOTO -DNV_MODULE_INSTANCE=0 -DNV_BUILD_MODULE_INSTANCES=0 -UDEBUG -U_DEBUG -DNDEBUG   -I/var/lib/dkms/nvidia/340.76/build -Wall -MD -Wsign-compare -Wno-cast-qual -Wno-error -D__KERNEL__ -DMODULE -DNVRM -DNV_VERSION_STRING=\"340.76\" -Wno-unused-function -Wuninitialized -fno-strict-aliasing -mno-red-zone -mcmodel=kernel -DNV_UVM_ENABLE -D__linux__ -DNV_DEV_NAME=\"nvidia\"  -DMODULE  -D"KBUILD_STR(s)=#s" -D"KBUILD_BASENAME=KBUILD_STR(nv_chrdev)"  -D"KBUILD_MODNAME=KBUILD_STR(nvidia)" -c -o /var/lib/dkms/nvidia/340.76/build/nv-chrdev.o /var/lib/dkms/nvidia/340.76/build/nv-chrdev.c
  108. In file included from /usr/src/kernels/4.1.7-200.fc22.x86_64/include/uapi/linux/stddef.h:1:0,
  109.                  from /usr/src/kernels/4.1.7-200.fc22.x86_64/include/linux/stddef.h:4,
  110.                  from /usr/src/kernels/4.1.7-200.fc22.x86_64/include/uapi/linux/posix_types.h:4,
  111.                  from /usr/src/kernels/4.1.7-200.fc22.x86_64/include/uapi/linux/types.h:13,
  112.                  from /usr/src/kernels/4.1.7-200.fc22.x86_64/include/linux/types.h:5,
  113.                  from /usr/src/kernels/4.1.7-200.fc22.x86_64/include/uapi/linux/capability.h:16,
  114.                  from /usr/src/kernels/4.1.7-200.fc22.x86_64/include/linux/capability.h:15,
  115.                  from /usr/src/kernels/4.1.7-200.fc22.x86_64/include/linux/sched.h:15,
  116.                  from /usr/src/kernels/4.1.7-200.fc22.x86_64/include/linux/utsname.h:5,
  117.                  from /var/lib/dkms/nvidia/340.76/build/nv-linux.h:44,
  118.                  from /var/lib/dkms/nvidia/340.76/build/nv-chrdev.c:15:
  119. /usr/src/kernels/4.1.7-200.fc22.x86_64/include/asm-generic/qrwlock.h: In function ‘queue_write_trylock’:
  120. /usr/src/kernels/4.1.7-200.fc22.x86_64/include/asm-generic/qrwlock.h:93:35: warning: comparison between signed and unsigned integer expressions [-Wsign-compare]
  121.           cnts, cnts | _QW_LOCKED) == cnts);
  122.                                    ^
  123. /usr/src/kernels/4.1.7-200.fc22.x86_64/include/linux/compiler.h:163:40: note: in definition of macro ‘likely’
  124.  # define likely(x) __builtin_expect(!!(x), 1)
  125.                                         ^
  126. In file included from /usr/src/kernels/4.1.7-200.fc22.x86_64/include/uapi/linux/stddef.h:1:0,
  127.                  from /usr/src/kernels/4.1.7-200.fc22.x86_64/include/linux/stddef.h:4,
  128.                  from /usr/src/kernels/4.1.7-200.fc22.x86_64/include/uapi/linux/posix_types.h:4,
  129.                  from /usr/src/kernels/4.1.7-200.fc22.x86_64/include/uapi/linux/types.h:13,
  130.                  from /usr/src/kernels/4.1.7-200.fc22.x86_64/include/linux/types.h:5,
  131.                  from /usr/src/kernels/4.1.7-200.fc22.x86_64/include/uapi/linux/capability.h:16,
  132.                  from /usr/src/kernels/4.1.7-200.fc22.x86_64/include/linux/capability.h:15,
  133.                  from /usr/src/kernels/4.1.7-200.fc22.x86_64/include/linux/sched.h:15,
  134.                  from /usr/src/kernels/4.1.7-200.fc22.x86_64/include/linux/utsname.h:5,
  135.                  from /var/lib/dkms/nvidia/340.76/build/nv-linux.h:44,
  136.                  from /var/lib/dkms/nvidia/340.76/build/nv-chrdev.c:15:
  137. /usr/src/kernels/4.1.7-200.fc22.x86_64/arch/x86/include/asm/uaccess.h: In function ‘copy_from_user’:
  138. /usr/src/kernels/4.1.7-200.fc22.x86_64/arch/x86/include/asm/uaccess.h:712:26: warning: comparison between signed and unsigned integer expressions [-Wsign-compare]
  139.   if (likely(sz < 0 || sz >= n))
  140.                           ^
  141. /usr/src/kernels/4.1.7-200.fc22.x86_64/include/linux/compiler.h:163:40: note: in definition of macro ‘likely’
  142.  # define likely(x) __builtin_expect(!!(x), 1)
  143.                                         ^
  144. /usr/src/kernels/4.1.7-200.fc22.x86_64/arch/x86/include/asm/uaccess.h: In function ‘copy_to_user’:
  145. /usr/src/kernels/4.1.7-200.fc22.x86_64/arch/x86/include/asm/uaccess.h:730:26: warning: comparison between signed and unsigned integer expressions [-Wsign-compare]
  146.   if (likely(sz < 0 || sz >= n))
  147.                           ^
  148. /usr/src/kernels/4.1.7-200.fc22.x86_64/include/linux/compiler.h:163:40: note: in definition of macro ‘likely’
  149.  # define likely(x) __builtin_expect(!!(x), 1)
  150.                                         ^
  151.   if [ "-pg" = "-pg" ]; then if [ /var/lib/dkms/nvidia/340.76/build/nv-chrdev.o != "scripts/mod/empty.o" ]; then ./scripts/recordmcount  "/var/lib/dkms/nvidia/340.76/build/nv-chrdev.o"; fi; fi;
  152.   cc -Wp,-MD,/var/lib/dkms/nvidia/340.76/build/.nv-cray.o.d  -nostdinc -isystem /usr/lib/gcc/x86_64-redhat-linux/5.1.1/include -I/usr/src/kernels/4.1.7-200.fc22.x86_64/arch/x86/include -Iarch/x86/include/generated/uapi -Iarch/x86/include/generated  -I/usr/src/kernels/4.1.7-200.fc22.x86_64/include -Iinclude -I/usr/src/kernels/4.1.7-200.fc22.x86_64/arch/x86/include/uapi -Iarch/x86/include/generated/uapi -I/usr/src/kernels/4.1.7-200.fc22.x86_64/include/uapi -Iinclude/generated/uapi -include /usr/src/kernels/4.1.7-200.fc22.x86_64/include/linux/kconfig.h   -I/var/lib/dkms/nvidia/340.76/build -D__KERNEL__ -Wall -Wundef -Wstrict-prototypes -Wno-trigraphs -fno-strict-aliasing -fno-common -Werror-implicit-function-declaration -Wno-format-security -std=gnu89 -m64 -mno-80387 -mno-fp-ret-in-387 -mtune=generic -mno-red-zone -mcmodel=kernel -funit-at-a-time -maccumulate-outgoing-args -DCONFIG_AS_CFI=1 -DCONFIG_AS_CFI_SIGNAL_FRAME=1 -DCONFIG_AS_CFI_SECTIONS=1 -DCONFIG_AS_FXSAVEQ=1 -DCONFIG_AS_SSSE3=1 -DCONFIG_AS_CRC32=1 -DCONFIG_AS_AVX=1 -DCONFIG_AS_AVX2=1 -pipe -Wno-sign-compare -fno-asynchronous-unwind-tables -mno-sse -mno-mmx -mno-sse2 -mno-3dnow -mno-avx -fno-delete-null-pointer-checks -O2 --param=allow-store-data-races=0 -Wframe-larger-than=2048 -fstack-protector-strong -Wno-unused-but-set-variable -fno-omit-frame-pointer -fno-optimize-sibling-calls -fvar-tracking-assignments -g -pg -mfentry -DCC_USING_FENTRY -Wdeclaration-after-statement -Wno-pointer-sign -fno-strict-overflow -fconserve-stack -Werror=implicit-int -Werror=strict-prototypes -Werror=date-time -DCC_HAVE_ASM_GOTO -DNV_MODULE_INSTANCE=0 -DNV_BUILD_MODULE_INSTANCES=0 -UDEBUG -U_DEBUG -DNDEBUG   -I/var/lib/dkms/nvidia/340.76/build -Wall -MD -Wsign-compare -Wno-cast-qual -Wno-error -D__KERNEL__ -DMODULE -DNVRM -DNV_VERSION_STRING=\"340.76\" -Wno-unused-function -Wuninitialized -fno-strict-aliasing -mno-red-zone -mcmodel=kernel -DNV_UVM_ENABLE -D__linux__ -DNV_DEV_NAME=\"nvidia\"  -DMODULE  -D"KBUILD_STR(s)=#s" -D"KBUILD_BASENAME=KBUILD_STR(nv_cray)"  -D"KBUILD_MODNAME=KBUILD_STR(nvidia)" -c -o /var/lib/dkms/nvidia/340.76/build/nv-cray.o /var/lib/dkms/nvidia/340.76/build/nv-cray.c
  153. In file included from /usr/src/kernels/4.1.7-200.fc22.x86_64/include/uapi/linux/stddef.h:1:0,
  154.                  from /usr/src/kernels/4.1.7-200.fc22.x86_64/include/linux/stddef.h:4,
  155.                  from /usr/src/kernels/4.1.7-200.fc22.x86_64/include/uapi/linux/posix_types.h:4,
  156.                  from /usr/src/kernels/4.1.7-200.fc22.x86_64/include/uapi/linux/types.h:13,
  157.                  from /usr/src/kernels/4.1.7-200.fc22.x86_64/include/linux/types.h:5,
  158.                  from /usr/src/kernels/4.1.7-200.fc22.x86_64/include/uapi/linux/capability.h:16,
  159.                  from /usr/src/kernels/4.1.7-200.fc22.x86_64/include/linux/capability.h:15,
  160.                  from /usr/src/kernels/4.1.7-200.fc22.x86_64/include/linux/sched.h:15,
  161.                  from /usr/src/kernels/4.1.7-200.fc22.x86_64/include/linux/utsname.h:5,
  162.                  from /var/lib/dkms/nvidia/340.76/build/nv-linux.h:44,
  163.                  from /var/lib/dkms/nvidia/340.76/build/nv-cray.c:15:
  164. /usr/src/kernels/4.1.7-200.fc22.x86_64/include/asm-generic/qrwlock.h: In function ‘queue_write_trylock’:
  165. /usr/src/kernels/4.1.7-200.fc22.x86_64/include/asm-generic/qrwlock.h:93:35: warning: comparison between signed and unsigned integer expressions [-Wsign-compare]
  166.           cnts, cnts | _QW_LOCKED) == cnts);
  167.                                    ^
  168. /usr/src/kernels/4.1.7-200.fc22.x86_64/include/linux/compiler.h:163:40: note: in definition of macro ‘likely’
  169.  # define likely(x) __builtin_expect(!!(x), 1)
  170.                                         ^
  171. In file included from /usr/src/kernels/4.1.7-200.fc22.x86_64/include/uapi/linux/stddef.h:1:0,
  172.                  from /usr/src/kernels/4.1.7-200.fc22.x86_64/include/linux/stddef.h:4,
  173.                  from /usr/src/kernels/4.1.7-200.fc22.x86_64/include/uapi/linux/posix_types.h:4,
  174.                  from /usr/src/kernels/4.1.7-200.fc22.x86_64/include/uapi/linux/types.h:13,
  175.                  from /usr/src/kernels/4.1.7-200.fc22.x86_64/include/linux/types.h:5,
  176.                  from /usr/src/kernels/4.1.7-200.fc22.x86_64/include/uapi/linux/capability.h:16,
  177.                  from /usr/src/kernels/4.1.7-200.fc22.x86_64/include/linux/capability.h:15,
  178.                  from /usr/src/kernels/4.1.7-200.fc22.x86_64/include/linux/sched.h:15,
  179.                  from /usr/src/kernels/4.1.7-200.fc22.x86_64/include/linux/utsname.h:5,
  180.                  from /var/lib/dkms/nvidia/340.76/build/nv-linux.h:44,
  181.                  from /var/lib/dkms/nvidia/340.76/build/nv-cray.c:15:
  182. /usr/src/kernels/4.1.7-200.fc22.x86_64/arch/x86/include/asm/uaccess.h: In function ‘copy_from_user’:
  183. /usr/src/kernels/4.1.7-200.fc22.x86_64/arch/x86/include/asm/uaccess.h:712:26: warning: comparison between signed and unsigned integer expressions [-Wsign-compare]
  184.   if (likely(sz < 0 || sz >= n))
  185.                           ^
  186. /usr/src/kernels/4.1.7-200.fc22.x86_64/include/linux/compiler.h:163:40: note: in definition of macro ‘likely’
  187.  # define likely(x) __builtin_expect(!!(x), 1)
  188.                                         ^
  189. /usr/src/kernels/4.1.7-200.fc22.x86_64/arch/x86/include/asm/uaccess.h: In function ‘copy_to_user’:
  190. /usr/src/kernels/4.1.7-200.fc22.x86_64/arch/x86/include/asm/uaccess.h:730:26: warning: comparison between signed and unsigned integer expressions [-Wsign-compare]
  191.   if (likely(sz < 0 || sz >= n))
  192.                           ^
  193. /usr/src/kernels/4.1.7-200.fc22.x86_64/include/linux/compiler.h:163:40: note: in definition of macro ‘likely’
  194.  # define likely(x) __builtin_expect(!!(x), 1)
  195.                                         ^
  196.   if [ "-pg" = "-pg" ]; then if [ /var/lib/dkms/nvidia/340.76/build/nv-cray.o != "scripts/mod/empty.o" ]; then ./scripts/recordmcount  "/var/lib/dkms/nvidia/340.76/build/nv-cray.o"; fi; fi;
  197.   cc -Wp,-MD,/var/lib/dkms/nvidia/340.76/build/.nv-dma.o.d  -nostdinc -isystem /usr/lib/gcc/x86_64-redhat-linux/5.1.1/include -I/usr/src/kernels/4.1.7-200.fc22.x86_64/arch/x86/include -Iarch/x86/include/generated/uapi -Iarch/x86/include/generated  -I/usr/src/kernels/4.1.7-200.fc22.x86_64/include -Iinclude -I/usr/src/kernels/4.1.7-200.fc22.x86_64/arch/x86/include/uapi -Iarch/x86/include/generated/uapi -I/usr/src/kernels/4.1.7-200.fc22.x86_64/include/uapi -Iinclude/generated/uapi -include /usr/src/kernels/4.1.7-200.fc22.x86_64/include/linux/kconfig.h   -I/var/lib/dkms/nvidia/340.76/build -D__KERNEL__ -Wall -Wundef -Wstrict-prototypes -Wno-trigraphs -fno-strict-aliasing -fno-common -Werror-implicit-function-declaration -Wno-format-security -std=gnu89 -m64 -mno-80387 -mno-fp-ret-in-387 -mtune=generic -mno-red-zone -mcmodel=kernel -funit-at-a-time -maccumulate-outgoing-args -DCONFIG_AS_CFI=1 -DCONFIG_AS_CFI_SIGNAL_FRAME=1 -DCONFIG_AS_CFI_SECTIONS=1 -DCONFIG_AS_FXSAVEQ=1 -DCONFIG_AS_SSSE3=1 -DCONFIG_AS_CRC32=1 -DCONFIG_AS_AVX=1 -DCONFIG_AS_AVX2=1 -pipe -Wno-sign-compare -fno-asynchronous-unwind-tables -mno-sse -mno-mmx -mno-sse2 -mno-3dnow -mno-avx -fno-delete-null-pointer-checks -O2 --param=allow-store-data-races=0 -Wframe-larger-than=2048 -fstack-protector-strong -Wno-unused-but-set-variable -fno-omit-frame-pointer -fno-optimize-sibling-calls -fvar-tracking-assignments -g -pg -mfentry -DCC_USING_FENTRY -Wdeclaration-after-statement -Wno-pointer-sign -fno-strict-overflow -fconserve-stack -Werror=implicit-int -Werror=strict-prototypes -Werror=date-time -DCC_HAVE_ASM_GOTO -DNV_MODULE_INSTANCE=0 -DNV_BUILD_MODULE_INSTANCES=0 -UDEBUG -U_DEBUG -DNDEBUG   -I/var/lib/dkms/nvidia/340.76/build -Wall -MD -Wsign-compare -Wno-cast-qual -Wno-error -D__KERNEL__ -DMODULE -DNVRM -DNV_VERSION_STRING=\"340.76\" -Wno-unused-function -Wuninitialized -fno-strict-aliasing -mno-red-zone -mcmodel=kernel -DNV_UVM_ENABLE -D__linux__ -DNV_DEV_NAME=\"nvidia\"  -DMODULE  -D"KBUILD_STR(s)=#s" -D"KBUILD_BASENAME=KBUILD_STR(nv_dma)"  -D"KBUILD_MODNAME=KBUILD_STR(nvidia)" -c -o /var/lib/dkms/nvidia/340.76/build/nv-dma.o /var/lib/dkms/nvidia/340.76/build/nv-dma.c
  198. In file included from /usr/src/kernels/4.1.7-200.fc22.x86_64/include/uapi/linux/stddef.h:1:0,
  199.                  from /usr/src/kernels/4.1.7-200.fc22.x86_64/include/linux/stddef.h:4,
  200.                  from /usr/src/kernels/4.1.7-200.fc22.x86_64/include/uapi/linux/posix_types.h:4,
  201.                  from /usr/src/kernels/4.1.7-200.fc22.x86_64/include/uapi/linux/types.h:13,
  202.                  from /usr/src/kernels/4.1.7-200.fc22.x86_64/include/linux/types.h:5,
  203.                  from /usr/src/kernels/4.1.7-200.fc22.x86_64/include/uapi/linux/capability.h:16,
  204.                  from /usr/src/kernels/4.1.7-200.fc22.x86_64/include/linux/capability.h:15,
  205.                  from /usr/src/kernels/4.1.7-200.fc22.x86_64/include/linux/sched.h:15,
  206.                  from /usr/src/kernels/4.1.7-200.fc22.x86_64/include/linux/utsname.h:5,
  207.                  from /var/lib/dkms/nvidia/340.76/build/nv-linux.h:44,
  208.                  from /var/lib/dkms/nvidia/340.76/build/nv-dma.c:15:
  209. /usr/src/kernels/4.1.7-200.fc22.x86_64/include/asm-generic/qrwlock.h: In function ‘queue_write_trylock’:
  210. /usr/src/kernels/4.1.7-200.fc22.x86_64/include/asm-generic/qrwlock.h:93:35: warning: comparison between signed and unsigned integer expressions [-Wsign-compare]
  211.           cnts, cnts | _QW_LOCKED) == cnts);
  212.                                    ^
  213. /usr/src/kernels/4.1.7-200.fc22.x86_64/include/linux/compiler.h:163:40: note: in definition of macro ‘likely’
  214.  # define likely(x) __builtin_expect(!!(x), 1)
  215.                                         ^
  216. In file included from /usr/src/kernels/4.1.7-200.fc22.x86_64/include/uapi/linux/stddef.h:1:0,
  217.                  from /usr/src/kernels/4.1.7-200.fc22.x86_64/include/linux/stddef.h:4,
  218.                  from /usr/src/kernels/4.1.7-200.fc22.x86_64/include/uapi/linux/posix_types.h:4,
  219.                  from /usr/src/kernels/4.1.7-200.fc22.x86_64/include/uapi/linux/types.h:13,
  220.                  from /usr/src/kernels/4.1.7-200.fc22.x86_64/include/linux/types.h:5,
  221.                  from /usr/src/kernels/4.1.7-200.fc22.x86_64/include/uapi/linux/capability.h:16,
  222.                  from /usr/src/kernels/4.1.7-200.fc22.x86_64/include/linux/capability.h:15,
  223.                  from /usr/src/kernels/4.1.7-200.fc22.x86_64/include/linux/sched.h:15,
  224.                  from /usr/src/kernels/4.1.7-200.fc22.x86_64/include/linux/utsname.h:5,
  225.                  from /var/lib/dkms/nvidia/340.76/build/nv-linux.h:44,
  226.                  from /var/lib/dkms/nvidia/340.76/build/nv-dma.c:15:
  227. /usr/src/kernels/4.1.7-200.fc22.x86_64/arch/x86/include/asm/uaccess.h: In function ‘copy_from_user’:
  228. /usr/src/kernels/4.1.7-200.fc22.x86_64/arch/x86/include/asm/uaccess.h:712:26: warning: comparison between signed and unsigned integer expressions [-Wsign-compare]
  229.   if (likely(sz < 0 || sz >= n))
  230.                           ^
  231. /usr/src/kernels/4.1.7-200.fc22.x86_64/include/linux/compiler.h:163:40: note: in definition of macro ‘likely’
  232.  # define likely(x) __builtin_expect(!!(x), 1)
  233.                                         ^
  234. /usr/src/kernels/4.1.7-200.fc22.x86_64/arch/x86/include/asm/uaccess.h: In function ‘copy_to_user’:
  235. /usr/src/kernels/4.1.7-200.fc22.x86_64/arch/x86/include/asm/uaccess.h:730:26: warning: comparison between signed and unsigned integer expressions [-Wsign-compare]
  236.   if (likely(sz < 0 || sz >= n))
  237.                           ^
  238. /usr/src/kernels/4.1.7-200.fc22.x86_64/include/linux/compiler.h:163:40: note: in definition of macro ‘likely’
  239.  # define likely(x) __builtin_expect(!!(x), 1)
  240.                                         ^
  241.   if [ "-pg" = "-pg" ]; then if [ /var/lib/dkms/nvidia/340.76/build/nv-dma.o != "scripts/mod/empty.o" ]; then ./scripts/recordmcount  "/var/lib/dkms/nvidia/340.76/build/nv-dma.o"; fi; fi;
  242.   cc -Wp,-MD,/var/lib/dkms/nvidia/340.76/build/.nv-drm.o.d  -nostdinc -isystem /usr/lib/gcc/x86_64-redhat-linux/5.1.1/include -I/usr/src/kernels/4.1.7-200.fc22.x86_64/arch/x86/include -Iarch/x86/include/generated/uapi -Iarch/x86/include/generated  -I/usr/src/kernels/4.1.7-200.fc22.x86_64/include -Iinclude -I/usr/src/kernels/4.1.7-200.fc22.x86_64/arch/x86/include/uapi -Iarch/x86/include/generated/uapi -I/usr/src/kernels/4.1.7-200.fc22.x86_64/include/uapi -Iinclude/generated/uapi -include /usr/src/kernels/4.1.7-200.fc22.x86_64/include/linux/kconfig.h   -I/var/lib/dkms/nvidia/340.76/build -D__KERNEL__ -Wall -Wundef -Wstrict-prototypes -Wno-trigraphs -fno-strict-aliasing -fno-common -Werror-implicit-function-declaration -Wno-format-security -std=gnu89 -m64 -mno-80387 -mno-fp-ret-in-387 -mtune=generic -mno-red-zone -mcmodel=kernel -funit-at-a-time -maccumulate-outgoing-args -DCONFIG_AS_CFI=1 -DCONFIG_AS_CFI_SIGNAL_FRAME=1 -DCONFIG_AS_CFI_SECTIONS=1 -DCONFIG_AS_FXSAVEQ=1 -DCONFIG_AS_SSSE3=1 -DCONFIG_AS_CRC32=1 -DCONFIG_AS_AVX=1 -DCONFIG_AS_AVX2=1 -pipe -Wno-sign-compare -fno-asynchronous-unwind-tables -mno-sse -mno-mmx -mno-sse2 -mno-3dnow -mno-avx -fno-delete-null-pointer-checks -O2 --param=allow-store-data-races=0 -Wframe-larger-than=2048 -fstack-protector-strong -Wno-unused-but-set-variable -fno-omit-frame-pointer -fno-optimize-sibling-calls -fvar-tracking-assignments -g -pg -mfentry -DCC_USING_FENTRY -Wdeclaration-after-statement -Wno-pointer-sign -fno-strict-overflow -fconserve-stack -Werror=implicit-int -Werror=strict-prototypes -Werror=date-time -DCC_HAVE_ASM_GOTO -DNV_MODULE_INSTANCE=0 -DNV_BUILD_MODULE_INSTANCES=0 -UDEBUG -U_DEBUG -DNDEBUG   -I/var/lib/dkms/nvidia/340.76/build -Wall -MD -Wsign-compare -Wno-cast-qual -Wno-error -D__KERNEL__ -DMODULE -DNVRM -DNV_VERSION_STRING=\"340.76\" -Wno-unused-function -Wuninitialized -fno-strict-aliasing -mno-red-zone -mcmodel=kernel -DNV_UVM_ENABLE -D__linux__ -DNV_DEV_NAME=\"nvidia\"  -DMODULE  -D"KBUILD_STR(s)=#s" -D"KBUILD_BASENAME=KBUILD_STR(nv_drm)"  -D"KBUILD_MODNAME=KBUILD_STR(nvidia)" -c -o /var/lib/dkms/nvidia/340.76/build/nv-drm.o /var/lib/dkms/nvidia/340.76/build/nv-drm.c
  243. In file included from /usr/src/kernels/4.1.7-200.fc22.x86_64/include/uapi/linux/stddef.h:1:0,
  244.                  from /usr/src/kernels/4.1.7-200.fc22.x86_64/include/linux/stddef.h:4,
  245.                  from /usr/src/kernels/4.1.7-200.fc22.x86_64/include/uapi/linux/posix_types.h:4,
  246.                  from /usr/src/kernels/4.1.7-200.fc22.x86_64/include/uapi/linux/types.h:13,
  247.                  from /usr/src/kernels/4.1.7-200.fc22.x86_64/include/linux/types.h:5,
  248.                  from /usr/src/kernels/4.1.7-200.fc22.x86_64/include/uapi/linux/capability.h:16,
  249.                  from /usr/src/kernels/4.1.7-200.fc22.x86_64/include/linux/capability.h:15,
  250.                  from /usr/src/kernels/4.1.7-200.fc22.x86_64/include/linux/sched.h:15,
  251.                  from /usr/src/kernels/4.1.7-200.fc22.x86_64/include/linux/utsname.h:5,
  252.                  from /var/lib/dkms/nvidia/340.76/build/nv-linux.h:44,
  253.                  from /var/lib/dkms/nvidia/340.76/build/nv-drm.c:15:
  254. /usr/src/kernels/4.1.7-200.fc22.x86_64/include/asm-generic/qrwlock.h: In function ‘queue_write_trylock’:
  255. /usr/src/kernels/4.1.7-200.fc22.x86_64/include/asm-generic/qrwlock.h:93:35: warning: comparison between signed and unsigned integer expressions [-Wsign-compare]
  256.           cnts, cnts | _QW_LOCKED) == cnts);
  257.                                    ^
  258. /usr/src/kernels/4.1.7-200.fc22.x86_64/include/linux/compiler.h:163:40: note: in definition of macro ‘likely’
  259.  # define likely(x) __builtin_expect(!!(x), 1)
  260.                                         ^
  261. In file included from /usr/src/kernels/4.1.7-200.fc22.x86_64/include/uapi/linux/stddef.h:1:0,
  262.                  from /usr/src/kernels/4.1.7-200.fc22.x86_64/include/linux/stddef.h:4,
  263.                  from /usr/src/kernels/4.1.7-200.fc22.x86_64/include/uapi/linux/posix_types.h:4,
  264.                  from /usr/src/kernels/4.1.7-200.fc22.x86_64/include/uapi/linux/types.h:13,
  265.                  from /usr/src/kernels/4.1.7-200.fc22.x86_64/include/linux/types.h:5,
  266.                  from /usr/src/kernels/4.1.7-200.fc22.x86_64/include/uapi/linux/capability.h:16,
  267.                  from /usr/src/kernels/4.1.7-200.fc22.x86_64/include/linux/capability.h:15,
  268.                  from /usr/src/kernels/4.1.7-200.fc22.x86_64/include/linux/sched.h:15,
  269.                  from /usr/src/kernels/4.1.7-200.fc22.x86_64/include/linux/utsname.h:5,
  270.                  from /var/lib/dkms/nvidia/340.76/build/nv-linux.h:44,
  271.                  from /var/lib/dkms/nvidia/340.76/build/nv-drm.c:15:
  272. /usr/src/kernels/4.1.7-200.fc22.x86_64/arch/x86/include/asm/uaccess.h: In function ‘copy_from_user’:
  273. /usr/src/kernels/4.1.7-200.fc22.x86_64/arch/x86/include/asm/uaccess.h:712:26: warning: comparison between signed and unsigned integer expressions [-Wsign-compare]
  274.   if (likely(sz < 0 || sz >= n))
  275.                           ^
  276. /usr/src/kernels/4.1.7-200.fc22.x86_64/include/linux/compiler.h:163:40: note: in definition of macro ‘likely’
  277.  # define likely(x) __builtin_expect(!!(x), 1)
  278.                                         ^
  279. /usr/src/kernels/4.1.7-200.fc22.x86_64/arch/x86/include/asm/uaccess.h: In function ‘copy_to_user’:
  280. /usr/src/kernels/4.1.7-200.fc22.x86_64/arch/x86/include/asm/uaccess.h:730:26: warning: comparison between signed and unsigned integer expressions [-Wsign-compare]
  281.   if (likely(sz < 0 || sz >= n))
  282.                           ^
  283. /usr/src/kernels/4.1.7-200.fc22.x86_64/include/linux/compiler.h:163:40: note: in definition of macro ‘likely’
  284.  # define likely(x) __builtin_expect(!!(x), 1)
  285.                                         ^
  286.   if [ "-pg" = "-pg" ]; then if [ /var/lib/dkms/nvidia/340.76/build/nv-drm.o != "scripts/mod/empty.o" ]; then ./scripts/recordmcount  "/var/lib/dkms/nvidia/340.76/build/nv-drm.o"; fi; fi;
  287.   cc -Wp,-MD,/var/lib/dkms/nvidia/340.76/build/.nv-gvi.o.d  -nostdinc -isystem /usr/lib/gcc/x86_64-redhat-linux/5.1.1/include -I/usr/src/kernels/4.1.7-200.fc22.x86_64/arch/x86/include -Iarch/x86/include/generated/uapi -Iarch/x86/include/generated  -I/usr/src/kernels/4.1.7-200.fc22.x86_64/include -Iinclude -I/usr/src/kernels/4.1.7-200.fc22.x86_64/arch/x86/include/uapi -Iarch/x86/include/generated/uapi -I/usr/src/kernels/4.1.7-200.fc22.x86_64/include/uapi -Iinclude/generated/uapi -include /usr/src/kernels/4.1.7-200.fc22.x86_64/include/linux/kconfig.h   -I/var/lib/dkms/nvidia/340.76/build -D__KERNEL__ -Wall -Wundef -Wstrict-prototypes -Wno-trigraphs -fno-strict-aliasing -fno-common -Werror-implicit-function-declaration -Wno-format-security -std=gnu89 -m64 -mno-80387 -mno-fp-ret-in-387 -mtune=generic -mno-red-zone -mcmodel=kernel -funit-at-a-time -maccumulate-outgoing-args -DCONFIG_AS_CFI=1 -DCONFIG_AS_CFI_SIGNAL_FRAME=1 -DCONFIG_AS_CFI_SECTIONS=1 -DCONFIG_AS_FXSAVEQ=1 -DCONFIG_AS_SSSE3=1 -DCONFIG_AS_CRC32=1 -DCONFIG_AS_AVX=1 -DCONFIG_AS_AVX2=1 -pipe -Wno-sign-compare -fno-asynchronous-unwind-tables -mno-sse -mno-mmx -mno-sse2 -mno-3dnow -mno-avx -fno-delete-null-pointer-checks -O2 --param=allow-store-data-races=0 -Wframe-larger-than=2048 -fstack-protector-strong -Wno-unused-but-set-variable -fno-omit-frame-pointer -fno-optimize-sibling-calls -fvar-tracking-assignments -g -pg -mfentry -DCC_USING_FENTRY -Wdeclaration-after-statement -Wno-pointer-sign -fno-strict-overflow -fconserve-stack -Werror=implicit-int -Werror=strict-prototypes -Werror=date-time -DCC_HAVE_ASM_GOTO -DNV_MODULE_INSTANCE=0 -DNV_BUILD_MODULE_INSTANCES=0 -UDEBUG -U_DEBUG -DNDEBUG   -I/var/lib/dkms/nvidia/340.76/build -Wall -MD -Wsign-compare -Wno-cast-qual -Wno-error -D__KERNEL__ -DMODULE -DNVRM -DNV_VERSION_STRING=\"340.76\" -Wno-unused-function -Wuninitialized -fno-strict-aliasing -mno-red-zone -mcmodel=kernel -DNV_UVM_ENABLE -D__linux__ -DNV_DEV_NAME=\"nvidia\"  -DMODULE  -D"KBUILD_STR(s)=#s" -D"KBUILD_BASENAME=KBUILD_STR(nv_gvi)"  -D"KBUILD_MODNAME=KBUILD_STR(nvidia)" -c -o /var/lib/dkms/nvidia/340.76/build/nv-gvi.o /var/lib/dkms/nvidia/340.76/build/nv-gvi.c
  288. In file included from /usr/src/kernels/4.1.7-200.fc22.x86_64/include/uapi/linux/stddef.h:1:0,
  289.                  from /usr/src/kernels/4.1.7-200.fc22.x86_64/include/linux/stddef.h:4,
  290.                  from /usr/src/kernels/4.1.7-200.fc22.x86_64/include/uapi/linux/posix_types.h:4,
  291.                  from /usr/src/kernels/4.1.7-200.fc22.x86_64/include/uapi/linux/types.h:13,
  292.                  from /usr/src/kernels/4.1.7-200.fc22.x86_64/include/linux/types.h:5,
  293.                  from /usr/src/kernels/4.1.7-200.fc22.x86_64/include/uapi/linux/capability.h:16,
  294.                  from /usr/src/kernels/4.1.7-200.fc22.x86_64/include/linux/capability.h:15,
  295.                  from /usr/src/kernels/4.1.7-200.fc22.x86_64/include/linux/sched.h:15,
  296.                  from /usr/src/kernels/4.1.7-200.fc22.x86_64/include/linux/utsname.h:5,
  297.                  from /var/lib/dkms/nvidia/340.76/build/nv-linux.h:44,
  298.                  from /var/lib/dkms/nvidia/340.76/build/nv-gvi.c:15:
  299. /usr/src/kernels/4.1.7-200.fc22.x86_64/include/asm-generic/qrwlock.h: In function ‘queue_write_trylock’:
  300. /usr/src/kernels/4.1.7-200.fc22.x86_64/include/asm-generic/qrwlock.h:93:35: warning: comparison between signed and unsigned integer expressions [-Wsign-compare]
  301.           cnts, cnts | _QW_LOCKED) == cnts);
  302.                                    ^
  303. /usr/src/kernels/4.1.7-200.fc22.x86_64/include/linux/compiler.h:163:40: note: in definition of macro ‘likely’
  304.  # define likely(x) __builtin_expect(!!(x), 1)
  305.                                         ^
  306. In file included from /usr/src/kernels/4.1.7-200.fc22.x86_64/include/uapi/linux/stddef.h:1:0,
  307.                  from /usr/src/kernels/4.1.7-200.fc22.x86_64/include/linux/stddef.h:4,
  308.                  from /usr/src/kernels/4.1.7-200.fc22.x86_64/include/uapi/linux/posix_types.h:4,
  309.                  from /usr/src/kernels/4.1.7-200.fc22.x86_64/include/uapi/linux/types.h:13,
  310.                  from /usr/src/kernels/4.1.7-200.fc22.x86_64/include/linux/types.h:5,
  311.                  from /usr/src/kernels/4.1.7-200.fc22.x86_64/include/uapi/linux/capability.h:16,
  312.                  from /usr/src/kernels/4.1.7-200.fc22.x86_64/include/linux/capability.h:15,
  313.                  from /usr/src/kernels/4.1.7-200.fc22.x86_64/include/linux/sched.h:15,
  314.                  from /usr/src/kernels/4.1.7-200.fc22.x86_64/include/linux/utsname.h:5,
  315.                  from /var/lib/dkms/nvidia/340.76/build/nv-linux.h:44,
  316.                  from /var/lib/dkms/nvidia/340.76/build/nv-gvi.c:15:
  317. /usr/src/kernels/4.1.7-200.fc22.x86_64/arch/x86/include/asm/uaccess.h: In function ‘copy_from_user’:
  318. /usr/src/kernels/4.1.7-200.fc22.x86_64/arch/x86/include/asm/uaccess.h:712:26: warning: comparison between signed and unsigned integer expressions [-Wsign-compare]
  319.   if (likely(sz < 0 || sz >= n))
  320.                           ^
  321. /usr/src/kernels/4.1.7-200.fc22.x86_64/include/linux/compiler.h:163:40: note: in definition of macro ‘likely’
  322.  # define likely(x) __builtin_expect(!!(x), 1)
  323.                                         ^
  324. /usr/src/kernels/4.1.7-200.fc22.x86_64/arch/x86/include/asm/uaccess.h: In function ‘copy_to_user’:
  325. /usr/src/kernels/4.1.7-200.fc22.x86_64/arch/x86/include/asm/uaccess.h:730:26: warning: comparison between signed and unsigned integer expressions [-Wsign-compare]
  326.   if (likely(sz < 0 || sz >= n))
  327.                           ^
  328. /usr/src/kernels/4.1.7-200.fc22.x86_64/include/linux/compiler.h:163:40: note: in definition of macro ‘likely’
  329.  # define likely(x) __builtin_expect(!!(x), 1)
  330.                                         ^
  331.   if [ "-pg" = "-pg" ]; then if [ /var/lib/dkms/nvidia/340.76/build/nv-gvi.o != "scripts/mod/empty.o" ]; then ./scripts/recordmcount  "/var/lib/dkms/nvidia/340.76/build/nv-gvi.o"; fi; fi;
  332.   cc -Wp,-MD,/var/lib/dkms/nvidia/340.76/build/.nv-i2c.o.d  -nostdinc -isystem /usr/lib/gcc/x86_64-redhat-linux/5.1.1/include -I/usr/src/kernels/4.1.7-200.fc22.x86_64/arch/x86/include -Iarch/x86/include/generated/uapi -Iarch/x86/include/generated  -I/usr/src/kernels/4.1.7-200.fc22.x86_64/include -Iinclude -I/usr/src/kernels/4.1.7-200.fc22.x86_64/arch/x86/include/uapi -Iarch/x86/include/generated/uapi -I/usr/src/kernels/4.1.7-200.fc22.x86_64/include/uapi -Iinclude/generated/uapi -include /usr/src/kernels/4.1.7-200.fc22.x86_64/include/linux/kconfig.h   -I/var/lib/dkms/nvidia/340.76/build -D__KERNEL__ -Wall -Wundef -Wstrict-prototypes -Wno-trigraphs -fno-strict-aliasing -fno-common -Werror-implicit-function-declaration -Wno-format-security -std=gnu89 -m64 -mno-80387 -mno-fp-ret-in-387 -mtune=generic -mno-red-zone -mcmodel=kernel -funit-at-a-time -maccumulate-outgoing-args -DCONFIG_AS_CFI=1 -DCONFIG_AS_CFI_SIGNAL_FRAME=1 -DCONFIG_AS_CFI_SECTIONS=1 -DCONFIG_AS_FXSAVEQ=1 -DCONFIG_AS_SSSE3=1 -DCONFIG_AS_CRC32=1 -DCONFIG_AS_AVX=1 -DCONFIG_AS_AVX2=1 -pipe -Wno-sign-compare -fno-asynchronous-unwind-tables -mno-sse -mno-mmx -mno-sse2 -mno-3dnow -mno-avx -fno-delete-null-pointer-checks -O2 --param=allow-store-data-races=0 -Wframe-larger-than=2048 -fstack-protector-strong -Wno-unused-but-set-variable -fno-omit-frame-pointer -fno-optimize-sibling-calls -fvar-tracking-assignments -g -pg -mfentry -DCC_USING_FENTRY -Wdeclaration-after-statement -Wno-pointer-sign -fno-strict-overflow -fconserve-stack -Werror=implicit-int -Werror=strict-prototypes -Werror=date-time -DCC_HAVE_ASM_GOTO -DNV_MODULE_INSTANCE=0 -DNV_BUILD_MODULE_INSTANCES=0 -UDEBUG -U_DEBUG -DNDEBUG   -I/var/lib/dkms/nvidia/340.76/build -Wall -MD -Wsign-compare -Wno-cast-qual -Wno-error -D__KERNEL__ -DMODULE -DNVRM -DNV_VERSION_STRING=\"340.76\" -Wno-unused-function -Wuninitialized -fno-strict-aliasing -mno-red-zone -mcmodel=kernel -DNV_UVM_ENABLE -D__linux__ -DNV_DEV_NAME=\"nvidia\"  -DMODULE  -D"KBUILD_STR(s)=#s" -D"KBUILD_BASENAME=KBUILD_STR(nv_i2c)"  -D"KBUILD_MODNAME=KBUILD_STR(nvidia)" -c -o /var/lib/dkms/nvidia/340.76/build/nv-i2c.o /var/lib/dkms/nvidia/340.76/build/nv-i2c.c
  333. In file included from /usr/src/kernels/4.1.7-200.fc22.x86_64/include/uapi/linux/stddef.h:1:0,
  334.                  from /usr/src/kernels/4.1.7-200.fc22.x86_64/include/linux/stddef.h:4,
  335.                  from /usr/src/kernels/4.1.7-200.fc22.x86_64/include/uapi/linux/posix_types.h:4,
  336.                  from /usr/src/kernels/4.1.7-200.fc22.x86_64/include/uapi/linux/types.h:13,
  337.                  from /usr/src/kernels/4.1.7-200.fc22.x86_64/include/linux/types.h:5,
  338.                  from /usr/src/kernels/4.1.7-200.fc22.x86_64/include/uapi/linux/capability.h:16,
  339.                  from /usr/src/kernels/4.1.7-200.fc22.x86_64/include/linux/capability.h:15,
  340.                  from /usr/src/kernels/4.1.7-200.fc22.x86_64/include/linux/sched.h:15,
  341.                  from /usr/src/kernels/4.1.7-200.fc22.x86_64/include/linux/utsname.h:5,
  342.                  from /var/lib/dkms/nvidia/340.76/build/nv-linux.h:44,
  343.                  from /var/lib/dkms/nvidia/340.76/build/nv-i2c.c:15:
  344. /usr/src/kernels/4.1.7-200.fc22.x86_64/include/asm-generic/qrwlock.h: In function ‘queue_write_trylock’:
  345. /usr/src/kernels/4.1.7-200.fc22.x86_64/include/asm-generic/qrwlock.h:93:35: warning: comparison between signed and unsigned integer expressions [-Wsign-compare]
  346.           cnts, cnts | _QW_LOCKED) == cnts);
  347.                                    ^
  348. /usr/src/kernels/4.1.7-200.fc22.x86_64/include/linux/compiler.h:163:40: note: in definition of macro ‘likely’
  349.  # define likely(x) __builtin_expect(!!(x), 1)
  350.                                         ^
  351. In file included from /usr/src/kernels/4.1.7-200.fc22.x86_64/include/uapi/linux/stddef.h:1:0,
  352.                  from /usr/src/kernels/4.1.7-200.fc22.x86_64/include/linux/stddef.h:4,
  353.                  from /usr/src/kernels/4.1.7-200.fc22.x86_64/include/uapi/linux/posix_types.h:4,
  354.                  from /usr/src/kernels/4.1.7-200.fc22.x86_64/include/uapi/linux/types.h:13,
  355.                  from /usr/src/kernels/4.1.7-200.fc22.x86_64/include/linux/types.h:5,
  356.                  from /usr/src/kernels/4.1.7-200.fc22.x86_64/include/uapi/linux/capability.h:16,
  357.                  from /usr/src/kernels/4.1.7-200.fc22.x86_64/include/linux/capability.h:15,
  358.                  from /usr/src/kernels/4.1.7-200.fc22.x86_64/include/linux/sched.h:15,
  359.                  from /usr/src/kernels/4.1.7-200.fc22.x86_64/include/linux/utsname.h:5,
  360.                  from /var/lib/dkms/nvidia/340.76/build/nv-linux.h:44,
  361.                  from /var/lib/dkms/nvidia/340.76/build/nv-i2c.c:15:
  362. /usr/src/kernels/4.1.7-200.fc22.x86_64/arch/x86/include/asm/uaccess.h: In function ‘copy_from_user’:
  363. /usr/src/kernels/4.1.7-200.fc22.x86_64/arch/x86/include/asm/uaccess.h:712:26: warning: comparison between signed and unsigned integer expressions [-Wsign-compare]
  364.   if (likely(sz < 0 || sz >= n))
  365.                           ^
  366. /usr/src/kernels/4.1.7-200.fc22.x86_64/include/linux/compiler.h:163:40: note: in definition of macro ‘likely’
  367.  # define likely(x) __builtin_expect(!!(x), 1)
  368.                                         ^
  369. /usr/src/kernels/4.1.7-200.fc22.x86_64/arch/x86/include/asm/uaccess.h: In function ‘copy_to_user’:
  370. /usr/src/kernels/4.1.7-200.fc22.x86_64/arch/x86/include/asm/uaccess.h:730:26: warning: comparison between signed and unsigned integer expressions [-Wsign-compare]
  371.   if (likely(sz < 0 || sz >= n))
  372.                           ^
  373. /usr/src/kernels/4.1.7-200.fc22.x86_64/include/linux/compiler.h:163:40: note: in definition of macro ‘likely’
  374.  # define likely(x) __builtin_expect(!!(x), 1)
  375.                                         ^
  376.   if [ "-pg" = "-pg" ]; then if [ /var/lib/dkms/nvidia/340.76/build/nv-i2c.o != "scripts/mod/empty.o" ]; then ./scripts/recordmcount  "/var/lib/dkms/nvidia/340.76/build/nv-i2c.o"; fi; fi;
  377.   cc -Wp,-MD,/var/lib/dkms/nvidia/340.76/build/.nv-mempool.o.d  -nostdinc -isystem /usr/lib/gcc/x86_64-redhat-linux/5.1.1/include -I/usr/src/kernels/4.1.7-200.fc22.x86_64/arch/x86/include -Iarch/x86/include/generated/uapi -Iarch/x86/include/generated  -I/usr/src/kernels/4.1.7-200.fc22.x86_64/include -Iinclude -I/usr/src/kernels/4.1.7-200.fc22.x86_64/arch/x86/include/uapi -Iarch/x86/include/generated/uapi -I/usr/src/kernels/4.1.7-200.fc22.x86_64/include/uapi -Iinclude/generated/uapi -include /usr/src/kernels/4.1.7-200.fc22.x86_64/include/linux/kconfig.h   -I/var/lib/dkms/nvidia/340.76/build -D__KERNEL__ -Wall -Wundef -Wstrict-prototypes -Wno-trigraphs -fno-strict-aliasing -fno-common -Werror-implicit-function-declaration -Wno-format-security -std=gnu89 -m64 -mno-80387 -mno-fp-ret-in-387 -mtune=generic -mno-red-zone -mcmodel=kernel -funit-at-a-time -maccumulate-outgoing-args -DCONFIG_AS_CFI=1 -DCONFIG_AS_CFI_SIGNAL_FRAME=1 -DCONFIG_AS_CFI_SECTIONS=1 -DCONFIG_AS_FXSAVEQ=1 -DCONFIG_AS_SSSE3=1 -DCONFIG_AS_CRC32=1 -DCONFIG_AS_AVX=1 -DCONFIG_AS_AVX2=1 -pipe -Wno-sign-compare -fno-asynchronous-unwind-tables -mno-sse -mno-mmx -mno-sse2 -mno-3dnow -mno-avx -fno-delete-null-pointer-checks -O2 --param=allow-store-data-races=0 -Wframe-larger-than=2048 -fstack-protector-strong -Wno-unused-but-set-variable -fno-omit-frame-pointer -fno-optimize-sibling-calls -fvar-tracking-assignments -g -pg -mfentry -DCC_USING_FENTRY -Wdeclaration-after-statement -Wno-pointer-sign -fno-strict-overflow -fconserve-stack -Werror=implicit-int -Werror=strict-prototypes -Werror=date-time -DCC_HAVE_ASM_GOTO -DNV_MODULE_INSTANCE=0 -DNV_BUILD_MODULE_INSTANCES=0 -UDEBUG -U_DEBUG -DNDEBUG   -I/var/lib/dkms/nvidia/340.76/build -Wall -MD -Wsign-compare -Wno-cast-qual -Wno-error -D__KERNEL__ -DMODULE -DNVRM -DNV_VERSION_STRING=\"340.76\" -Wno-unused-function -Wuninitialized -fno-strict-aliasing -mno-red-zone -mcmodel=kernel -DNV_UVM_ENABLE -D__linux__ -DNV_DEV_NAME=\"nvidia\"  -DMODULE  -D"KBUILD_STR(s)=#s" -D"KBUILD_BASENAME=KBUILD_STR(nv_mempool)"  -D"KBUILD_MODNAME=KBUILD_STR(nvidia)" -c -o /var/lib/dkms/nvidia/340.76/build/nv-mempool.o /var/lib/dkms/nvidia/340.76/build/nv-mempool.c
  378. In file included from /usr/src/kernels/4.1.7-200.fc22.x86_64/include/uapi/linux/stddef.h:1:0,
  379.                  from /usr/src/kernels/4.1.7-200.fc22.x86_64/include/linux/stddef.h:4,
  380.                  from /usr/src/kernels/4.1.7-200.fc22.x86_64/include/uapi/linux/posix_types.h:4,
  381.                  from /usr/src/kernels/4.1.7-200.fc22.x86_64/include/uapi/linux/types.h:13,
  382.                  from /usr/src/kernels/4.1.7-200.fc22.x86_64/include/linux/types.h:5,
  383.                  from /usr/src/kernels/4.1.7-200.fc22.x86_64/include/uapi/linux/capability.h:16,
  384.                  from /usr/src/kernels/4.1.7-200.fc22.x86_64/include/linux/capability.h:15,
  385.                  from /usr/src/kernels/4.1.7-200.fc22.x86_64/include/linux/sched.h:15,
  386.                  from /usr/src/kernels/4.1.7-200.fc22.x86_64/include/linux/utsname.h:5,
  387.                  from /var/lib/dkms/nvidia/340.76/build/nv-linux.h:44,
  388.                  from /var/lib/dkms/nvidia/340.76/build/nv-mempool.c:15:
  389. /usr/src/kernels/4.1.7-200.fc22.x86_64/include/asm-generic/qrwlock.h: In function ‘queue_write_trylock’:
  390. /usr/src/kernels/4.1.7-200.fc22.x86_64/include/asm-generic/qrwlock.h:93:35: warning: comparison between signed and unsigned integer expressions [-Wsign-compare]
  391.           cnts, cnts | _QW_LOCKED) == cnts);
  392.                                    ^
  393. /usr/src/kernels/4.1.7-200.fc22.x86_64/include/linux/compiler.h:163:40: note: in definition of macro ‘likely’
  394.  # define likely(x) __builtin_expect(!!(x), 1)
  395.                                         ^
  396. In file included from /usr/src/kernels/4.1.7-200.fc22.x86_64/include/uapi/linux/stddef.h:1:0,
  397.                  from /usr/src/kernels/4.1.7-200.fc22.x86_64/include/linux/stddef.h:4,
  398.                  from /usr/src/kernels/4.1.7-200.fc22.x86_64/include/uapi/linux/posix_types.h:4,
  399.                  from /usr/src/kernels/4.1.7-200.fc22.x86_64/include/uapi/linux/types.h:13,
  400.                  from /usr/src/kernels/4.1.7-200.fc22.x86_64/include/linux/types.h:5,
  401.                  from /usr/src/kernels/4.1.7-200.fc22.x86_64/include/uapi/linux/capability.h:16,
  402.                  from /usr/src/kernels/4.1.7-200.fc22.x86_64/include/linux/capability.h:15,
  403.                  from /usr/src/kernels/4.1.7-200.fc22.x86_64/include/linux/sched.h:15,
  404.                  from /usr/src/kernels/4.1.7-200.fc22.x86_64/include/linux/utsname.h:5,
  405.                  from /var/lib/dkms/nvidia/340.76/build/nv-linux.h:44,
  406.                  from /var/lib/dkms/nvidia/340.76/build/nv-mempool.c:15:
  407. /usr/src/kernels/4.1.7-200.fc22.x86_64/arch/x86/include/asm/uaccess.h: In function ‘copy_from_user’:
  408. /usr/src/kernels/4.1.7-200.fc22.x86_64/arch/x86/include/asm/uaccess.h:712:26: warning: comparison between signed and unsigned integer expressions [-Wsign-compare]
  409.   if (likely(sz < 0 || sz >= n))
  410.                           ^
  411. /usr/src/kernels/4.1.7-200.fc22.x86_64/include/linux/compiler.h:163:40: note: in definition of macro ‘likely’
  412.  # define likely(x) __builtin_expect(!!(x), 1)
  413.                                         ^
  414. /usr/src/kernels/4.1.7-200.fc22.x86_64/arch/x86/include/asm/uaccess.h: In function ‘copy_to_user’:
  415. /usr/src/kernels/4.1.7-200.fc22.x86_64/arch/x86/include/asm/uaccess.h:730:26: warning: comparison between signed and unsigned integer expressions [-Wsign-compare]
  416.   if (likely(sz < 0 || sz >= n))
  417.                           ^
  418. /usr/src/kernels/4.1.7-200.fc22.x86_64/include/linux/compiler.h:163:40: note: in definition of macro ‘likely’
  419.  # define likely(x) __builtin_expect(!!(x), 1)
  420.                                         ^
  421.   if [ "-pg" = "-pg" ]; then if [ /var/lib/dkms/nvidia/340.76/build/nv-mempool.o != "scripts/mod/empty.o" ]; then ./scripts/recordmcount  "/var/lib/dkms/nvidia/340.76/build/nv-mempool.o"; fi; fi;
  422.   cc -Wp,-MD,/var/lib/dkms/nvidia/340.76/build/.nv-mmap.o.d  -nostdinc -isystem /usr/lib/gcc/x86_64-redhat-linux/5.1.1/include -I/usr/src/kernels/4.1.7-200.fc22.x86_64/arch/x86/include -Iarch/x86/include/generated/uapi -Iarch/x86/include/generated  -I/usr/src/kernels/4.1.7-200.fc22.x86_64/include -Iinclude -I/usr/src/kernels/4.1.7-200.fc22.x86_64/arch/x86/include/uapi -Iarch/x86/include/generated/uapi -I/usr/src/kernels/4.1.7-200.fc22.x86_64/include/uapi -Iinclude/generated/uapi -include /usr/src/kernels/4.1.7-200.fc22.x86_64/include/linux/kconfig.h   -I/var/lib/dkms/nvidia/340.76/build -D__KERNEL__ -Wall -Wundef -Wstrict-prototypes -Wno-trigraphs -fno-strict-aliasing -fno-common -Werror-implicit-function-declaration -Wno-format-security -std=gnu89 -m64 -mno-80387 -mno-fp-ret-in-387 -mtune=generic -mno-red-zone -mcmodel=kernel -funit-at-a-time -maccumulate-outgoing-args -DCONFIG_AS_CFI=1 -DCONFIG_AS_CFI_SIGNAL_FRAME=1 -DCONFIG_AS_CFI_SECTIONS=1 -DCONFIG_AS_FXSAVEQ=1 -DCONFIG_AS_SSSE3=1 -DCONFIG_AS_CRC32=1 -DCONFIG_AS_AVX=1 -DCONFIG_AS_AVX2=1 -pipe -Wno-sign-compare -fno-asynchronous-unwind-tables -mno-sse -mno-mmx -mno-sse2 -mno-3dnow -mno-avx -fno-delete-null-pointer-checks -O2 --param=allow-store-data-races=0 -Wframe-larger-than=2048 -fstack-protector-strong -Wno-unused-but-set-variable -fno-omit-frame-pointer -fno-optimize-sibling-calls -fvar-tracking-assignments -g -pg -mfentry -DCC_USING_FENTRY -Wdeclaration-after-statement -Wno-pointer-sign -fno-strict-overflow -fconserve-stack -Werror=implicit-int -Werror=strict-prototypes -Werror=date-time -DCC_HAVE_ASM_GOTO -DNV_MODULE_INSTANCE=0 -DNV_BUILD_MODULE_INSTANCES=0 -UDEBUG -U_DEBUG -DNDEBUG   -I/var/lib/dkms/nvidia/340.76/build -Wall -MD -Wsign-compare -Wno-cast-qual -Wno-error -D__KERNEL__ -DMODULE -DNVRM -DNV_VERSION_STRING=\"340.76\" -Wno-unused-function -Wuninitialized -fno-strict-aliasing -mno-red-zone -mcmodel=kernel -DNV_UVM_ENABLE -D__linux__ -DNV_DEV_NAME=\"nvidia\"  -DMODULE  -D"KBUILD_STR(s)=#s" -D"KBUILD_BASENAME=KBUILD_STR(nv_mmap)"  -D"KBUILD_MODNAME=KBUILD_STR(nvidia)" -c -o /var/lib/dkms/nvidia/340.76/build/nv-mmap.o /var/lib/dkms/nvidia/340.76/build/nv-mmap.c
  423. In file included from /usr/src/kernels/4.1.7-200.fc22.x86_64/include/uapi/linux/stddef.h:1:0,
  424.                  from /usr/src/kernels/4.1.7-200.fc22.x86_64/include/linux/stddef.h:4,
  425.                  from /usr/src/kernels/4.1.7-200.fc22.x86_64/include/uapi/linux/posix_types.h:4,
  426.                  from /usr/src/kernels/4.1.7-200.fc22.x86_64/include/uapi/linux/types.h:13,
  427.                  from /usr/src/kernels/4.1.7-200.fc22.x86_64/include/linux/types.h:5,
  428.                  from /usr/src/kernels/4.1.7-200.fc22.x86_64/include/uapi/linux/capability.h:16,
  429.                  from /usr/src/kernels/4.1.7-200.fc22.x86_64/include/linux/capability.h:15,
  430.                  from /usr/src/kernels/4.1.7-200.fc22.x86_64/include/linux/sched.h:15,
  431.                  from /usr/src/kernels/4.1.7-200.fc22.x86_64/include/linux/utsname.h:5,
  432.                  from /var/lib/dkms/nvidia/340.76/build/nv-linux.h:44,
  433.                  from /var/lib/dkms/nvidia/340.76/build/nv-mmap.c:15:
  434. /usr/src/kernels/4.1.7-200.fc22.x86_64/include/asm-generic/qrwlock.h: In function ‘queue_write_trylock’:
  435. /usr/src/kernels/4.1.7-200.fc22.x86_64/include/asm-generic/qrwlock.h:93:35: warning: comparison between signed and unsigned integer expressions [-Wsign-compare]
  436.           cnts, cnts | _QW_LOCKED) == cnts);
  437.                                    ^
  438. /usr/src/kernels/4.1.7-200.fc22.x86_64/include/linux/compiler.h:163:40: note: in definition of macro ‘likely’
  439.  # define likely(x) __builtin_expect(!!(x), 1)
  440.                                         ^
  441. In file included from /usr/src/kernels/4.1.7-200.fc22.x86_64/include/uapi/linux/stddef.h:1:0,
  442.                  from /usr/src/kernels/4.1.7-200.fc22.x86_64/include/linux/stddef.h:4,
  443.                  from /usr/src/kernels/4.1.7-200.fc22.x86_64/include/uapi/linux/posix_types.h:4,
  444.                  from /usr/src/kernels/4.1.7-200.fc22.x86_64/include/uapi/linux/types.h:13,
  445.                  from /usr/src/kernels/4.1.7-200.fc22.x86_64/include/linux/types.h:5,
  446.                  from /usr/src/kernels/4.1.7-200.fc22.x86_64/include/uapi/linux/capability.h:16,
  447.                  from /usr/src/kernels/4.1.7-200.fc22.x86_64/include/linux/capability.h:15,
  448.                  from /usr/src/kernels/4.1.7-200.fc22.x86_64/include/linux/sched.h:15,
  449.                  from /usr/src/kernels/4.1.7-200.fc22.x86_64/include/linux/utsname.h:5,
  450.                  from /var/lib/dkms/nvidia/340.76/build/nv-linux.h:44,
  451.                  from /var/lib/dkms/nvidia/340.76/build/nv-mmap.c:15:
  452. /usr/src/kernels/4.1.7-200.fc22.x86_64/arch/x86/include/asm/uaccess.h: In function ‘copy_from_user’:
  453. /usr/src/kernels/4.1.7-200.fc22.x86_64/arch/x86/include/asm/uaccess.h:712:26: warning: comparison between signed and unsigned integer expressions [-Wsign-compare]
  454.   if (likely(sz < 0 || sz >= n))
  455.                           ^
  456. /usr/src/kernels/4.1.7-200.fc22.x86_64/include/linux/compiler.h:163:40: note: in definition of macro ‘likely’
  457.  # define likely(x) __builtin_expect(!!(x), 1)
  458.                                         ^
  459. /usr/src/kernels/4.1.7-200.fc22.x86_64/arch/x86/include/asm/uaccess.h: In function ‘copy_to_user’:
  460. /usr/src/kernels/4.1.7-200.fc22.x86_64/arch/x86/include/asm/uaccess.h:730:26: warning: comparison between signed and unsigned integer expressions [-Wsign-compare]
  461.   if (likely(sz < 0 || sz >= n))
  462.                           ^
  463. /usr/src/kernels/4.1.7-200.fc22.x86_64/include/linux/compiler.h:163:40: note: in definition of macro ‘likely’
  464.  # define likely(x) __builtin_expect(!!(x), 1)
  465.                                         ^
  466.   if [ "-pg" = "-pg" ]; then if [ /var/lib/dkms/nvidia/340.76/build/nv-mmap.o != "scripts/mod/empty.o" ]; then ./scripts/recordmcount  "/var/lib/dkms/nvidia/340.76/build/nv-mmap.o"; fi; fi;
  467.   cc -Wp,-MD,/var/lib/dkms/nvidia/340.76/build/.nv-p2p.o.d  -nostdinc -isystem /usr/lib/gcc/x86_64-redhat-linux/5.1.1/include -I/usr/src/kernels/4.1.7-200.fc22.x86_64/arch/x86/include -Iarch/x86/include/generated/uapi -Iarch/x86/include/generated  -I/usr/src/kernels/4.1.7-200.fc22.x86_64/include -Iinclude -I/usr/src/kernels/4.1.7-200.fc22.x86_64/arch/x86/include/uapi -Iarch/x86/include/generated/uapi -I/usr/src/kernels/4.1.7-200.fc22.x86_64/include/uapi -Iinclude/generated/uapi -include /usr/src/kernels/4.1.7-200.fc22.x86_64/include/linux/kconfig.h   -I/var/lib/dkms/nvidia/340.76/build -D__KERNEL__ -Wall -Wundef -Wstrict-prototypes -Wno-trigraphs -fno-strict-aliasing -fno-common -Werror-implicit-function-declaration -Wno-format-security -std=gnu89 -m64 -mno-80387 -mno-fp-ret-in-387 -mtune=generic -mno-red-zone -mcmodel=kernel -funit-at-a-time -maccumulate-outgoing-args -DCONFIG_AS_CFI=1 -DCONFIG_AS_CFI_SIGNAL_FRAME=1 -DCONFIG_AS_CFI_SECTIONS=1 -DCONFIG_AS_FXSAVEQ=1 -DCONFIG_AS_SSSE3=1 -DCONFIG_AS_CRC32=1 -DCONFIG_AS_AVX=1 -DCONFIG_AS_AVX2=1 -pipe -Wno-sign-compare -fno-asynchronous-unwind-tables -mno-sse -mno-mmx -mno-sse2 -mno-3dnow -mno-avx -fno-delete-null-pointer-checks -O2 --param=allow-store-data-races=0 -Wframe-larger-than=2048 -fstack-protector-strong -Wno-unused-but-set-variable -fno-omit-frame-pointer -fno-optimize-sibling-calls -fvar-tracking-assignments -g -pg -mfentry -DCC_USING_FENTRY -Wdeclaration-after-statement -Wno-pointer-sign -fno-strict-overflow -fconserve-stack -Werror=implicit-int -Werror=strict-prototypes -Werror=date-time -DCC_HAVE_ASM_GOTO -DNV_MODULE_INSTANCE=0 -DNV_BUILD_MODULE_INSTANCES=0 -UDEBUG -U_DEBUG -DNDEBUG   -I/var/lib/dkms/nvidia/340.76/build -Wall -MD -Wsign-compare -Wno-cast-qual -Wno-error -D__KERNEL__ -DMODULE -DNVRM -DNV_VERSION_STRING=\"340.76\" -Wno-unused-function -Wuninitialized -fno-strict-aliasing -mno-red-zone -mcmodel=kernel -DNV_UVM_ENABLE -D__linux__ -DNV_DEV_NAME=\"nvidia\"  -DMODULE  -D"KBUILD_STR(s)=#s" -D"KBUILD_BASENAME=KBUILD_STR(nv_p2p)"  -D"KBUILD_MODNAME=KBUILD_STR(nvidia)" -c -o /var/lib/dkms/nvidia/340.76/build/nv-p2p.o /var/lib/dkms/nvidia/340.76/build/nv-p2p.c
  468. In file included from /usr/src/kernels/4.1.7-200.fc22.x86_64/include/uapi/linux/stddef.h:1:0,
  469.                  from /usr/src/kernels/4.1.7-200.fc22.x86_64/include/linux/stddef.h:4,
  470.                  from /usr/src/kernels/4.1.7-200.fc22.x86_64/include/uapi/linux/posix_types.h:4,
  471.                  from /usr/src/kernels/4.1.7-200.fc22.x86_64/include/uapi/linux/types.h:13,
  472.                  from /usr/src/kernels/4.1.7-200.fc22.x86_64/include/linux/types.h:5,
  473.                  from /usr/src/kernels/4.1.7-200.fc22.x86_64/include/uapi/linux/capability.h:16,
  474.                  from /usr/src/kernels/4.1.7-200.fc22.x86_64/include/linux/capability.h:15,
  475.                  from /usr/src/kernels/4.1.7-200.fc22.x86_64/include/linux/sched.h:15,
  476.                  from /usr/src/kernels/4.1.7-200.fc22.x86_64/include/linux/utsname.h:5,
  477.                  from /var/lib/dkms/nvidia/340.76/build/nv-linux.h:44,
  478.                  from /var/lib/dkms/nvidia/340.76/build/nv-p2p.c:15:
  479. /usr/src/kernels/4.1.7-200.fc22.x86_64/include/asm-generic/qrwlock.h: In function ‘queue_write_trylock’:
  480. /usr/src/kernels/4.1.7-200.fc22.x86_64/include/asm-generic/qrwlock.h:93:35: warning: comparison between signed and unsigned integer expressions [-Wsign-compare]
  481.           cnts, cnts | _QW_LOCKED) == cnts);
  482.                                    ^
  483. /usr/src/kernels/4.1.7-200.fc22.x86_64/include/linux/compiler.h:163:40: note: in definition of macro ‘likely’
  484.  # define likely(x) __builtin_expect(!!(x), 1)
  485.                                         ^
  486. In file included from /usr/src/kernels/4.1.7-200.fc22.x86_64/include/uapi/linux/stddef.h:1:0,
  487.                  from /usr/src/kernels/4.1.7-200.fc22.x86_64/include/linux/stddef.h:4,
  488.                  from /usr/src/kernels/4.1.7-200.fc22.x86_64/include/uapi/linux/posix_types.h:4,
  489.                  from /usr/src/kernels/4.1.7-200.fc22.x86_64/include/uapi/linux/types.h:13,
  490.                  from /usr/src/kernels/4.1.7-200.fc22.x86_64/include/linux/types.h:5,
  491.                  from /usr/src/kernels/4.1.7-200.fc22.x86_64/include/uapi/linux/capability.h:16,
  492.                  from /usr/src/kernels/4.1.7-200.fc22.x86_64/include/linux/capability.h:15,
  493.                  from /usr/src/kernels/4.1.7-200.fc22.x86_64/include/linux/sched.h:15,
  494.                  from /usr/src/kernels/4.1.7-200.fc22.x86_64/include/linux/utsname.h:5,
  495.                  from /var/lib/dkms/nvidia/340.76/build/nv-linux.h:44,
  496.                  from /var/lib/dkms/nvidia/340.76/build/nv-p2p.c:15:
  497. /usr/src/kernels/4.1.7-200.fc22.x86_64/arch/x86/include/asm/uaccess.h: In function ‘copy_from_user’:
  498. /usr/src/kernels/4.1.7-200.fc22.x86_64/arch/x86/include/asm/uaccess.h:712:26: warning: comparison between signed and unsigned integer expressions [-Wsign-compare]
  499.   if (likely(sz < 0 || sz >= n))
  500.                           ^
  501. /usr/src/kernels/4.1.7-200.fc22.x86_64/include/linux/compiler.h:163:40: note: in definition of macro ‘likely’
  502.  # define likely(x) __builtin_expect(!!(x), 1)
  503.                                         ^
  504. /usr/src/kernels/4.1.7-200.fc22.x86_64/arch/x86/include/asm/uaccess.h: In function ‘copy_to_user’:
  505. /usr/src/kernels/4.1.7-200.fc22.x86_64/arch/x86/include/asm/uaccess.h:730:26: warning: comparison between signed and unsigned integer expressions [-Wsign-compare]
  506.   if (likely(sz < 0 || sz >= n))
  507.                           ^
  508. /usr/src/kernels/4.1.7-200.fc22.x86_64/include/linux/compiler.h:163:40: note: in definition of macro ‘likely’
  509.  # define likely(x) __builtin_expect(!!(x), 1)
  510.                                         ^
  511.   if [ "-pg" = "-pg" ]; then if [ /var/lib/dkms/nvidia/340.76/build/nv-p2p.o != "scripts/mod/empty.o" ]; then ./scripts/recordmcount  "/var/lib/dkms/nvidia/340.76/build/nv-p2p.o"; fi; fi;
  512.   cc -Wp,-MD,/var/lib/dkms/nvidia/340.76/build/.nv-pat.o.d  -nostdinc -isystem /usr/lib/gcc/x86_64-redhat-linux/5.1.1/include -I/usr/src/kernels/4.1.7-200.fc22.x86_64/arch/x86/include -Iarch/x86/include/generated/uapi -Iarch/x86/include/generated  -I/usr/src/kernels/4.1.7-200.fc22.x86_64/include -Iinclude -I/usr/src/kernels/4.1.7-200.fc22.x86_64/arch/x86/include/uapi -Iarch/x86/include/generated/uapi -I/usr/src/kernels/4.1.7-200.fc22.x86_64/include/uapi -Iinclude/generated/uapi -include /usr/src/kernels/4.1.7-200.fc22.x86_64/include/linux/kconfig.h   -I/var/lib/dkms/nvidia/340.76/build -D__KERNEL__ -Wall -Wundef -Wstrict-prototypes -Wno-trigraphs -fno-strict-aliasing -fno-common -Werror-implicit-function-declaration -Wno-format-security -std=gnu89 -m64 -mno-80387 -mno-fp-ret-in-387 -mtune=generic -mno-red-zone -mcmodel=kernel -funit-at-a-time -maccumulate-outgoing-args -DCONFIG_AS_CFI=1 -DCONFIG_AS_CFI_SIGNAL_FRAME=1 -DCONFIG_AS_CFI_SECTIONS=1 -DCONFIG_AS_FXSAVEQ=1 -DCONFIG_AS_SSSE3=1 -DCONFIG_AS_CRC32=1 -DCONFIG_AS_AVX=1 -DCONFIG_AS_AVX2=1 -pipe -Wno-sign-compare -fno-asynchronous-unwind-tables -mno-sse -mno-mmx -mno-sse2 -mno-3dnow -mno-avx -fno-delete-null-pointer-checks -O2 --param=allow-store-data-races=0 -Wframe-larger-than=2048 -fstack-protector-strong -Wno-unused-but-set-variable -fno-omit-frame-pointer -fno-optimize-sibling-calls -fvar-tracking-assignments -g -pg -mfentry -DCC_USING_FENTRY -Wdeclaration-after-statement -Wno-pointer-sign -fno-strict-overflow -fconserve-stack -Werror=implicit-int -Werror=strict-prototypes -Werror=date-time -DCC_HAVE_ASM_GOTO -DNV_MODULE_INSTANCE=0 -DNV_BUILD_MODULE_INSTANCES=0 -UDEBUG -U_DEBUG -DNDEBUG   -I/var/lib/dkms/nvidia/340.76/build -Wall -MD -Wsign-compare -Wno-cast-qual -Wno-error -D__KERNEL__ -DMODULE -DNVRM -DNV_VERSION_STRING=\"340.76\" -Wno-unused-function -Wuninitialized -fno-strict-aliasing -mno-red-zone -mcmodel=kernel -DNV_UVM_ENABLE -D__linux__ -DNV_DEV_NAME=\"nvidia\"  -DMODULE  -D"KBUILD_STR(s)=#s" -D"KBUILD_BASENAME=KBUILD_STR(nv_pat)"  -D"KBUILD_MODNAME=KBUILD_STR(nvidia)" -c -o /var/lib/dkms/nvidia/340.76/build/nv-pat.o /var/lib/dkms/nvidia/340.76/build/nv-pat.c
  513. In file included from /usr/src/kernels/4.1.7-200.fc22.x86_64/include/uapi/linux/stddef.h:1:0,
  514.                  from /usr/src/kernels/4.1.7-200.fc22.x86_64/include/linux/stddef.h:4,
  515.                  from /usr/src/kernels/4.1.7-200.fc22.x86_64/include/uapi/linux/posix_types.h:4,
  516.                  from /usr/src/kernels/4.1.7-200.fc22.x86_64/include/uapi/linux/types.h:13,
  517.                  from /usr/src/kernels/4.1.7-200.fc22.x86_64/include/linux/types.h:5,
  518.                  from /usr/src/kernels/4.1.7-200.fc22.x86_64/include/uapi/linux/capability.h:16,
  519.                  from /usr/src/kernels/4.1.7-200.fc22.x86_64/include/linux/capability.h:15,
  520.                  from /usr/src/kernels/4.1.7-200.fc22.x86_64/include/linux/sched.h:15,
  521.                  from /usr/src/kernels/4.1.7-200.fc22.x86_64/include/linux/utsname.h:5,
  522.                  from /var/lib/dkms/nvidia/340.76/build/nv-linux.h:44,
  523.                  from /var/lib/dkms/nvidia/340.76/build/nv-pat.c:15:
  524. /usr/src/kernels/4.1.7-200.fc22.x86_64/include/asm-generic/qrwlock.h: In function ‘queue_write_trylock’:
  525. /usr/src/kernels/4.1.7-200.fc22.x86_64/include/asm-generic/qrwlock.h:93:35: warning: comparison between signed and unsigned integer expressions [-Wsign-compare]
  526.           cnts, cnts | _QW_LOCKED) == cnts);
  527.                                    ^
  528. /usr/src/kernels/4.1.7-200.fc22.x86_64/include/linux/compiler.h:163:40: note: in definition of macro ‘likely’
  529.  # define likely(x) __builtin_expect(!!(x), 1)
  530.                                         ^
  531. In file included from /usr/src/kernels/4.1.7-200.fc22.x86_64/include/uapi/linux/stddef.h:1:0,
  532.                  from /usr/src/kernels/4.1.7-200.fc22.x86_64/include/linux/stddef.h:4,
  533.                  from /usr/src/kernels/4.1.7-200.fc22.x86_64/include/uapi/linux/posix_types.h:4,
  534.                  from /usr/src/kernels/4.1.7-200.fc22.x86_64/include/uapi/linux/types.h:13,
  535.                  from /usr/src/kernels/4.1.7-200.fc22.x86_64/include/linux/types.h:5,
  536.                  from /usr/src/kernels/4.1.7-200.fc22.x86_64/include/uapi/linux/capability.h:16,
  537.                  from /usr/src/kernels/4.1.7-200.fc22.x86_64/include/linux/capability.h:15,
  538.                  from /usr/src/kernels/4.1.7-200.fc22.x86_64/include/linux/sched.h:15,
  539.                  from /usr/src/kernels/4.1.7-200.fc22.x86_64/include/linux/utsname.h:5,
  540.                  from /var/lib/dkms/nvidia/340.76/build/nv-linux.h:44,
  541.                  from /var/lib/dkms/nvidia/340.76/build/nv-pat.c:15:
  542. /usr/src/kernels/4.1.7-200.fc22.x86_64/arch/x86/include/asm/uaccess.h: In function ‘copy_from_user’:
  543. /usr/src/kernels/4.1.7-200.fc22.x86_64/arch/x86/include/asm/uaccess.h:712:26: warning: comparison between signed and unsigned integer expressions [-Wsign-compare]
  544.   if (likely(sz < 0 || sz >= n))
  545.                           ^
  546. /usr/src/kernels/4.1.7-200.fc22.x86_64/include/linux/compiler.h:163:40: note: in definition of macro ‘likely’
  547.  # define likely(x) __builtin_expect(!!(x), 1)
  548.                                         ^
  549. /usr/src/kernels/4.1.7-200.fc22.x86_64/arch/x86/include/asm/uaccess.h: In function ‘copy_to_user’:
  550. /usr/src/kernels/4.1.7-200.fc22.x86_64/arch/x86/include/asm/uaccess.h:730:26: warning: comparison between signed and unsigned integer expressions [-Wsign-compare]
  551.   if (likely(sz < 0 || sz >= n))
  552.                           ^
  553. /usr/src/kernels/4.1.7-200.fc22.x86_64/include/linux/compiler.h:163:40: note: in definition of macro ‘likely’
  554.  # define likely(x) __builtin_expect(!!(x), 1)
  555.                                         ^
  556. /var/lib/dkms/nvidia/340.76/build/nv-pat.c: In function ‘nv_disable_caches’:
  557. /var/lib/dkms/nvidia/340.76/build/nv-pat.c:38:12: error: implicit declaration of function ‘read_cr4’ [-Werror=implicit-function-declaration]
  558.      *cr4 = read_cr4();
  559.             ^
  560. /var/lib/dkms/nvidia/340.76/build/nv-pat.c:39:22: error: implicit declaration of function ‘write_cr4’ [-Werror=implicit-function-declaration]
  561.      if (*cr4 & 0x80) write_cr4(*cr4 & ~0x80);
  562.                       ^
  563. cc1: some warnings being treated as errors
  564. /usr/src/kernels/4.1.7-200.fc22.x86_64/scripts/Makefile.build:258: recipe for target '/var/lib/dkms/nvidia/340.76/build/nv-pat.o' failed
  565. make[3]: *** [/var/lib/dkms/nvidia/340.76/build/nv-pat.o] Error 1
  566. /usr/src/kernels/4.1.7-200.fc22.x86_64/Makefile:1388: recipe for target '_module_/var/lib/dkms/nvidia/340.76/build' failed
  567. make[2]: *** [_module_/var/lib/dkms/nvidia/340.76/build] Error 2
  568. make[2]: Leaving directory '/usr/src/kernels/4.1.7-200.fc22.x86_64'
  569. Makefile:146: recipe for target 'sub-make' failed
  570. make[1]: *** [sub-make] Error 2
  571. make[1]: Leaving directory '/usr/src/kernels/4.1.7-200.fc22.x86_64'
  572. NVIDIA: left KBUILD.
  573. nvidia.ko failed to build!
  574. Makefile:181: recipe for target 'nvidia.ko' failed
  575. make: *** [nvidia.ko] Error 1
  576. make: Entering directory '/var/lib/dkms/nvidia/340.76/build/uvm'
  577. cd ./..; make module SYSSRC=/lib/modules/4.1.7-200.fc22.x86_64/source SYSOUT=/lib/modules/4.1.7-200.fc22.x86_64/build KBUILD_EXTMOD=./..
  578. make[1]: Entering directory '/var/lib/dkms/nvidia/340.76/build'
  579. NVIDIA: calling KBUILD...
  580. make[2]: Entering directory '/usr/src/kernels/4.1.7-200.fc22.x86_64'
  581. make -C /lib/modules/4.1.7-200.fc22.x86_64/build KBUILD_SRC=/usr/src/kernels/4.1.7-200.fc22.x86_64 \
  582. -f /usr/src/kernels/4.1.7-200.fc22.x86_64/Makefile modules
  583. make[3]: Entering directory '/usr/src/kernels/4.1.7-200.fc22.x86_64'
  584. test -e include/generated/autoconf.h -a -e include/config/auto.conf || (                \
  585. echo >&2;                                                       \
  586. echo >&2 "  ERROR: Kernel configuration is invalid.";           \
  587. echo >&2 "         include/generated/autoconf.h or include/config/auto.conf are missing.";\
  588. echo >&2 "         Run 'make oldconfig && make prepare' on kernel src to fix it.";      \
  589. echo >&2 ;                                                      \
  590. /bin/false)
  591. mkdir -p ./../.tmp_versions ; rm -f ./../.tmp_versions/*
  592. make -f /usr/src/kernels/4.1.7-200.fc22.x86_64/scripts/Makefile.build obj=./..
  593. /usr/src/kernels/4.1.7-200.fc22.x86_64/scripts/Makefile.build:44: /usr/src/kernels/4.1.7-200.fc22.x86_64/./../Makefile: No such file or directory
  594. make[4]: *** No rule to make target '/usr/src/kernels/4.1.7-200.fc22.x86_64/./../Makefile'.  Stop.
  595. /usr/src/kernels/4.1.7-200.fc22.x86_64/Makefile:1388: recipe for target '_module_./..' failed
  596. make[3]: *** [_module_./..] Error 2
  597. make[3]: Leaving directory '/usr/src/kernels/4.1.7-200.fc22.x86_64'
  598. Makefile:146: recipe for target 'sub-make' failed
  599. make[2]: *** [sub-make] Error 2
  600. make[2]: Leaving directory '/usr/src/kernels/4.1.7-200.fc22.x86_64'
  601. NVIDIA: left KBUILD.
  602. nvidia.ko failed to build!
  603. Makefile:181: recipe for target 'nvidia.ko' failed
  604. make[1]: *** [nvidia.ko] Error 1
  605. make[1]: Leaving directory '/var/lib/dkms/nvidia/340.76/build'
  606. Makefile:219: recipe for target '../Module.symvers' failed
  607. make: *** [../Module.symvers] Error 2
  608. make: Leaving directory '/var/lib/dkms/nvidia/340.76/build/uvm'
RAW Paste Data
We use cookies for various purposes including analytics. By continuing to use Pastebin, you agree to our use of cookies as described in the Cookies Policy. OK, I Understand
 
Top