Guest User

Untitled

a guest
Mar 28th, 2020
93
Never
Not a member of Pastebin yet? Sign Up, it unlocks many cool features!
  1. PS C:\Users\runis\3D Objects\EndersMagic\mtl> ./gradlew buildRelease
  2. This mapping 'snapshot_20171003' was designed for MC 1.12! Use at your own peril.
  3. #################################################
  4. ForgeGradle 2.3-SNAPSHOT-6084129e
  5. https://github.com/MinecraftForge/ForgeGradle
  6. #################################################
  7. Powered by MCP
  8. http://modcoderpack.com
  9. by: Searge, ProfMobius, R4wk, ZeuX
  10. Fesh0r, IngisKahn, bspkrs, LexManos
  11. #################################################
  12. Found AccessTransformer: EM_at.cfg
  13. Version string '1.4.2b' does not match SemVer specification
  14. You should try SemVer : http://semver.org/
  15. :deobfCompileDummyTask
  16. :deobfProvidedDummyTask
  17. :sourceApiJava UP-TO-DATE
  18. :compileApiJava UP-TO-DATE
  19. :processApiResources UP-TO-DATE
  20. :apiClasses UP-TO-DATE
  21. :sourceMainJava UP-TO-DATE
  22. :compileJava
  23. Note: Some input files use or override a deprecated API.
  24. Note: Recompile with -Xlint:deprecation for details.
  25. Note: Some input files use unchecked or unsafe operations.
  26. Note: Recompile with -Xlint:unchecked for details.
  27. :processResources UP-TO-DATE
  28. :classes
  29. :jar UP-TO-DATE
  30. :sourceTestJava UP-TO-DATE
  31. :compileTestJava UP-TO-DATE
  32. :processTestResources UP-TO-DATE
  33. :testClasses UP-TO-DATE
  34. :test UP-TO-DATE
  35. :extractMcpData SKIPPED
  36. :extractMcpMappings SKIPPED
  37. :getVersionJson
  38. :extractUserdev UP-TO-DATE
  39. :genSrgs SKIPPED
  40. :reobfJar FAILED
  41. :extractAnnotationsJar
  42. Error while building FML annotations cache: duplicate entry: assets/endmagic/advancements/recipes/building_blocks/block_master_dark_portal.json
  43. java.util.zip.ZipException: duplicate entry: assets/endmagic/advancements/recipes/building_blocks/block_master_dark_portal.json
  44. at java.util.zip.ZipOutputStream.putNextEntry(ZipOutputStream.java:232)
  45. at net.minecraftforge.gradle.user.TaskExtractAnnotations.processJar(TaskExtractAnnotations.java:96)
  46. at net.minecraftforge.gradle.user.TaskExtractAnnotations.doTask(TaskExtractAnnotations.java:69)
  47. at sun.reflect.NativeMethodAccessorImpl.invoke0(Native Method)
  48. at sun.reflect.NativeMethodAccessorImpl.invoke(NativeMethodAccessorImpl.java:62)
  49. at sun.reflect.DelegatingMethodAccessorImpl.invoke(DelegatingMethodAccessorImpl.java:43)
  50. at java.lang.reflect.Method.invoke(Method.java:498)
  51. at org.gradle.internal.reflect.JavaMethod.invoke(JavaMethod.java:75)
  52. at org.gradle.api.internal.project.taskfactory.AnnotationProcessingTaskFactory$StandardTaskAction.doExecute(AnnotationProcessingTaskFactory.java:228)
  53. at org.gradle.api.internal.project.taskfactory.AnnotationProcessingTaskFactory$StandardTaskAction.execute(AnnotationProcessingTaskFactory.java:221)
  54. at org.gradle.api.internal.project.taskfactory.AnnotationProcessingTaskFactory$StandardTaskAction.execute(AnnotationProcessingTaskFactory.java:210)
  55. at org.gradle.api.internal.AbstractTask$TaskActionWrapper.execute(AbstractTask.java:621)
  56. at org.gradle.api.internal.AbstractTask$TaskActionWrapper.execute(AbstractTask.java:604)
  57. at org.gradle.api.internal.tasks.execution.ExecuteActionsTaskExecuter.executeAction(ExecuteActionsTaskExecuter.java:80)
  58. at org.gradle.api.internal.tasks.execution.ExecuteActionsTaskExecuter.executeActions(ExecuteActionsTaskExecuter.java:61)
  59. at org.gradle.api.internal.tasks.execution.ExecuteActionsTaskExecuter.execute(ExecuteActionsTaskExecuter.java:46)
  60. at org.gradle.api.internal.tasks.execution.PostExecutionAnalysisTaskExecuter.execute(PostExecutionAnalysisTaskExecuter.java:35)
  61. at org.gradle.api.internal.tasks.execution.SkipUpToDateTaskExecuter.execute(SkipUpToDateTaskExecuter.java:66)
  62. at org.gradle.api.internal.tasks.execution.ValidatingTaskExecuter.execute(ValidatingTaskExecuter.java:58)
  63. at org.gradle.api.internal.tasks.execution.SkipEmptySourceFilesTaskExecuter.execute(SkipEmptySourceFilesTaskExecuter.java:52)
  64. at org.gradle.api.internal.tasks.execution.SkipTaskWithNoActionsExecuter.execute(SkipTaskWithNoActionsExecuter.java:52)
  65. at org.gradle.api.internal.tasks.execution.SkipOnlyIfTaskExecuter.execute(SkipOnlyIfTaskExecuter.java:53)
  66. at org.gradle.api.internal.tasks.execution.ExecuteAtMostOnceTaskExecuter.execute(ExecuteAtMostOnceTaskExecuter.java:43)
  67. at org.gradle.execution.taskgraph.DefaultTaskGraphExecuter$EventFiringTaskWorker.execute(DefaultTaskGraphExecuter.java:203)
  68. at org.gradle.execution.taskgraph.DefaultTaskGraphExecuter$EventFiringTaskWorker.execute(DefaultTaskGraphExecuter.java:185)
  69. at org.gradle.execution.taskgraph.AbstractTaskPlanExecutor$TaskExecutorWorker.processTask(AbstractTaskPlanExecutor.java:66)
  70. at org.gradle.execution.taskgraph.AbstractTaskPlanExecutor$TaskExecutorWorker.run(AbstractTaskPlanExecutor.java:50)
  71. at org.gradle.execution.taskgraph.DefaultTaskPlanExecutor.process(DefaultTaskPlanExecutor.java:25)
  72. at org.gradle.execution.taskgraph.DefaultTaskGraphExecuter.execute(DefaultTaskGraphExecuter.java:110)
  73. at org.gradle.execution.SelectedTaskExecutionAction.execute(SelectedTaskExecutionAction.java:37)
  74. at org.gradle.execution.DefaultBuildExecuter.execute(DefaultBuildExecuter.java:37)
  75. at org.gradle.execution.DefaultBuildExecuter.access$000(DefaultBuildExecuter.java:23)
  76. at org.gradle.execution.DefaultBuildExecuter$1.proceed(DefaultBuildExecuter.java:43)
  77. at org.gradle.execution.DryRunBuildExecutionAction.execute(DryRunBuildExecutionAction.java:32)
  78. at org.gradle.execution.DefaultBuildExecuter.execute(DefaultBuildExecuter.java:37)
  79. at org.gradle.execution.DefaultBuildExecuter.execute(DefaultBuildExecuter.java:30)
  80. at org.gradle.initialization.DefaultGradleLauncher$4.run(DefaultGradleLauncher.java:153)
  81. at org.gradle.internal.Factories$1.create(Factories.java:22)
  82. at org.gradle.internal.progress.DefaultBuildOperationExecutor.run(DefaultBuildOperationExecutor.java:91)
  83. at org.gradle.internal.progress.DefaultBuildOperationExecutor.run(DefaultBuildOperationExecutor.java:53)
  84. at org.gradle.initialization.DefaultGradleLauncher.doBuildStages(DefaultGradleLauncher.java:150)
  85. at org.gradle.initialization.DefaultGradleLauncher.access$200(DefaultGradleLauncher.java:32)
  86. at org.gradle.initialization.DefaultGradleLauncher$1.create(DefaultGradleLauncher.java:98)
  87. at org.gradle.initialization.DefaultGradleLauncher$1.create(DefaultGradleLauncher.java:92)
  88. at org.gradle.internal.progress.DefaultBuildOperationExecutor.run(DefaultBuildOperationExecutor.java:91)
  89. at org.gradle.internal.progress.DefaultBuildOperationExecutor.run(DefaultBuildOperationExecutor.java:63)
  90. at org.gradle.initialization.DefaultGradleLauncher.doBuild(DefaultGradleLauncher.java:92)
  91. at org.gradle.initialization.DefaultGradleLauncher.run(DefaultGradleLauncher.java:83)
  92. at org.gradle.launcher.exec.InProcessBuildActionExecuter$DefaultBuildController.run(InProcessBuildActionExecuter.java:99)
  93. at org.gradle.tooling.internal.provider.ExecuteBuildActionRunner.run(ExecuteBuildActionRunner.java:28)
  94. at org.gradle.launcher.exec.ChainingBuildActionRunner.run(ChainingBuildActionRunner.java:35)
  95. at org.gradle.launcher.exec.InProcessBuildActionExecuter.execute(InProcessBuildActionExecuter.java:48)
  96. at org.gradle.launcher.exec.InProcessBuildActionExecuter.execute(InProcessBuildActionExecuter.java:30)
  97. at org.gradle.launcher.exec.ContinuousBuildActionExecuter.execute(ContinuousBuildActionExecuter.java:81)
  98. at org.gradle.launcher.exec.ContinuousBuildActionExecuter.execute(ContinuousBuildActionExecuter.java:46)
  99. at org.gradle.launcher.exec.DaemonUsageSuggestingBuildActionExecuter.execute(DaemonUsageSuggestingBuildActionExecuter.java:51)
  100. at org.gradle.launcher.exec.DaemonUsageSuggestingBuildActionExecuter.execute(DaemonUsageSuggestingBuildActionExecuter.java:28)
  101. at org.gradle.launcher.cli.RunBuildAction.run(RunBuildAction.java:43)
  102. at org.gradle.internal.Actions$RunnableActionAdapter.execute(Actions.java:173)
  103. at org.gradle.launcher.cli.CommandLineActionFactory$ParseAndBuildAction.execute(CommandLineActionFactory.java:239)
  104. at org.gradle.launcher.cli.CommandLineActionFactory$ParseAndBuildAction.execute(CommandLineActionFactory.java:212)
  105. at org.gradle.launcher.cli.JavaRuntimeValidationAction.execute(JavaRuntimeValidationAction.java:35)
  106. at org.gradle.launcher.cli.JavaRuntimeValidationAction.execute(JavaRuntimeValidationAction.java:24)
  107. at org.gradle.launcher.cli.ExceptionReportingAction.execute(ExceptionReportingAction.java:33)
  108. at org.gradle.launcher.cli.ExceptionReportingAction.execute(ExceptionReportingAction.java:22)
  109. at org.gradle.launcher.cli.CommandLineActionFactory$WithLogging.execute(CommandLineActionFactory.java:205)
  110. at org.gradle.launcher.cli.CommandLineActionFactory$WithLogging.execute(CommandLineActionFactory.java:169)
  111. at org.gradle.launcher.Main.doAction(Main.java:33)
  112. at org.gradle.launcher.bootstrap.EntryPoint.run(EntryPoint.java:45)
  113. at sun.reflect.NativeMethodAccessorImpl.invoke0(Native Method)
  114. at sun.reflect.NativeMethodAccessorImpl.invoke(NativeMethodAccessorImpl.java:62)
  115. at sun.reflect.DelegatingMethodAccessorImpl.invoke(DelegatingMethodAccessorImpl.java:43)
  116. at java.lang.reflect.Method.invoke(Method.java:498)
  117. at org.gradle.launcher.bootstrap.ProcessBootstrap.runNoExit(ProcessBootstrap.java:55)
  118. at org.gradle.launcher.bootstrap.ProcessBootstrap.run(ProcessBootstrap.java:36)
  119. at org.gradle.launcher.GradleMain.main(GradleMain.java:23)
  120. at sun.reflect.NativeMethodAccessorImpl.invoke0(Native Method)
  121. at sun.reflect.NativeMethodAccessorImpl.invoke(NativeMethodAccessorImpl.java:62)
  122. at sun.reflect.DelegatingMethodAccessorImpl.invoke(DelegatingMethodAccessorImpl.java:43)
  123. at java.lang.reflect.Method.invoke(Method.java:498)
  124. at org.gradle.wrapper.BootstrapMainStarter.start(BootstrapMainStarter.java:30)
  125. at org.gradle.wrapper.WrapperExecutor.execute(WrapperExecutor.java:127)
  126. at org.gradle.wrapper.GradleWrapperMain.main(GradleWrapperMain.java:61)
  127.  
  128. FAILURE: Build failed with an exception.
  129.  
  130. * What went wrong:
  131. Execution failed for task ':reobfJar'.
  132. > java.util.zip.ZipException: duplicate entry: assets/endmagic/advancements/recipes/building_blocks/block_master_dark_portal.json
  133.  
  134. * Try:
  135. Run with --stacktrace option to get the stack trace. Run with --info or --debug option to get more log output.
  136.  
  137. BUILD FAILED
  138.  
  139. Total time: 10.023 secs
RAW Paste Data