Guest User

Untitled

a guest
Aug 18th, 2020
59
Never
Not a member of Pastebin yet? Sign Up, it unlocks many cool features!
  1. CC lib/arm_support/support-arm.S
  2. PP boot.link
  3. CONVBDF fonts/08-Schumacher-Clean.bdf
  4. CC build_BL_e200v1/apps/bitmaps/mono/default_icons.c
  5. CC build_BL_e200v1/apps/bitmaps/native/rockboxlogo.176x54x16.c
  6. CC bootloader/main-pp.c
  7. CC firmware/powermgmt.c
  8. CC firmware/panic.c
  9. /home/ubuntu/Desktop/rockbox/bootloader/main-pp.c: In function ‘load_mi4_part’:
  10. /home/ubuntu/Desktop/rockbox/bootloader/main-pp.c:135: warning: passing argument 3 of ‘storage_read_sectors’ makes integer from pointer without a cast
  11. /home/ubuntu/Desktop/rockbox/firmware/export/storage.h:310: note: expected ‘int’ but argument is of type ‘struct ppmi_header_t *’
  12. /home/ubuntu/Desktop/rockbox/bootloader/main-pp.c:135: error: too few arguments to function ‘storage_read_sectors’
  13. /home/ubuntu/Desktop/rockbox/bootloader/main-pp.c:145: warning: passing argument 3 of ‘storage_read_sectors’ makes integer from pointer without a cast
  14. /home/ubuntu/Desktop/rockbox/firmware/export/storage.h:310: note: expected ‘int’ but argument is of type ‘struct mi4header_t *’
  15. /home/ubuntu/Desktop/rockbox/bootloader/main-pp.c:145: error: too few arguments to function ‘storage_read_sectors’
  16. /home/ubuntu/Desktop/rockbox/bootloader/main-pp.c:169: warning: passing argument 3 of ‘storage_read_sectors’ makes integer from pointer without a cast
  17. /home/ubuntu/Desktop/rockbox/firmware/export/storage.h:310: note: expected ‘int’ but argument is of type ‘unsigned char *’
  18. /home/ubuntu/Desktop/rockbox/bootloader/main-pp.c:169: error: too few arguments to function ‘storage_read_sectors’
  19. /home/ubuntu/Desktop/rockbox/bootloader/main-pp.c:186: warning: passing argument 3 of ‘storage_read_sectors’ makes integer from pointer without a cast
  20. /home/ubuntu/Desktop/rockbox/firmware/export/storage.h:310: note: expected ‘int’ but argument is of type ‘char *’
  21. /home/ubuntu/Desktop/rockbox/bootloader/main-pp.c:186: error: too few arguments to function ‘storage_read_sectors’
  22. /home/ubuntu/Desktop/rockbox/bootloader/main-pp.c:188: warning: passing argument 3 of ‘storage_write_sectors’ makes integer from pointer without a cast
  23. /home/ubuntu/Desktop/rockbox/firmware/export/storage.h:311: note: expected ‘int’ but argument is of type ‘char *’
  24. /home/ubuntu/Desktop/rockbox/bootloader/main-pp.c:188: error: too few arguments to function ‘storage_write_sectors’
  25. make: *** [/home/ubuntu/Desktop/rockbox/build_BL_e200v1/bootloader/main-pp.o] Error 1
  26. make: *** Waiting for unfinished jobs....
  27.  
RAW Paste Data

Adblocker detected! Please consider disabling it...

We've detected AdBlock Plus or some other adblocking software preventing Pastebin.com from fully loading.

We don't have any obnoxious sound, or popup ads, we actively block these annoying types of ads!

Please add Pastebin.com to your ad blocker whitelist or disable your adblocking software.

×