SHARE
TWEET

Untitled

a guest Aug 13th, 2017 53 Never
Not a member of Pastebin yet? Sign Up, it unlocks many cool features!
  1. Temporary bus daemon is unix:abstract=/tmp/dbus-DDGXtjjWaI,guid=0567afd849907b3a91d0ba1200000ae9
  2. Temporary bus daemon PID is 9639
  3. ********* Start testing of TestConnIntrospectCornercases *********
  4. Config: Using QTest library 4.7.2, Qt 4.7.2
  5. PASS   : TestConnIntrospectCornercases::initTestCase()
  6. (conn-introspect-cornercases:9644): tp-glib/connection-DEBUG: tp_base_connection_class_init: Initializing (TpBaseConnectionClass *)0xcc1c90
  7. (conn-introspect-cornercases:9644): tp-glib/connection-DEBUG: tp_base_connection_init: Initializing (TpBaseConnection *)0xcd0010
  8. (conn-introspect-cornercases:9644): tp-glib/connection-DEBUG: tp_base_connection_constructor: Post-construction: (TpBaseConnection *)0xcd0010
  9. (conn-introspect-cornercases:9644): tp-glib/connection-DEBUG: tp_base_connection_constructor: Handle repo for type #0 at (nil)
  10. (conn-introspect-cornercases:9644): tp-glib/connection-DEBUG: tp_base_connection_constructor: Handle repo for type #1 at 0xc9c720
  11. (conn-introspect-cornercases:9644): tp-glib/connection-DEBUG: tp_base_connection_constructor: Handle repo for type #2 at 0xcd4000
  12. (conn-introspect-cornercases:9644): tp-glib/connection-DEBUG: tp_base_connection_constructor: Handle repo for type #3 at (nil)
  13. (conn-introspect-cornercases:9644): tp-glib/connection-DEBUG: tp_base_connection_constructor: Handle repo for type #4 at (nil)
  14. (conn-introspect-cornercases:9644): tp-glib/connection-DEBUG: tp_base_connection_register: bus name org.freedesktop.Telepathy.Connection.simple.simple.me_40example_2ecom
  15. (conn-introspect-cornercases:9644): tp-glib/connection-DEBUG: tp_base_connection_register: object path /org/freedesktop/Telepathy/Connection/simple/simple/me_40example_2ecom
  16. QDEBUG : TestConnIntrospectCornercases::testSelfHandleChangeBeforeConnecting() tp-qt4 0.5.15.1 DEBUG: Creating new DBusProxy
  17. QDEBUG : TestConnIntrospectCornercases::testSelfHandleChangeBeforeConnecting() tp-qt4 0.5.15.1 DEBUG: Connecting to ConnectionError()
  18. QDEBUG : TestConnIntrospectCornercases::testSelfHandleChangeBeforeConnecting() tp-qt4 0.5.15.1 DEBUG: Connecting to StatusChanged()
  19. QDEBUG : TestConnIntrospectCornercases::testSelfHandleChangeBeforeConnecting() tp-qt4 0.5.15.1 DEBUG: Connecting to SelfHandleChanged()
  20. QDEBUG : TestConnIntrospectCornercases::testSelfHandleChangeBeforeConnecting() tp-qt4 0.5.15.1 DEBUG: Creating new HandleContext for "/org/freedesktop/Telepathy/Connection/simple/simple/me_40example_2ecom"
  21. QDEBUG : TestConnIntrospectCornercases::testSelfHandleChangeBeforeConnecting() tp-qt4 0.5.15.1 DEBUG: ReadinessHelper: new supportedStatuses = QSet(0, 4294967295, 1, 2)
  22. QDEBUG : TestConnIntrospectCornercases::testSelfHandleChangeBeforeConnecting() tp-qt4 0.5.15.1 DEBUG: ReadinessHelper: new supportedFeatures = QSet(QPair("Tp::Connection",6) ,  QPair("Tp::Connection",5) ,  QPair("Tp::Connection",4) ,  QPair("Tp::Connection",2) ,  QPair("Tp::Connection",1) ,  QPair("Tp::Connection",0) ,  QPair("Tp::Connection",7) )  
  23. (conn-introspect-cornercases:9644): tp-glib/connection-DEBUG: tp_base_connection_change_status: was 4294967295, now 1, for reason 1
  24. (conn-introspect-cornercases:9644): tp-glib/connection-DEBUG: tp_base_connection_change_status: emitting status-changed to 1, for reason 1
  25. QDEBUG : TestConnIntrospectCornercases::testSelfHandleChangeBeforeConnecting() tp-qt4 0.5.15.1 DEBUG: Calling Properties::GetAll(Connection)
  26. QDEBUG : TestConnIntrospectCornercases::testSelfHandleChangeBeforeConnecting() tp-qt4 0.5.15.1 DEBUG: Got a self handle change before we have the initial self handle, ignoring
  27. QDEBUG : TestConnIntrospectCornercases::testSelfHandleChangeBeforeConnecting() tp-qt4 0.5.15.1 DEBUG: StatusChanged from 4294967295 to 1 with reason 1
  28. QDEBUG : TestConnIntrospectCornercases::testSelfHandleChangeBeforeConnecting() tp-qt4 0.5.15.1 DEBUG: status changed while introspection process was running
  29. QDEBUG : TestConnIntrospectCornercases::testSelfHandleChangeBeforeConnecting() tp-qt4 0.5.15.1 DEBUG: Got interfaces: ("org.freedesktop.Telepathy.Connection.Interface.Requests")
  30. QDEBUG : TestConnIntrospectCornercases::testSelfHandleChangeBeforeConnecting() tp-qt4 0.5.15.1 DEBUG: Retrieving capabilities
  31. QDEBUG : TestConnIntrospectCornercases::testSelfHandleChangeBeforeConnecting() tp-qt4 0.5.15.1 DEBUG: Got capabilities
  32. QDEBUG : TestConnIntrospectCornercases::testSelfHandleChangeBeforeConnecting() tp-qt4 0.5.15.1 DEBUG: ReadinessHelper::setIntrospectCompleted: feature: QPair("Tp::Connection",0) - success: true
  33. QDEBUG : TestConnIntrospectCornercases::testSelfHandleChangeBeforeConnecting() tp-qt4 0.5.15.1 DEBUG: ReadinessHelper::setIntrospectCompleted called while there is a pending status change - ignoring
  34. QDEBUG : TestConnIntrospectCornercases::testSelfHandleChangeBeforeConnecting() tp-qt4 0.5.15.1 DEBUG: ReadinessHelper::setIntrospectCompleted: feature: QPair("Tp::Connection",0) - success: true
  35. (conn-introspect-cornercases:9644): tp-glib/connection-DEBUG: tp_base_connection_change_status: was 1, now 0, for reason 1
  36. (conn-introspect-cornercases:9644): tp-glib/connection-DEBUG: tp_base_connection_change_status: emitting status-changed to 0, for reason 1
  37. QDEBUG : TestConnIntrospectCornercases::testSelfHandleChangeBeforeConnecting() tp-qt4 0.5.15.1 DEBUG: ReadinessHelper::setIntrospectCompleted: feature: QPair("Tp::Connection",1) - success: true
  38. QDEBUG : TestConnIntrospectCornercases::testSelfHandleChangeBeforeConnecting() tp-qt4 0.5.15.1 DEBUG: Got a self handle change before we have the initial self handle, ignoring
  39. QDEBUG : TestConnIntrospectCornercases::testSelfHandleChangeBeforeConnecting() tp-qt4 0.5.15.1 DEBUG: StatusChanged from 1 to 0 with reason 1
  40. QDEBUG : TestConnIntrospectCornercases::testSelfHandleChangeBeforeConnecting() tp-qt4 0.5.15.1 DEBUG: Performing introspection for the Connected status
  41. QDEBUG : TestConnIntrospectCornercases::testSelfHandleChangeBeforeConnecting() tp-qt4 0.5.15.1 DEBUG: Calling Properties::GetAll(Connection)
  42. FAIL!  : TestConnIntrospectCornercases::testSelfHandleChangeBeforeConnecting() Compared values are not the same
  43.    Actual (mConn->isReady(Connection::FeatureCore)): 0
  44.    Expected (true): 1
  45.    Loc: [/home/andrunko/work/telepathy/telepathy-qt4/tests/dbus/conn-introspect-cornercases.cpp(168)]
  46. (conn-introspect-cornercases:9644): tp-glib/connection-DEBUG: tp_base_connection_change_status: was 0, now 2, for reason 1
  47. (conn-introspect-cornercases:9644): tp-glib/connection-DEBUG: tp_base_connection_change_status: emitting status-changed to 2, for reason 1
  48. QDEBUG : TestConnIntrospectCornercases::testSelfHandleChangeBeforeConnecting() tp-qt4 0.5.15.1 DEBUG: StatusChanged from 0 to 2 with reason 1
  49. QDEBUG : TestConnIntrospectCornercases::testSelfHandleChangeBeforeConnecting() tp-qt4 0.5.15.1 DEBUG: proxy invalidated: "org.freedesktop.Telepathy.Error.Cancelled": "ConnectionStatusReason = 1"
  50. QDEBUG : TestConnIntrospectCornercases::testSelfHandleChangeBeforeConnecting() conn invalidated
  51. QWARN  : TestConnIntrospectCornercases::testSelfHandleChangeBeforeConnecting() tp-qt4 0.5.15.1 WARN: Properties::GetAll(Connection) failed with "org.freedesktop.DBus.Error.UnknownMethod": "Method "GetAll" with signature "s" on interface "org.freedesktop.DBus.Properties" doesn't exist
  52. "
  53. QDEBUG : TestConnIntrospectCornercases::testSelfHandleChangeBeforeConnecting() tp-qt4 0.5.15.1 DEBUG: Tp::Connection(0xccbc30) stopping main introspection, as it has been invalidated
  54. (conn-introspect-cornercases:9644): tp-glib/proxy-DEBUG: tp_proxy_dispose: 0xcd3010
  55. (conn-introspect-cornercases:9644): tp-glib/proxy-DEBUG: tp_proxy_invalidate: 0xcd3010: Proxy unreferenced
  56. (conn-introspect-cornercases:9644): tp-glib/proxy-DEBUG: tp_proxy_finalize: 0xcd3010
  57. (conn-introspect-cornercases:9644): tp-glib/connection-DEBUG: tp_base_connection_init: Initializing (TpBaseConnection *)0xcd0120
  58. (conn-introspect-cornercases:9644): tp-glib/connection-DEBUG: tp_base_connection_constructor: Post-construction: (TpBaseConnection *)0xcd0120
  59. (conn-introspect-cornercases:9644): tp-glib/connection-DEBUG: tp_base_connection_constructor: Handle repo for type #0 at (nil)
  60. (conn-introspect-cornercases:9644): tp-glib/connection-DEBUG: tp_base_connection_constructor: Handle repo for type #1 at 0xcd4320
  61. (conn-introspect-cornercases:9644): tp-glib/connection-DEBUG: tp_base_connection_constructor: Handle repo for type #2 at 0xcd4400
  62. (conn-introspect-cornercases:9644): tp-glib/connection-DEBUG: tp_base_connection_constructor: Handle repo for type #3 at (nil)
  63. (conn-introspect-cornercases:9644): tp-glib/connection-DEBUG: tp_base_connection_constructor: Handle repo for type #4 at (nil)
  64. (conn-introspect-cornercases:9644): tp-glib/connection-DEBUG: tp_base_connection_register: bus name org.freedesktop.Telepathy.Connection.simple.simple.me_40example_2ecom
  65. (conn-introspect-cornercases:9644): tp-glib/connection-DEBUG: tp_base_connection_register: object path /org/freedesktop/Telepathy/Connection/simple/simple/me_40example_2ecom
  66. QDEBUG : TestConnIntrospectCornercases::testSelfHandleChangeWhileBuilding() tp-qt4 0.5.15.1 DEBUG: Creating new DBusProxy
  67. QDEBUG : TestConnIntrospectCornercases::testSelfHandleChangeWhileBuilding() tp-qt4 0.5.15.1 DEBUG: Connecting to ConnectionError()
  68. QDEBUG : TestConnIntrospectCornercases::testSelfHandleChangeWhileBuilding() tp-qt4 0.5.15.1 DEBUG: Connecting to StatusChanged()
  69. QDEBUG : TestConnIntrospectCornercases::testSelfHandleChangeWhileBuilding() tp-qt4 0.5.15.1 DEBUG: Connecting to SelfHandleChanged()
  70. QDEBUG : TestConnIntrospectCornercases::testSelfHandleChangeWhileBuilding() tp-qt4 0.5.15.1 DEBUG: Creating new HandleContext for "/org/freedesktop/Telepathy/Connection/simple/simple/me_40example_2ecom"
  71. QDEBUG : TestConnIntrospectCornercases::testSelfHandleChangeWhileBuilding() tp-qt4 0.5.15.1 DEBUG: ReadinessHelper: new supportedStatuses = QSet(0, 4294967295, 1, 2)
  72. QDEBUG : TestConnIntrospectCornercases::testSelfHandleChangeWhileBuilding() tp-qt4 0.5.15.1 DEBUG: ReadinessHelper: new supportedFeatures = QSet(QPair("Tp::Connection",6) ,  QPair("Tp::Connection",5) ,  QPair("Tp::Connection",4) ,  QPair("Tp::Connection",2) ,  QPair("Tp::Connection",1) ,  QPair("Tp::Connection",0) ,  QPair("Tp::Connection",7) )  
  73. (conn-introspect-cornercases:9644): tp-glib/connection-DEBUG: tp_base_connection_change_status: was 4294967295, now 1, for reason 1
  74. (conn-introspect-cornercases:9644): tp-glib/connection-DEBUG: tp_base_connection_change_status: emitting status-changed to 1, for reason 1
  75. (conn-introspect-cornercases:9644): tp-glib/connection-DEBUG: tp_base_connection_change_status: was 1, now 0, for reason 1
  76. (conn-introspect-cornercases:9644): tp-glib/connection-DEBUG: tp_base_connection_change_status: emitting status-changed to 0, for reason 1
  77. QDEBUG : TestConnIntrospectCornercases::testSelfHandleChangeWhileBuilding() tp-qt4 0.5.15.1 DEBUG: StatusChanged from 4294967295 to 1 with reason 1
  78. QDEBUG : TestConnIntrospectCornercases::testSelfHandleChangeWhileBuilding() tp-qt4 0.5.15.1 DEBUG: StatusChanged from 1 to 0 with reason 1
  79. QDEBUG : TestConnIntrospectCornercases::testSelfHandleChangeWhileBuilding() tp-qt4 0.5.15.1 DEBUG: Performing introspection for the Connected status
  80. QDEBUG : TestConnIntrospectCornercases::testSelfHandleChangeWhileBuilding() tp-qt4 0.5.15.1 DEBUG: Calling Properties::GetAll(Connection)
  81. QDEBUG : TestConnIntrospectCornercases::testSelfHandleChangeWhileBuilding() tp-qt4 0.5.15.1 DEBUG: Got interfaces: ("org.freedesktop.Telepathy.Connection.Interface.Requests")
  82. QDEBUG : TestConnIntrospectCornercases::testSelfHandleChangeWhileBuilding() tp-qt4 0.5.15.1 DEBUG: Retrieving capabilities
  83. QDEBUG : TestConnIntrospectCornercases::testSelfHandleChangeWhileBuilding() tp-qt4 0.5.15.1 DEBUG: Got capabilities
  84. QDEBUG : TestConnIntrospectCornercases::testSelfHandleChangeWhileBuilding() tp-qt4 0.5.15.1 DEBUG: ReadinessHelper::setIntrospectCompleted: feature: QPair("Tp::Connection",0) - success: true
  85. QDEBUG : TestConnIntrospectCornercases::testSelfHandleChangeWhileBuilding() tp-qt4 0.5.15.1 DEBUG: Connected
  86. QDEBUG : TestConnIntrospectCornercases::testSelfHandleChangeWhileBuilding() tp-qt4 0.5.15.1 DEBUG: Building self contact
  87. QDEBUG : TestConnIntrospectCornercases::testSelfHandleChangeWhileBuilding() tp-qt4 0.5.15.1 DEBUG: Reference of 1 handles of type 1
  88. QDEBUG : TestConnIntrospectCornercases::testSelfHandleChangeWhileBuilding() tp-qt4 0.5.15.1 DEBUG: PendingHandles(reference)
  89. QDEBUG : TestConnIntrospectCornercases::testSelfHandleChangeWhileBuilding() tp-qt4 0.5.15.1 DEBUG:  All handles already held, finishing up instantly
  90. QDEBUG : TestConnIntrospectCornercases::testSelfHandleChangeWhileBuilding() tp-qt4 0.5.15.1 DEBUG: Connection self handle changed to 2
  91. QDEBUG : TestConnIntrospectCornercases::testSelfHandleChangeWhileBuilding() tp-qt4 0.5.15.1 DEBUG: The self contact is being built, will rebuild with the new handle shortly
  92. QDEBUG : TestConnIntrospectCornercases::testSelfHandleChangeWhileBuilding() tp-qt4 0.5.15.1 DEBUG: ReadinessHelper::setIntrospectCompleted: feature: QPair("Tp::Connection",1) - success: true
  93. QDEBUG : TestConnIntrospectCornercases::testSelfHandleChangeWhileBuilding() tp-qt4 0.5.15.1 DEBUG: Building self contact
  94. QDEBUG : TestConnIntrospectCornercases::testSelfHandleChangeWhileBuilding() tp-qt4 0.5.15.1 DEBUG: Reference of 1 handles of type 1
  95. QDEBUG : TestConnIntrospectCornercases::testSelfHandleChangeWhileBuilding() tp-qt4 0.5.15.1 DEBUG: PendingHandles(reference)
  96. QDEBUG : TestConnIntrospectCornercases::testSelfHandleChangeWhileBuilding() tp-qt4 0.5.15.1 DEBUG:  All handles already held, finishing up instantly
  97. QDEBUG : TestConnIntrospectCornercases::testSelfHandleChangeWhileBuilding() tp-qt4 0.5.15.1 DEBUG: Contact "me@example.com" destroyed
  98. QDEBUG : TestConnIntrospectCornercases::testSelfHandleChangeWhileBuilding() tp-qt4 0.5.15.1 DEBUG: Connection self handle changed to 3
  99. QDEBUG : TestConnIntrospectCornercases::testSelfHandleChangeWhileBuilding() got new self handle 3
  100. QDEBUG : TestConnIntrospectCornercases::testSelfHandleChangeWhileBuilding() tp-qt4 0.5.15.1 DEBUG: Re-building self contact for handle 3
  101. QDEBUG : TestConnIntrospectCornercases::testSelfHandleChangeWhileBuilding() tp-qt4 0.5.15.1 DEBUG: Building self contact
  102. QDEBUG : TestConnIntrospectCornercases::testSelfHandleChangeWhileBuilding() tp-qt4 0.5.15.1 DEBUG: Reference of 1 handles of type 1
  103. QDEBUG : TestConnIntrospectCornercases::testSelfHandleChangeWhileBuilding() tp-qt4 0.5.15.1 DEBUG: PendingHandles(reference)
  104. QDEBUG : TestConnIntrospectCornercases::testSelfHandleChangeWhileBuilding() tp-qt4 0.5.15.1 DEBUG:  All handles already held, finishing up instantly
  105. QDEBUG : TestConnIntrospectCornercases::testSelfHandleChangeWhileBuilding() tp-qt4 0.5.15.1 DEBUG: Contact "myself@example.com" destroyed
  106. (conn-introspect-cornercases:9644): tp-glib/connection-DEBUG: tp_base_connection_change_status: was 0, now 2, for reason 1
  107. (conn-introspect-cornercases:9644): tp-glib/connection-DEBUG: tp_base_connection_change_status: emitting status-changed to 2, for reason 1
  108. QDEBUG : TestConnIntrospectCornercases::testSelfHandleChangeWhileBuilding() tp-qt4 0.5.15.1 DEBUG: StatusChanged from 0 to 2 with reason 1
  109. QDEBUG : TestConnIntrospectCornercases::testSelfHandleChangeWhileBuilding() tp-qt4 0.5.15.1 DEBUG: proxy invalidated: "org.freedesktop.Telepathy.Error.Cancelled": "ConnectionStatusReason = 1"
  110. QDEBUG : TestConnIntrospectCornercases::testSelfHandleChangeWhileBuilding() conn invalidated
  111. QDEBUG : TestConnIntrospectCornercases::testSelfHandleChangeWhileBuilding() tp-qt4 0.5.15.1 DEBUG: Contact "irene@example.com" destroyed
  112. QDEBUG : TestConnIntrospectCornercases::testSelfHandleChangeWhileBuilding() tp-qt4 0.5.15.1 DEBUG:   Destroyed after Connection, so the Connection has already released the handles
  113. (conn-introspect-cornercases:9644): tp-glib/proxy-DEBUG: tp_proxy_dispose: 0xcd30a0
  114. (conn-introspect-cornercases:9644): tp-glib/proxy-DEBUG: tp_proxy_invalidate: 0xcd30a0: Proxy unreferenced
  115. (conn-introspect-cornercases:9644): tp-glib/proxy-DEBUG: tp_proxy_finalize: 0xcd30a0
  116. PASS   : TestConnIntrospectCornercases::testSelfHandleChangeWhileBuilding()
  117. (conn-introspect-cornercases:9644): tp-glib/connection-DEBUG: tp_base_connection_init: Initializing (TpBaseConnection *)0xce3020
  118. (conn-introspect-cornercases:9644): tp-glib/connection-DEBUG: tp_base_connection_constructor: Post-construction: (TpBaseConnection *)0xce3020
  119. (conn-introspect-cornercases:9644): tp-glib/connection-DEBUG: tp_base_connection_constructor: Handle repo for type #0 at (nil)
  120. (conn-introspect-cornercases:9644): tp-glib/connection-DEBUG: tp_base_connection_constructor: Handle repo for type #1 at 0xc9c720
  121. (conn-introspect-cornercases:9644): tp-glib/connection-DEBUG: tp_base_connection_constructor: Handle repo for type #2 at 0xc9c590
  122. (conn-introspect-cornercases:9644): tp-glib/connection-DEBUG: tp_base_connection_constructor: Handle repo for type #3 at (nil)
  123. (conn-introspect-cornercases:9644): tp-glib/connection-DEBUG: tp_base_connection_constructor: Handle repo for type #4 at (nil)
  124. (conn-introspect-cornercases:9644): tp-glib/connection-DEBUG: tp_base_connection_register: bus name org.freedesktop.Telepathy.Connection.simple.simple.me_40example_2ecom
  125. (conn-introspect-cornercases:9644): tp-glib/connection-DEBUG: tp_base_connection_register: object path /org/freedesktop/Telepathy/Connection/simple/simple/me_40example_2ecom
  126. QDEBUG : TestConnIntrospectCornercases::testSlowpath() tp-qt4 0.5.15.1 DEBUG: Creating new DBusProxy
  127. QDEBUG : TestConnIntrospectCornercases::testSlowpath() tp-qt4 0.5.15.1 DEBUG: Connecting to ConnectionError()
  128. QDEBUG : TestConnIntrospectCornercases::testSlowpath() tp-qt4 0.5.15.1 DEBUG: Connecting to StatusChanged()
  129. QDEBUG : TestConnIntrospectCornercases::testSlowpath() tp-qt4 0.5.15.1 DEBUG: Connecting to SelfHandleChanged()
  130. QDEBUG : TestConnIntrospectCornercases::testSlowpath() tp-qt4 0.5.15.1 DEBUG: Creating new HandleContext for "/org/freedesktop/Telepathy/Connection/simple/simple/me_40example_2ecom"
  131. QDEBUG : TestConnIntrospectCornercases::testSlowpath() tp-qt4 0.5.15.1 DEBUG: ReadinessHelper: new supportedStatuses = QSet(0, 4294967295, 1, 2)
  132. QDEBUG : TestConnIntrospectCornercases::testSlowpath() tp-qt4 0.5.15.1 DEBUG: ReadinessHelper: new supportedFeatures = QSet(QPair("Tp::Connection",6) ,  QPair("Tp::Connection",5) ,  QPair("Tp::Connection",4) ,  QPair("Tp::Connection",2) ,  QPair("Tp::Connection",1) ,  QPair("Tp::Connection",0) ,  QPair("Tp::Connection",7) )  
  133. QDEBUG : TestConnIntrospectCornercases::testSlowpath() tp-qt4 0.5.15.1 DEBUG: Calling Properties::GetAll(Connection)
  134. QDEBUG : TestConnIntrospectCornercases::testSlowpath() tp-qt4 0.5.15.1 DEBUG: Calling GetStatus()
  135. (conn-introspect-cornercases:9644): tp-glib/connection-DEBUG: tp_base_connection_change_status: from NEW to CONNECTED: going via CONNECTING first
  136. (conn-introspect-cornercases:9644): tp-glib/connection-DEBUG: tp_base_connection_change_status: was 4294967295, now 1, for reason 1
  137. (conn-introspect-cornercases:9644): tp-glib/connection-DEBUG: tp_base_connection_change_status: emitting status-changed to 1, for reason 1
  138. (conn-introspect-cornercases:9644): tp-glib/connection-DEBUG: tp_base_connection_change_status: was 1, now 0, for reason 1
  139. (conn-introspect-cornercases:9644): tp-glib/connection-DEBUG: tp_base_connection_change_status: emitting status-changed to 0, for reason 1
  140. QDEBUG : TestConnIntrospectCornercases::testSlowpath() tp-qt4 0.5.15.1 DEBUG: StatusChanged from 4294967295 to 1 with reason 1
  141. QDEBUG : TestConnIntrospectCornercases::testSlowpath() tp-qt4 0.5.15.1 DEBUG: status changed while introspection process was running
  142. QDEBUG : TestConnIntrospectCornercases::testSlowpath() tp-qt4 0.5.15.1 DEBUG: StatusChanged from 1 to 0 with reason 1
  143. QDEBUG : TestConnIntrospectCornercases::testSlowpath() tp-qt4 0.5.15.1 DEBUG: Performing introspection for the Connected status
  144. QDEBUG : TestConnIntrospectCornercases::testSlowpath() tp-qt4 0.5.15.1 DEBUG: status changed while introspection process was running
  145. QDEBUG : TestConnIntrospectCornercases::testSlowpath() tp-qt4 0.5.15.1 DEBUG: ReadinessHelper::setIntrospectCompleted: feature: QPair("Tp::Connection",0) - success: true
  146. QDEBUG : TestConnIntrospectCornercases::testSlowpath() tp-qt4 0.5.15.1 DEBUG: ReadinessHelper::setIntrospectCompleted called while there is a pending status change - ignoring
  147. QDEBUG : TestConnIntrospectCornercases::testSlowpath() tp-qt4 0.5.15.1 DEBUG: Calling Properties::GetAll(Connection)
  148. QDEBUG : TestConnIntrospectCornercases::testSlowpath() tp-qt4 0.5.15.1 DEBUG: Calling GetInterfaces()
  149. QDEBUG : TestConnIntrospectCornercases::testSlowpath() tp-qt4 0.5.15.1 DEBUG: Got interfaces: ("org.freedesktop.Telepathy.Connection.Interface.Aliasing", "org.freedesktop.Telepathy.Connection.Interface.Capabilities", "org.freedesktop.Telepathy.Connection.Interface.Presence", "org.freedesktop.Telepathy.Connection.Interface.Avatars")
  150. QDEBUG : TestConnIntrospectCornercases::testSlowpath() tp-qt4 0.5.15.1 DEBUG: Calling GetSelfHandle()
  151. QDEBUG : TestConnIntrospectCornercases::testSlowpath() tp-qt4 0.5.15.1 DEBUG: Got self handle: 1
  152. QDEBUG : TestConnIntrospectCornercases::testSlowpath() tp-qt4 0.5.15.1 DEBUG: ReadinessHelper::setIntrospectCompleted: feature: QPair("Tp::Connection",0) - success: true
  153. (conn-introspect-cornercases:9644): tp-glib/connection-DEBUG: tp_base_connection_change_status: was 0, now 2, for reason 1
  154. (conn-introspect-cornercases:9644): tp-glib/connection-DEBUG: tp_base_connection_change_status: emitting status-changed to 2, for reason 1
  155. QDEBUG : TestConnIntrospectCornercases::testSlowpath() tp-qt4 0.5.15.1 DEBUG: StatusChanged from 0 to 2 with reason 1
  156. QDEBUG : TestConnIntrospectCornercases::testSlowpath() tp-qt4 0.5.15.1 DEBUG: proxy invalidated: "org.freedesktop.Telepathy.Error.Cancelled": "ConnectionStatusReason = 1"
  157. QDEBUG : TestConnIntrospectCornercases::testSlowpath() conn invalidated
  158. QDEBUG : TestConnIntrospectCornercases::testSlowpath() tp-qt4 0.5.15.1 DEBUG: Destroying HandleContext
  159. (conn-introspect-cornercases:9644): tp-glib/proxy-DEBUG: tp_proxy_dispose: 0xcd3130
  160. (conn-introspect-cornercases:9644): tp-glib/proxy-DEBUG: tp_proxy_invalidate: 0xcd3130: Proxy unreferenced
  161. (conn-introspect-cornercases:9644): tp-glib/proxy-DEBUG: tp_proxy_finalize: 0xcd3130
  162. PASS   : TestConnIntrospectCornercases::testSlowpath()
  163. (conn-introspect-cornercases:9644): tp-glib/connection-DEBUG: tp_base_connection_init: Initializing (TpBaseConnection *)0xcd0230
  164. (conn-introspect-cornercases:9644): tp-glib/connection-DEBUG: tp_base_connection_constructor: Post-construction: (TpBaseConnection *)0xcd0230
  165. (conn-introspect-cornercases:9644): tp-glib/connection-DEBUG: tp_base_connection_constructor: Handle repo for type #0 at (nil)
  166. (conn-introspect-cornercases:9644): tp-glib/connection-DEBUG: tp_base_connection_constructor: Handle repo for type #1 at 0xcd41e0
  167. (conn-introspect-cornercases:9644): tp-glib/connection-DEBUG: tp_base_connection_constructor: Handle repo for type #2 at 0xcd4450
  168. (conn-introspect-cornercases:9644): tp-glib/connection-DEBUG: tp_base_connection_constructor: Handle repo for type #3 at (nil)
  169. (conn-introspect-cornercases:9644): tp-glib/connection-DEBUG: tp_base_connection_constructor: Handle repo for type #4 at (nil)
  170. (conn-introspect-cornercases:9644): tp-glib/connection-DEBUG: tp_base_connection_register: bus name org.freedesktop.Telepathy.Connection.simple.simple.me_40example_2ecom
  171. (conn-introspect-cornercases:9644): tp-glib/connection-DEBUG: tp_base_connection_register: object path /org/freedesktop/Telepathy/Connection/simple/simple/me_40example_2ecom
  172. QDEBUG : TestConnIntrospectCornercases::testStatusChange() tp-qt4 0.5.15.1 DEBUG: Creating new DBusProxy
  173. QDEBUG : TestConnIntrospectCornercases::testStatusChange() tp-qt4 0.5.15.1 DEBUG: Connecting to ConnectionError()
  174. QDEBUG : TestConnIntrospectCornercases::testStatusChange() tp-qt4 0.5.15.1 DEBUG: Connecting to StatusChanged()
  175. QDEBUG : TestConnIntrospectCornercases::testStatusChange() tp-qt4 0.5.15.1 DEBUG: Connecting to SelfHandleChanged()
  176. QDEBUG : TestConnIntrospectCornercases::testStatusChange() tp-qt4 0.5.15.1 DEBUG: Creating new HandleContext for "/org/freedesktop/Telepathy/Connection/simple/simple/me_40example_2ecom"
  177. QDEBUG : TestConnIntrospectCornercases::testStatusChange() tp-qt4 0.5.15.1 DEBUG: ReadinessHelper: new supportedStatuses = QSet(0, 4294967295, 1, 2)
  178. QDEBUG : TestConnIntrospectCornercases::testStatusChange() tp-qt4 0.5.15.1 DEBUG: ReadinessHelper: new supportedFeatures = QSet(QPair("Tp::Connection",6) ,  QPair("Tp::Connection",5) ,  QPair("Tp::Connection",4) ,  QPair("Tp::Connection",2) ,  QPair("Tp::Connection",1) ,  QPair("Tp::Connection",0) ,  QPair("Tp::Connection",7) )  
  179. QDEBUG : TestConnIntrospectCornercases::testStatusChange() tp-qt4 0.5.15.1 DEBUG: Calling Properties::GetAll(Connection)
  180. QDEBUG : TestConnIntrospectCornercases::testStatusChange() tp-qt4 0.5.15.1 DEBUG: Got status: 2
  181. QDEBUG : TestConnIntrospectCornercases::testStatusChange() tp-qt4 0.5.15.1 DEBUG: Got interfaces: ("org.freedesktop.Telepathy.Connection.Interface.Requests")
  182. QDEBUG : TestConnIntrospectCornercases::testStatusChange() tp-qt4 0.5.15.1 DEBUG: Retrieving capabilities
  183. QDEBUG : TestConnIntrospectCornercases::testStatusChange() tp-qt4 0.5.15.1 DEBUG: Got capabilities
  184. QDEBUG : TestConnIntrospectCornercases::testStatusChange() tp-qt4 0.5.15.1 DEBUG: ReadinessHelper::setIntrospectCompleted: feature: QPair("Tp::Connection",0) - success: true
  185. (conn-introspect-cornercases:9644): tp-glib/connection-DEBUG: tp_base_connection_change_status: was 4294967295, now 1, for reason 1
  186. (conn-introspect-cornercases:9644): tp-glib/connection-DEBUG: tp_base_connection_change_status: emitting status-changed to 1, for reason 1
  187. (conn-introspect-cornercases:9644): tp-glib/connection-DEBUG: tp_base_connection_change_status: was 1, now 0, for reason 1
  188. (conn-introspect-cornercases:9644): tp-glib/connection-DEBUG: tp_base_connection_change_status: emitting status-changed to 0, for reason 1
  189. QDEBUG : TestConnIntrospectCornercases::testStatusChange() tp-qt4 0.5.15.1 DEBUG: StatusChanged from 2 to 1 with reason 1
  190. QDEBUG : TestConnIntrospectCornercases::testStatusChange() tp-qt4 0.5.15.1 DEBUG: Finishing FeatureConnected for status 2 to allow ReadinessHelper to introspect new status 1
  191. QDEBUG : TestConnIntrospectCornercases::testStatusChange() tp-qt4 0.5.15.1 DEBUG: ReadinessHelper::setIntrospectCompleted: feature: QPair("Tp::Connection",7) - success: true
  192. QDEBUG : TestConnIntrospectCornercases::testStatusChange() tp-qt4 0.5.15.1 DEBUG: ReadinessHelper::setIntrospectCompleted: feature: QPair("Tp::Connection",0) - success: true
  193. QDEBUG : TestConnIntrospectCornercases::testStatusChange() tp-qt4 0.5.15.1 DEBUG: StatusChanged from 1 to 0 with reason 1
  194. QDEBUG : TestConnIntrospectCornercases::testStatusChange() tp-qt4 0.5.15.1 DEBUG: Performing introspection for the Connected status
  195. QDEBUG : TestConnIntrospectCornercases::testStatusChange() tp-qt4 0.5.15.1 DEBUG: Finishing FeatureConnected for status 2 to allow ReadinessHelper to introspect new status 0
  196. QDEBUG : TestConnIntrospectCornercases::testStatusChange() tp-qt4 0.5.15.1 DEBUG: ReadinessHelper::setIntrospectCompleted: feature: QPair("Tp::Connection",7) - success: true
  197. QDEBUG : TestConnIntrospectCornercases::testStatusChange() tp-qt4 0.5.15.1 DEBUG: Calling Properties::GetAll(Connection)
  198. QDEBUG : TestConnIntrospectCornercases::testStatusChange() tp-qt4 0.5.15.1 DEBUG: Got interfaces: ("org.freedesktop.Telepathy.Connection.Interface.Requests")
  199. QDEBUG : TestConnIntrospectCornercases::testStatusChange() tp-qt4 0.5.15.1 DEBUG: Retrieving capabilities
  200. QDEBUG : TestConnIntrospectCornercases::testStatusChange() tp-qt4 0.5.15.1 DEBUG: Got capabilities
  201. QDEBUG : TestConnIntrospectCornercases::testStatusChange() tp-qt4 0.5.15.1 DEBUG: ReadinessHelper::setIntrospectCompleted: feature: QPair("Tp::Connection",0) - success: true
  202. QDEBUG : TestConnIntrospectCornercases::testStatusChange() tp-qt4 0.5.15.1 DEBUG: ReadinessHelper::setIntrospectCompleted: feature: QPair("Tp::Connection",7) - success: true
  203. (conn-introspect-cornercases:9644): tp-glib/connection-DEBUG: tp_base_connection_change_status: was 0, now 2, for reason 1
  204. (conn-introspect-cornercases:9644): tp-glib/connection-DEBUG: tp_base_connection_change_status: emitting status-changed to 2, for reason 1
  205. QDEBUG : TestConnIntrospectCornercases::testStatusChange() tp-qt4 0.5.15.1 DEBUG: StatusChanged from 0 to 2 with reason 1
  206. QDEBUG : TestConnIntrospectCornercases::testStatusChange() tp-qt4 0.5.15.1 DEBUG: proxy invalidated: "org.freedesktop.Telepathy.Error.Cancelled": "ConnectionStatusReason = 1"
  207. QDEBUG : TestConnIntrospectCornercases::testStatusChange() conn invalidated
  208. (conn-introspect-cornercases:9644): tp-glib/proxy-DEBUG: tp_proxy_dispose: 0xcd31c0
  209. (conn-introspect-cornercases:9644): tp-glib/proxy-DEBUG: tp_proxy_invalidate: 0xcd31c0: Proxy unreferenced
  210. (conn-introspect-cornercases:9644): tp-glib/proxy-DEBUG: tp_proxy_finalize: 0xcd31c0
  211. PASS   : TestConnIntrospectCornercases::testStatusChange()
  212. PASS   : TestConnIntrospectCornercases::cleanupTestCase()
  213. Totals: 5 passed, 1 failed, 0 skipped
  214. ********* Finished testing of TestConnIntrospectCornercases *********
  215. Killing temporary bus daemon: 9639
  216.  
  217.       Start 30: ContactsInfo
  218. 12/37 Test #30: ContactsInfo ......................   Passed    0.08 sec
  219.       Start 31: ContactsLocation
  220. 13/37 Test #31: ContactsLocation ..................   Passed    0.07 sec
  221.       Start 32: DBusProxyFactory
  222. 14/37 Test #32: DBusProxyFactory ..................   Passed    0.08 sec
  223.       Start 33: Handles
  224. 15/37 Test #33: Handles ...........................   Passed    0.05 sec
  225.       Start 34: StatefulProxy
  226. 16/37 Test #34: StatefulProxy .....................   Passed    0.04 sec
  227.       Start 35: StreamedMediaChannel
  228. 17/37 Test #35: StreamedMediaChannel ..............   Passed    0.17 sec
  229.       Start 36: TextChannel
  230. 18/37 Test #36: TextChannel .......................   Passed    0.09 sec
  231.       Start 37: ProfileManager
  232. 19/37 Test #37: ProfileManager ....................   Passed    0.05 sec
  233.       Start 10: ClientFactories
  234. 20/37 Test #10: ClientFactories ...................   Passed    0.18 sec
  235.       Start  2: KeyFile
  236. 21/37 Test  #2: KeyFile ...........................   Passed    0.02 sec
  237.       Start  3: ManagerFile
  238. 22/37 Test  #3: ManagerFile .......................   Passed    0.01 sec
  239.       Start  4: Profile
  240. 23/37 Test  #4: Profile ...........................   Passed    0.01 sec
  241.       Start  5: Ptr
  242. 24/37 Test  #5: Ptr ...............................   Passed    0.01 sec
  243.       Start  6: DBusProperties
  244. 25/37 Test  #6: DBusProperties ....................   Passed    0.11 sec
  245.       Start  7: AccountBasics
  246. 26/37 Test  #7: AccountBasics .....................   Passed    0.17 sec
  247.       Start  8: AccountChannelDispatcher
  248. 27/37 Test  #8: AccountChannelDispatcher ..........   Passed    0.24 sec
  249.       Start  9: Client
  250. 28/37 Test  #9: Client ............................   Passed    0.18 sec
  251.       Start  1: RCCSpec
  252. 29/37 Test  #1: RCCSpec ...........................   Passed    0.02 sec
  253.       Start 11: AccountConnectionFactory
  254. 30/37 Test #11: AccountConnectionFactory ..........   Passed    0.08 sec
  255.       Start 12: ChannelBasics
  256. 31/37 Test #12: ChannelBasics .....................   Passed    0.07 sec
  257.       Start 13: ChannelConference
  258. 32/37 Test #13: ChannelConference .................   Passed    0.08 sec
  259.       Start 14: ChannelContactSearch
  260. 33/37 Test #14: ChannelContactSearch ..............   Passed    0.09 sec
  261.       Start 15: ChannelGroup
  262. 34/37 Test #15: ChannelGroup ......................   Passed    0.09 sec
  263.       Start 16: ConnectionManagerBasics
  264. 35/37 Test #16: ConnectionManagerBasics ...........   Passed    0.06 sec
  265.       Start 17: ConnectionBasics
  266. 36/37 Test #17: ConnectionBasics ..................   Passed    0.07 sec
  267.       Start 18: ConnectionCapabilities
  268. 37/37 Test #18: ConnectionCapabilities ............   Passed    0.15 sec
  269.  
  270. 97% tests passed, 1 tests failed out of 37
  271.  
  272. Total Test time (real) =   3.52 sec
  273.  
  274. The following tests FAILED:
  275.      19 - ConnectionIntrospectCornercases (Failed)
  276. Errors while running CTest
  277. make[3]: *** [tests/dbus/CMakeFiles/check] Error 8
  278. make[2]: *** [tests/dbus/CMakeFiles/check.dir/all] Error 2
  279. make[1]: *** [tests/dbus/CMakeFiles/check.dir/rule] Error 2
  280. make: *** [check] Error 2
RAW Paste Data
Top