Advertisement
Guest User

Untitled

a guest
Jun 5th, 2019
87
0
Never
Not a member of Pastebin yet? Sign Up, it unlocks many cool features!
text 14.45 KB | None | 0 0
  1. [DEBUG] /home/irynah/.m2/repository/org/hibernate/hibernate-c3p0/4.3.11.Final/hibernate-c3p0-4.3.11.Final.jar
  2. [DEBUG] /home/irynah/.m2/repository/com/mchange/c3p0/0.9.2.1/c3p0-0.9.2.1.jar
  3. [DEBUG] /home/irynah/.m2/repository/com/mchange/mchange-commons-java/0.2.3.4/mchange-commons-java-0.2.3.4.jar
  4. [DEBUG] /home/irynah/.m2/repository/org/hibernate/hibernate-ehcache/4.3.11.Final/hibernate-ehcache-4.3.11.Final.jar
  5. [DEBUG] /home/irynah/.m2/repository/org/hibernate/hibernate-search-orm/5.11.1.Final/hibernate-search-orm-5.11.1.Final.jar
  6. [DEBUG] /home/irynah/.m2/repository/org/hibernate/hibernate-search-engine/5.11.1.Final/hibernate-search-engine-5.11.1.Final.jar
  7. [DEBUG] /home/irynah/.m2/repository/org/apache/lucene/lucene-misc/5.5.5/lucene-misc-5.5.5.jar
  8. [DEBUG] /home/irynah/.m2/repository/org/apache/lucene/lucene-analyzers-common/5.5.5/lucene-analyzers-common-5.5.5.jar
  9. [DEBUG] /home/irynah/.m2/repository/org/apache/lucene/lucene-facet/5.5.5/lucene-facet-5.5.5.jar
  10. [DEBUG] /home/irynah/.m2/repository/org/apache/lucene/lucene-queryparser/4.10.4/lucene-queryparser-4.10.4.jar
  11. [DEBUG] /home/irynah/.m2/repository/org/apache/lucene/lucene-core/4.10.4/lucene-core-4.10.4.jar
  12. [DEBUG] /home/irynah/.m2/repository/org/apache/lucene/lucene-sandbox/4.10.4/lucene-sandbox-4.10.4.jar
  13. [DEBUG] /home/irynah/.m2/repository/org/apache/lucene/lucene-queries/4.10.4/lucene-queries-4.10.4.jar
  14. [DEBUG] /home/irynah/.m2/repository/dom4j/dom4j/1.6.1/dom4j-1.6.1.jar
  15. [DEBUG] /home/irynah/.m2/repository/org/slf4j/slf4j-api/1.7.26/slf4j-api-1.7.26.jar
  16. [DEBUG] /home/irynah/.m2/repository/org/slf4j/jcl-over-slf4j/1.7.26/jcl-over-slf4j-1.7.26.jar
  17. [DEBUG] /home/irynah/.m2/repository/com/thoughtworks/xstream/xstream/1.4.11.1/xstream-1.4.11.1.jar
  18. [DEBUG] /home/irynah/.m2/repository/xmlpull/xmlpull/1.1.3.1/xmlpull-1.1.3.1.jar
  19. [DEBUG] /home/irynah/.m2/repository/xpp3/xpp3_min/1.1.4c/xpp3_min-1.1.4c.jar
  20. [DEBUG] /home/irynah/.m2/repository/javax/mail/mail/1.4.1/mail-1.4.1.jar
  21. [DEBUG] /home/irynah/.m2/repository/org/liquibase/liquibase-core/2.0.5/liquibase-core-2.0.5.jar
  22. [DEBUG] /home/irynah/.m2/repository/org/openmrs/liquibase/ext/modify-column/2.0.2/modify-column-2.0.2.jar
  23. [DEBUG] /home/irynah/.m2/repository/org/openmrs/liquibase/ext/identity-insert/1.2.1/identity-insert-1.2.1.jar
  24. [DEBUG] /home/irynah/.m2/repository/org/openmrs/liquibase/ext/type-converter/1.0.1/type-converter-1.0.1.jar
  25. [DEBUG] /home/irynah/.m2/repository/xerces/xercesImpl/2.8.0/xercesImpl-2.8.0.jar
  26. [DEBUG] /home/irynah/.m2/repository/javax/validation/validation-api/1.0.0.GA/validation-api-1.0.0.GA.jar
  27. [DEBUG] /home/irynah/.m2/repository/org/hibernate/validator/hibernate-validator/6.0.16.Final/hibernate-validator-6.0.16.Final.jar
  28. [DEBUG] /home/irynah/.m2/repository/com/fasterxml/classmate/1.3.4/classmate-1.3.4.jar
  29. [DEBUG] /home/irynah/.m2/repository/org/codehaus/jackson/jackson-core-asl/1.9.13/jackson-core-asl-1.9.13.jar
  30. [DEBUG] /home/irynah/.m2/repository/org/codehaus/jackson/jackson-mapper-asl/1.9.13/jackson-mapper-asl-1.9.13.jar
  31. [DEBUG] /home/irynah/.m2/repository/com/fasterxml/jackson/core/jackson-core/2.9.8/jackson-core-2.9.8.jar
  32. [DEBUG] /home/irynah/.m2/repository/com/fasterxml/jackson/core/jackson-annotations/2.9.8/jackson-annotations-2.9.8.jar
  33. [DEBUG] /home/irynah/.m2/repository/com/fasterxml/jackson/core/jackson-databind/2.9.8/jackson-databind-2.9.8.jar
  34. [DEBUG] /home/irynah/.m2/repository/org/codehaus/groovy/groovy-all/2.4.6/groovy-all-2.4.6.jar
  35. [DEBUG] /home/irynah/.m2/repository/net/sf/ehcache/ehcache/2.10.6/ehcache-2.10.6.jar
  36. [DEBUG] Source roots:
  37. [DEBUG] /home/irynah/Openmrs-Projects/trunk-5499/openmrs-core/api/src/main/java
  38. [INFO] Compiling 696 source files to /home/irynah/Openmrs-Projects/trunk-5499/openmrs-core/api/target/classes
  39. [INFO] -------------------------------------------------------------
  40. [ERROR] COMPILATION ERROR :
  41. [INFO] -------------------------------------------------------------
  42. [ERROR] /home/irynah/Openmrs-Projects/trunk-5499/openmrs-core/api/src/main/java/org/openmrs/api/db/hibernate/search/TermsFilterFactory.java:[26,39] error: cannot find symbol
  43.  
  44. [ERROR] package org.hibernate.search.filter.impl
  45. /home/irynah/Openmrs-Projects/trunk-5499/openmrs-core/api/src/main/java/org/openmrs/api/db/hibernate/search/TermsFilterFactory.java:[75,13] error: cannot find symbol
  46.  
  47. [ERROR] class TermsFilterFactory
  48. /home/irynah/Openmrs-Projects/trunk-5499/openmrs-core/api/src/main/java/org/openmrs/api/db/hibernate/search/LuceneQuery.java:[302,7] error: cannot access QueryImplementor
  49.  
  50. [ERROR] class file for org.hibernate.query.spi.QueryImplementor not found
  51. /home/irynah/Openmrs-Projects/trunk-5499/openmrs-core/api/src/main/java/org/openmrs/api/db/hibernate/search/LuceneQuery.java:[303,34] error: cannot find symbol
  52.  
  53. [ERROR] variable query of type FullTextQuery
  54. /home/irynah/Openmrs-Projects/trunk-5499/openmrs-core/api/src/main/java/org/openmrs/api/db/hibernate/search/LuceneQuery.java:[338,29] error: cannot find symbol
  55.  
  56. [ERROR] interface FullTextQuery
  57. /home/irynah/Openmrs-Projects/trunk-5499/openmrs-core/api/src/main/java/org/openmrs/api/db/hibernate/search/LuceneQuery.java:[350,29] error: cannot find symbol
  58.  
  59. [ERROR] interface FullTextQuery
  60. /home/irynah/Openmrs-Projects/trunk-5499/openmrs-core/api/src/main/java/org/openmrs/api/db/hibernate/search/LuceneQuery.java:[365,30] error: cannot find symbol
  61.  
  62. [ERROR] variable fullTextQuery of type FullTextQuery
  63. /home/irynah/Openmrs-Projects/trunk-5499/openmrs-core/api/src/main/java/org/openmrs/api/db/hibernate/search/LuceneQuery.java:[392,37] error: cannot find symbol
  64.  
  65. [ERROR] variable fullTextQuery of type FullTextQuery
  66. /home/irynah/Openmrs-Projects/trunk-5499/openmrs-core/api/src/main/java/org/openmrs/api/db/hibernate/search/LuceneQuery.java:[408,37] error: cannot find symbol
  67.  
  68. [ERROR] variable fullTextQuery of type FullTextQuery
  69. /home/irynah/Openmrs-Projects/trunk-5499/openmrs-core/api/src/main/java/org/openmrs/api/db/hibernate/HibernateContextDAO.java:[472,31] error: reference to getFlushMode is ambiguous
  70.  
  71. [ERROR] both method getFlushMode() in EntityManager and method getFlushMode() in Session match
  72. /home/irynah/Openmrs-Projects/trunk-5499/openmrs-core/api/src/main/java/org/openmrs/api/db/hibernate/HibernateContextDAO.java:[472,44] error: incompatible types: FlushModeType cannot be converted to FlushMode
  73.  
  74. [INFO] 11 errors
  75. [INFO] -------------------------------------------------------------
  76. [INFO] ------------------------------------------------------------------------
  77. [INFO] Reactor Summary for OpenMRS 2.3.0-SNAPSHOT:
  78. [INFO]
  79. [INFO] OpenMRS ............................................ SUCCESS [ 2.526 s]
  80. [INFO] openmrs-tools ...................................... SUCCESS [ 1.286 s]
  81. [INFO] openmrs-test ....................................... SUCCESS [ 0.176 s]
  82. [INFO] openmrs-api ........................................ FAILURE [ 13.874 s]
  83. [INFO] openmrs-web ........................................ SKIPPED
  84. [INFO] openmrs-webapp ..................................... SKIPPED
  85. [INFO] ------------------------------------------------------------------------
  86. [INFO] BUILD FAILURE
  87. [INFO] ------------------------------------------------------------------------
  88. [INFO] Total time: 18.342 s
  89. [INFO] Finished at: 2019-06-05T20:57:02+03:00
  90. [INFO] ------------------------------------------------------------------------
  91. [ERROR] Failed to execute goal org.apache.maven.plugins:maven-compiler-plugin:2.1:compile (default-compile) on project openmrs-api: Compilation failure: Compilation failure:
  92. [ERROR] /home/irynah/Openmrs-Projects/trunk-5499/openmrs-core/api/src/main/java/org/openmrs/api/db/hibernate/search/TermsFilterFactory.java:[26,39] error: cannot find symbol
  93. [ERROR]
  94. [ERROR] package org.hibernate.search.filter.impl
  95. [ERROR] /home/irynah/Openmrs-Projects/trunk-5499/openmrs-core/api/src/main/java/org/openmrs/api/db/hibernate/search/TermsFilterFactory.java:[75,13] error: cannot find symbol
  96. [ERROR]
  97. [ERROR] class TermsFilterFactory
  98. [ERROR] /home/irynah/Openmrs-Projects/trunk-5499/openmrs-core/api/src/main/java/org/openmrs/api/db/hibernate/search/LuceneQuery.java:[302,7] error: cannot access QueryImplementor
  99. [ERROR]
  100. [ERROR] class file for org.hibernate.query.spi.QueryImplementor not found
  101. [ERROR] /home/irynah/Openmrs-Projects/trunk-5499/openmrs-core/api/src/main/java/org/openmrs/api/db/hibernate/search/LuceneQuery.java:[303,34] error: cannot find symbol
  102. [ERROR]
  103. [ERROR] variable query of type FullTextQuery
  104. [ERROR] /home/irynah/Openmrs-Projects/trunk-5499/openmrs-core/api/src/main/java/org/openmrs/api/db/hibernate/search/LuceneQuery.java:[338,29] error: cannot find symbol
  105. [ERROR]
  106. [ERROR] interface FullTextQuery
  107. [ERROR] /home/irynah/Openmrs-Projects/trunk-5499/openmrs-core/api/src/main/java/org/openmrs/api/db/hibernate/search/LuceneQuery.java:[350,29] error: cannot find symbol
  108. [ERROR]
  109. [ERROR] interface FullTextQuery
  110. [ERROR] /home/irynah/Openmrs-Projects/trunk-5499/openmrs-core/api/src/main/java/org/openmrs/api/db/hibernate/search/LuceneQuery.java:[365,30] error: cannot find symbol
  111. [ERROR]
  112. [ERROR] variable fullTextQuery of type FullTextQuery
  113. [ERROR] /home/irynah/Openmrs-Projects/trunk-5499/openmrs-core/api/src/main/java/org/openmrs/api/db/hibernate/search/LuceneQuery.java:[392,37] error: cannot find symbol
  114. [ERROR]
  115. [ERROR] variable fullTextQuery of type FullTextQuery
  116. [ERROR] /home/irynah/Openmrs-Projects/trunk-5499/openmrs-core/api/src/main/java/org/openmrs/api/db/hibernate/search/LuceneQuery.java:[408,37] error: cannot find symbol
  117. [ERROR]
  118. [ERROR] variable fullTextQuery of type FullTextQuery
  119. [ERROR] /home/irynah/Openmrs-Projects/trunk-5499/openmrs-core/api/src/main/java/org/openmrs/api/db/hibernate/HibernateContextDAO.java:[472,31] error: reference to getFlushMode is ambiguous
  120. [ERROR]
  121. [ERROR] both method getFlushMode() in EntityManager and method getFlushMode() in Session match
  122. [ERROR] /home/irynah/Openmrs-Projects/trunk-5499/openmrs-core/api/src/main/java/org/openmrs/api/db/hibernate/HibernateContextDAO.java:[472,44] error: incompatible types: FlushModeType cannot be converted to FlushMode
  123. [ERROR] -> [Help 1]
  124. org.apache.maven.lifecycle.LifecycleExecutionException: Failed to execute goal org.apache.maven.plugins:maven-compiler-plugin:2.1:compile (default-compile) on project openmrs-api: Compilation failure
  125. at org.apache.maven.lifecycle.internal.MojoExecutor.execute (MojoExecutor.java:215)
  126. at org.apache.maven.lifecycle.internal.MojoExecutor.execute (MojoExecutor.java:156)
  127. at org.apache.maven.lifecycle.internal.MojoExecutor.execute (MojoExecutor.java:148)
  128. at org.apache.maven.lifecycle.internal.LifecycleModuleBuilder.buildProject (LifecycleModuleBuilder.java:117)
  129. at org.apache.maven.lifecycle.internal.LifecycleModuleBuilder.buildProject (LifecycleModuleBuilder.java:81)
  130. at org.apache.maven.lifecycle.internal.builder.singlethreaded.SingleThreadedBuilder.build (SingleThreadedBuilder.java:56)
  131. at org.apache.maven.lifecycle.internal.LifecycleStarter.execute (LifecycleStarter.java:128)
  132. at org.apache.maven.DefaultMaven.doExecute (DefaultMaven.java:305)
  133. at org.apache.maven.DefaultMaven.doExecute (DefaultMaven.java:192)
  134. at org.apache.maven.DefaultMaven.execute (DefaultMaven.java:105)
  135. at org.apache.maven.cli.MavenCli.execute (MavenCli.java:956)
  136. at org.apache.maven.cli.MavenCli.doMain (MavenCli.java:288)
  137. at org.apache.maven.cli.MavenCli.main (MavenCli.java:192)
  138. at sun.reflect.NativeMethodAccessorImpl.invoke0 (Native Method)
  139. at sun.reflect.NativeMethodAccessorImpl.invoke (NativeMethodAccessorImpl.java:62)
  140. at sun.reflect.DelegatingMethodAccessorImpl.invoke (DelegatingMethodAccessorImpl.java:43)
  141. at java.lang.reflect.Method.invoke (Method.java:498)
  142. at org.codehaus.plexus.classworlds.launcher.Launcher.launchEnhanced (Launcher.java:289)
  143. at org.codehaus.plexus.classworlds.launcher.Launcher.launch (Launcher.java:229)
  144. at org.codehaus.plexus.classworlds.launcher.Launcher.mainWithExitCode (Launcher.java:415)
  145. at org.codehaus.plexus.classworlds.launcher.Launcher.main (Launcher.java:356)
  146. Caused by: org.apache.maven.plugin.CompilationFailureException: Compilation failure
  147. at org.apache.maven.plugin.AbstractCompilerMojo.execute (AbstractCompilerMojo.java:613)
  148. at org.apache.maven.plugin.CompilerMojo.execute (CompilerMojo.java:116)
  149. at org.apache.maven.plugin.DefaultBuildPluginManager.executeMojo (DefaultBuildPluginManager.java:137)
  150. at org.apache.maven.lifecycle.internal.MojoExecutor.execute (MojoExecutor.java:210)
  151. at org.apache.maven.lifecycle.internal.MojoExecutor.execute (MojoExecutor.java:156)
  152. at org.apache.maven.lifecycle.internal.MojoExecutor.execute (MojoExecutor.java:148)
  153. at org.apache.maven.lifecycle.internal.LifecycleModuleBuilder.buildProject (LifecycleModuleBuilder.java:117)
  154. at org.apache.maven.lifecycle.internal.LifecycleModuleBuilder.buildProject (LifecycleModuleBuilder.java:81)
  155. at org.apache.maven.lifecycle.internal.builder.singlethreaded.SingleThreadedBuilder.build (SingleThreadedBuilder.java:56)
  156. at org.apache.maven.lifecycle.internal.LifecycleStarter.execute (LifecycleStarter.java:128)
  157. at org.apache.maven.DefaultMaven.doExecute (DefaultMaven.java:305)
  158. at org.apache.maven.DefaultMaven.doExecute (DefaultMaven.java:192)
  159. at org.apache.maven.DefaultMaven.execute (DefaultMaven.java:105)
  160. at org.apache.maven.cli.MavenCli.execute (MavenCli.java:956)
  161. at org.apache.maven.cli.MavenCli.doMain (MavenCli.java:288)
  162. at org.apache.maven.cli.MavenCli.main (MavenCli.java:192)
  163. at sun.reflect.NativeMethodAccessorImpl.invoke0 (Native Method)
  164. at sun.reflect.NativeMethodAccessorImpl.invoke (NativeMethodAccessorImpl.java:62)
  165. at sun.reflect.DelegatingMethodAccessorImpl.invoke (DelegatingMethodAccessorImpl.java:43)
  166. at java.lang.reflect.Method.invoke (Method.java:498)
  167. at org.codehaus.plexus.classworlds.launcher.Launcher.launchEnhanced (Launcher.java:289)
  168. at org.codehaus.plexus.classworlds.launcher.Launcher.launch (Launcher.java:229)
  169. at org.codehaus.plexus.classworlds.launcher.Launcher.mainWithExitCode (Launcher.java:415)
  170. at org.codehaus.plexus.classworlds.launcher.Launcher.main (Launcher.java:356)
  171. [ERROR]
  172. [ERROR]
  173. [ERROR] For more information about the errors and possible solutions, please read the following articles:
  174. [ERROR] [Help 1] http://cwiki.apache.org/confluence/display/MAVEN/MojoFailureException
  175. [ERROR]
  176. [ERROR] After correcting the problems, you can resume the build with the command
  177. [ERROR] mvn <goals> -rf :openmrs-api
  178. irynah@irynah-Vostro-3560:~/Openmrs-Projects/trunk-5499/openmrs-core$
Advertisement
Add Comment
Please, Sign In to add comment
Advertisement