G2A Many GEOs
SHARE
TWEET

Untitled

a guest Mar 13th, 2017 52 Never
Not a member of Pastebin yet? Sign Up, it unlocks many cool features!
  1.  
  2. 1>------ Build started: Project: libcaffe, Configuration: Release x64 ------
  3. 1>C:\Program Files\caffe-windows\caffe-windows\windows\libcaffe\libcaffe.vcxproj(377,5): error : This project REFERENCES NuGet package(s) that are missing ON this computer. Enable NuGet Package Restore TO download them.  FOR more information, see http://GO.microsoft.com/fwlink/?LinkID=322105. The missing file IS ..\..\..\NugetPackages\OpenCV.2.4.10\build\native\OpenCV.props.
  4. 2>------ Build started: Project: caffe, Configuration: Release x64 ------
  5. 3>------ Build started: Project: convert_cifar_data, Configuration: Release x64 ------
  6. 4>------ Build started: Project: classification, Configuration: Release x64 ------
  7. 5>------ Build started: Project: convert_mnist_data, Configuration: Release x64 ------
  8. 2>C:\Program Files\caffe-windows\caffe-windows\windows\caffe\caffe.vcxproj(103,5): error : This project REFERENCES NuGet package(s) that are missing ON this computer. Enable NuGet Package Restore TO download them.  FOR more information, see http://GO.microsoft.com/fwlink/?LinkID=322105. The missing file IS ..\..\..\NugetPackages\OpenCV.2.4.10\build\native\OpenCV.props.
  9. 3>C:\Program Files\caffe-windows\caffe-windows\windows\convert_cifar_data\convert_cifar_data.vcxproj(93,5): error : This project REFERENCES NuGet package(s) that are missing ON this computer. Enable NuGet Package Restore TO download them.  FOR more information, see http://GO.microsoft.com/fwlink/?LinkID=322105. The missing file IS ..\..\..\NugetPackages\OpenCV.2.4.10\build\native\OpenCV.props.
  10. 5>C:\Program Files\caffe-windows\caffe-windows\windows\convert_mnist_data\convert_mnist_data.vcxproj(93,5): error : This project REFERENCES NuGet package(s) that are missing ON this computer. Enable NuGet Package Restore TO download them.  FOR more information, see http://GO.microsoft.com/fwlink/?LinkID=322105. The missing file IS ..\..\..\NugetPackages\OpenCV.2.4.10\build\native\OpenCV.props.
  11. 4>C:\Program Files\caffe-windows\caffe-windows\windows\classification\classification.vcxproj(93,5): error : This project REFERENCES NuGet package(s) that are missing ON this computer. Enable NuGet Package Restore TO download them.  FOR more information, see http://GO.microsoft.com/fwlink/?LinkID=322105. The missing file IS ..\..\..\NugetPackages\OpenCV.2.4.10\build\native\OpenCV.props.
  12. 6>------ Build started: Project: compute_image_mean, Configuration: Release x64 ------
  13. 6>C:\Program Files\caffe-windows\caffe-windows\windows\compute_image_mean\compute_image_mean.vcxproj(93,5): error : This project REFERENCES NuGet package(s) that are missing ON this computer. Enable NuGet Package Restore TO download them.  FOR more information, see http://GO.microsoft.com/fwlink/?LinkID=322105. The missing file IS ..\..\..\NugetPackages\OpenCV.2.4.10\build\native\OpenCV.props.
  14. 7>------ Build started: Project: convert_imageset, Configuration: Release x64 ------
  15. 8>------ Build started: Project: extract_features, Configuration: Release x64 ------
  16. 9>------ Build started: Project: test_all, Configuration: Release x64 ------
  17. 9>C:\Program Files\caffe-windows\caffe-windows\windows\test_all\test_all.vcxproj(203,5): error : This project REFERENCES NuGet package(s) that are missing ON this computer. Enable NuGet Package Restore TO download them.  FOR more information, see http://GO.microsoft.com/fwlink/?LinkID=322105. The missing file IS ..\..\..\NugetPackages\OpenCV.2.4.10\build\native\OpenCV.props.
  18. 7>C:\Program Files\caffe-windows\caffe-windows\windows\convert_imageset\convert_imageset.vcxproj(93,5): error : This project REFERENCES NuGet package(s) that are missing ON this computer. Enable NuGet Package Restore TO download them.  FOR more information, see http://GO.microsoft.com/fwlink/?LinkID=322105. The missing file IS ..\..\..\NugetPackages\OpenCV.2.4.10\build\native\OpenCV.props.
  19. 8>C:\Program Files\caffe-windows\caffe-windows\windows\extract_features\extract_features.vcxproj(99,5): error : This project REFERENCES NuGet package(s) that are missing ON this computer. Enable NuGet Package Restore TO download them.  FOR more information, see http://GO.microsoft.com/fwlink/?LinkID=322105. The missing file IS ..\..\..\NugetPackages\OpenCV.2.4.10\build\native\OpenCV.props.
  20. 10>------ Build started: Project: pycaffe, Configuration: Release x64 ------
  21. 10>C:\Program Files\caffe-windows\caffe-windows\windows\pycaffe\pycaffe.vcxproj(122,5): error : This project REFERENCES NuGet package(s) that are missing ON this computer. Enable NuGet Package Restore TO download them.  FOR more information, see http://GO.microsoft.com/fwlink/?LinkID=322105. The missing file IS ..\..\..\NugetPackages\OpenCV.2.4.10\build\native\OpenCV.props.
  22. 11>------ Build started: Project: matcaffe, Configuration: Release x64 ------
  23. 12>------ Build started: Project: convert_mnist_siamese_data, Configuration: Release x64 ------
  24. 13>------ Build started: Project: upgrade_net_proto_binary, Configuration: Release x64 ------
  25. 11>  Skipping project matcaffe, Matlab support IS NOT enabled IN CommonSettings.props.
  26. 14>------ Build started: Project: upgrade_net_proto_text, Configuration: Release x64 ------
  27. 13>C:\Program Files\caffe-windows\caffe-windows\windows\upgrade_net_proto_binary\upgrade_net_proto_binary.vcxproj(93,5): error : This project REFERENCES NuGet package(s) that are missing ON this computer. Enable NuGet Package Restore TO download them.  FOR more information, see http://GO.microsoft.com/fwlink/?LinkID=322105. The missing file IS ..\..\..\NugetPackages\OpenCV.2.4.10\build\native\OpenCV.props.
  28. 12>C:\Program Files\caffe-windows\caffe-windows\windows\convert_mnist_siamese_data\convert_mnist_siamese_data.vcxproj(93,5): error : This project REFERENCES NuGet package(s) that are missing ON this computer. Enable NuGet Package Restore TO download them.  FOR more information, see http://GO.microsoft.com/fwlink/?LinkID=322105. The missing file IS ..\..\..\NugetPackages\OpenCV.2.4.10\build\native\OpenCV.props.
  29. 15>------ Build started: Project: upgrade_solver_proto_text, Configuration: Release x64 ------
  30. 14>C:\Program Files\caffe-windows\caffe-windows\windows\upgrade_net_proto_text\upgrade_net_proto_text.vcxproj(93,5): error : This project REFERENCES NuGet package(s) that are missing ON this computer. Enable NuGet Package Restore TO download them.  FOR more information, see http://GO.microsoft.com/fwlink/?LinkID=322105. The missing file IS ..\..\..\NugetPackages\OpenCV.2.4.10\build\native\OpenCV.props.
  31. 15>C:\Program Files\caffe-windows\caffe-windows\windows\upgrade_solver_proto_text\upgrade_solver_proto_text.vcxproj(93,5): error : This project REFERENCES NuGet package(s) that are missing ON this computer. Enable NuGet Package Restore TO download them.  FOR more information, see http://GO.microsoft.com/fwlink/?LinkID=322105. The missing file IS ..\..\..\NugetPackages\OpenCV.2.4.10\build\native\OpenCV.props.
  32. ========== Build: 1 succeeded, 14 failed, 0 up-to-DATE, 0 skipped ==========
RAW Paste Data
Ledger Nano X - The secure hardware wallet
We use cookies for various purposes including analytics. By continuing to use Pastebin, you agree to our use of cookies as described in the Cookies Policy. OK, I Understand
Top