Advertisement
Guest User

Untitled

a guest
Aug 19th, 2021
45
Never
Not a member of Pastebin yet? Sign Up, it unlocks many cool features!
text 48.68 KB | None
  1. nTest
  2. [ERROR] deploy_shouldUpgradeDistroTo2_3_1(org.openmrs.maven.plugins.DeployIntegrationTest) Time elapsed: 4.83 s <<< ERROR!
  3. org.apache.maven.it.VerificationException:
  4. Exit code was non-zero: 127; command line and log =
  5. /opt/apache-maven-3.6.3/bin/mvn -DopenMRSPath=/home/sharif/Documents/openmrs-sdk/integration-tests/target/test-classes/integration-test -Ddistro=referenceapplication:2.2 -Ddebug=1044 -DdbDriver=mysql -DdbUser=mysql -DdbPassword=mysql -DdbUri=@DBNAME@ -DdbSql=null -DbatchAnswers=738d563d-c20b-4c78-bfba-711b11748d47,/usr/lib/jvm/java-8-openjdk-amd64/jre,8080 -e --batch-mode -Dmaven.repo.local=/home/sharif/.m2/repository org.apache.maven.plugins:maven-clean-plugin:clean org.openmrs.maven.plugins:openmrs-sdk-maven-plugin:4.2.0-SNAPSHOT:setup
  6. /bin/sh: 1: /opt/apache-maven-3.6.3/bin/mvn: not found
  7.  
  8. at org.openmrs.maven.plugins.DeployIntegrationTest.setupServer(DeployIntegrationTest.java:27)
  9.  
  10. [ERROR] deploy_shouldUpgradeDistroTo2_3_1(org.openmrs.maven.plugins.DeployIntegrationTest) Time elapsed: 4.831 s <<< ERROR!
  11. java.lang.NullPointerException
  12. at org.openmrs.maven.plugins.DeployIntegrationTest.deleteServer(DeployIntegrationTest.java:32)
  13.  
  14. [ERROR] deploy_shouldUpgradeDistroFromDistroProperties(org.openmrs.maven.plugins.DeployIntegrationTest) Time elapsed: 0.02 s <<< ERROR!
  15. org.apache.maven.it.VerificationException:
  16. Exit code was non-zero: 127; command line and log =
  17. /opt/apache-maven-3.6.3/bin/mvn -DopenMRSPath=/home/sharif/Documents/openmrs-sdk/integration-tests/target/test-classes/integration-test -Ddistro=referenceapplication:2.2 -Ddebug=1044 -DdbDriver=mysql -DdbUser=mysql -DdbPassword=mysql -DdbUri=@DBNAME@ -DdbSql=null -DbatchAnswers=9eea27f4-4109-41b6-a166-b08d73508466,/usr/lib/jvm/java-8-openjdk-amd64/jre,8080 -e --batch-mode -Dmaven.repo.local=/home/sharif/.m2/repository org.apache.maven.plugins:maven-clean-plugin:clean org.openmrs.maven.plugins:openmrs-sdk-maven-plugin:4.2.0-SNAPSHOT:setup
  18. /bin/sh: 1: /opt/apache-maven-3.6.3/bin/mvn: not found
  19.  
  20. at org.openmrs.maven.plugins.DeployIntegrationTest.setupServer(DeployIntegrationTest.java:27)
  21.  
  22. [ERROR] deploy_shouldUpgradeDistroFromDistroProperties(org.openmrs.maven.plugins.DeployIntegrationTest) Time elapsed: 0.02 s <<< ERROR!
  23. java.lang.NullPointerException
  24. at org.openmrs.maven.plugins.DeployIntegrationTest.deleteServer(DeployIntegrationTest.java:32)
  25.  
  26. [ERROR] deploy_shouldReplaceWebapp(org.openmrs.maven.plugins.DeployIntegrationTest) Time elapsed: 0.02 s <<< ERROR!
  27. org.apache.maven.it.VerificationException:
  28. Exit code was non-zero: 127; command line and log =
  29. /opt/apache-maven-3.6.3/bin/mvn -DopenMRSPath=/home/sharif/Documents/openmrs-sdk/integration-tests/target/test-classes/integration-test -Ddistro=referenceapplication:2.2 -Ddebug=1044 -DdbDriver=mysql -DdbUser=mysql -DdbPassword=mysql -DdbUri=@DBNAME@ -DdbSql=null -DbatchAnswers=b72055a5-b24b-4eff-8878-b75baaa2b03a,/usr/lib/jvm/java-8-openjdk-amd64/jre,8080 -e --batch-mode -Dmaven.repo.local=/home/sharif/.m2/repository org.apache.maven.plugins:maven-clean-plugin:clean org.openmrs.maven.plugins:openmrs-sdk-maven-plugin:4.2.0-SNAPSHOT:setup
  30. /bin/sh: 1: /opt/apache-maven-3.6.3/bin/mvn: not found
  31.  
  32. at org.openmrs.maven.plugins.DeployIntegrationTest.setupServer(DeployIntegrationTest.java:27)
  33.  
  34. [ERROR] deploy_shouldReplaceWebapp(org.openmrs.maven.plugins.DeployIntegrationTest) Time elapsed: 0.02 s <<< ERROR!
  35. java.lang.NullPointerException
  36. at org.openmrs.maven.plugins.DeployIntegrationTest.deleteServer(DeployIntegrationTest.java:32)
  37.  
  38. [ERROR] deploy_shouldDowngradeDistroTo2_1(org.openmrs.maven.plugins.DeployIntegrationTest) Time elapsed: 0.011 s <<< ERROR!
  39. org.apache.maven.it.VerificationException:
  40. Exit code was non-zero: 127; command line and log =
  41. /opt/apache-maven-3.6.3/bin/mvn -DopenMRSPath=/home/sharif/Documents/openmrs-sdk/integration-tests/target/test-classes/integration-test -Ddistro=referenceapplication:2.2 -Ddebug=1044 -DdbDriver=mysql -DdbUser=mysql -DdbPassword=mysql -DdbUri=@DBNAME@ -DdbSql=null -DbatchAnswers=316e0d6c-bf41-46ad-a820-68feb463f8c5,/usr/lib/jvm/java-8-openjdk-amd64/jre,8080 -e --batch-mode -Dmaven.repo.local=/home/sharif/.m2/repository org.apache.maven.plugins:maven-clean-plugin:clean org.openmrs.maven.plugins:openmrs-sdk-maven-plugin:4.2.0-SNAPSHOT:setup
  42. /bin/sh: 1: /opt/apache-maven-3.6.3/bin/mvn: not found
  43.  
  44. at org.openmrs.maven.plugins.DeployIntegrationTest.setupServer(DeployIntegrationTest.java:27)
  45.  
  46. [ERROR] deploy_shouldDowngradeDistroTo2_1(org.openmrs.maven.plugins.DeployIntegrationTest) Time elapsed: 0.012 s <<< ERROR!
  47. java.lang.NullPointerException
  48. at org.openmrs.maven.plugins.DeployIntegrationTest.deleteServer(DeployIntegrationTest.java:32)
  49.  
  50. [ERROR] deploy_shouldReplaceDistroPlatform(org.openmrs.maven.plugins.DeployIntegrationTest) Time elapsed: 0.021 s <<< ERROR!
  51. org.apache.maven.it.VerificationException:
  52. Exit code was non-zero: 127; command line and log =
  53. /opt/apache-maven-3.6.3/bin/mvn -DopenMRSPath=/home/sharif/Documents/openmrs-sdk/integration-tests/target/test-classes/integration-test -Ddistro=referenceapplication:2.2 -Ddebug=1044 -DdbDriver=mysql -DdbUser=mysql -DdbPassword=mysql -DdbUri=@DBNAME@ -DdbSql=null -DbatchAnswers=425a9637-302d-4d4e-a4cd-a76f768aad38,/usr/lib/jvm/java-8-openjdk-amd64/jre,8080 -e --batch-mode -Dmaven.repo.local=/home/sharif/.m2/repository org.apache.maven.plugins:maven-clean-plugin:clean org.openmrs.maven.plugins:openmrs-sdk-maven-plugin:4.2.0-SNAPSHOT:setup
  54. /bin/sh: 1: /opt/apache-maven-3.6.3/bin/mvn: not found
  55.  
  56. at org.openmrs.maven.plugins.DeployIntegrationTest.setupServer(DeployIntegrationTest.java:27)
  57.  
  58. [ERROR] deploy_shouldReplaceDistroPlatform(org.openmrs.maven.plugins.DeployIntegrationTest) Time elapsed: 0.022 s <<< ERROR!
  59. java.lang.NullPointerException
  60. at org.openmrs.maven.plugins.DeployIntegrationTest.deleteServer(DeployIntegrationTest.java:32)
  61.  
  62. [ERROR] deploy_shouldInstallModuleFromPomInDir(org.openmrs.maven.plugins.DeployIntegrationTest) Time elapsed: 0.011 s <<< ERROR!
  63. org.apache.maven.it.VerificationException:
  64. Exit code was non-zero: 127; command line and log =
  65. /opt/apache-maven-3.6.3/bin/mvn -DopenMRSPath=/home/sharif/Documents/openmrs-sdk/integration-tests/target/test-classes/integration-test -Ddistro=referenceapplication:2.2 -Ddebug=1044 -DdbDriver=mysql -DdbUser=mysql -DdbPassword=mysql -DdbUri=@DBNAME@ -DdbSql=null -DbatchAnswers=cd295791-04c2-4610-bf7c-fed26ec9295e,/usr/lib/jvm/java-8-openjdk-amd64/jre,8080 -e --batch-mode -Dmaven.repo.local=/home/sharif/.m2/repository org.apache.maven.plugins:maven-clean-plugin:clean org.openmrs.maven.plugins:openmrs-sdk-maven-plugin:4.2.0-SNAPSHOT:setup
  66. /bin/sh: 1: /opt/apache-maven-3.6.3/bin/mvn: not found
  67.  
  68. at org.openmrs.maven.plugins.DeployIntegrationTest.setupServer(DeployIntegrationTest.java:27)
  69.  
  70. [ERROR] deploy_shouldInstallModuleFromPomInDir(org.openmrs.maven.plugins.DeployIntegrationTest) Time elapsed: 0.011 s <<< ERROR!
  71. java.lang.NullPointerException
  72. at org.openmrs.maven.plugins.DeployIntegrationTest.deleteServer(DeployIntegrationTest.java:32)
  73.  
  74. [ERROR] deploy_shouldInstallModule(org.openmrs.maven.plugins.DeployIntegrationTest) Time elapsed: 0.025 s <<< ERROR!
  75. org.apache.maven.it.VerificationException:
  76. Exit code was non-zero: 127; command line and log =
  77. /opt/apache-maven-3.6.3/bin/mvn -DopenMRSPath=/home/sharif/Documents/openmrs-sdk/integration-tests/target/test-classes/integration-test -Ddistro=referenceapplication:2.2 -Ddebug=1044 -DdbDriver=mysql -DdbUser=mysql -DdbPassword=mysql -DdbUri=@DBNAME@ -DdbSql=null -DbatchAnswers=b38ff162-271e-43a4-9429-6a6073cfdc66,/usr/lib/jvm/java-8-openjdk-amd64/jre,8080 -e --batch-mode -Dmaven.repo.local=/home/sharif/.m2/repository org.apache.maven.plugins:maven-clean-plugin:clean org.openmrs.maven.plugins:openmrs-sdk-maven-plugin:4.2.0-SNAPSHOT:setup
  78. /bin/sh: 1: /opt/apache-maven-3.6.3/bin/mvn: not found
  79.  
  80. at org.openmrs.maven.plugins.DeployIntegrationTest.setupServer(DeployIntegrationTest.java:27)
  81.  
  82. [ERROR] deploy_shouldInstallModule(org.openmrs.maven.plugins.DeployIntegrationTest) Time elapsed: 0.025 s <<< ERROR!
  83. java.lang.NullPointerException
  84. at org.openmrs.maven.plugins.DeployIntegrationTest.deleteServer(DeployIntegrationTest.java:32)
  85.  
  86. [ERROR] deploy_shouldInstallOwaAndOwaModule(org.openmrs.maven.plugins.DeployIntegrationTest) Time elapsed: 0.01 s <<< ERROR!
  87. org.apache.maven.it.VerificationException:
  88. Exit code was non-zero: 127; command line and log =
  89. /opt/apache-maven-3.6.3/bin/mvn -DopenMRSPath=/home/sharif/Documents/openmrs-sdk/integration-tests/target/test-classes/integration-test -Ddistro=referenceapplication:2.2 -Ddebug=1044 -DdbDriver=mysql -DdbUser=mysql -DdbPassword=mysql -DdbUri=@DBNAME@ -DdbSql=null -DbatchAnswers=7cb7bc02-dfca-4545-af2a-a7c4f100b4cb,/usr/lib/jvm/java-8-openjdk-amd64/jre,8080 -e --batch-mode -Dmaven.repo.local=/home/sharif/.m2/repository org.apache.maven.plugins:maven-clean-plugin:clean org.openmrs.maven.plugins:openmrs-sdk-maven-plugin:4.2.0-SNAPSHOT:setup
  90. /bin/sh: 1: /opt/apache-maven-3.6.3/bin/mvn: not found
  91.  
  92. at org.openmrs.maven.plugins.DeployIntegrationTest.setupServer(DeployIntegrationTest.java:27)
  93.  
  94. [ERROR] deploy_shouldInstallOwaAndOwaModule(org.openmrs.maven.plugins.DeployIntegrationTest) Time elapsed: 0.01 s <<< ERROR!
  95. java.lang.NullPointerException
  96. at org.openmrs.maven.plugins.DeployIntegrationTest.deleteServer(DeployIntegrationTest.java:32)
  97.  
  98. [INFO] Running org.openmrs.maven.plugins.CloneIntegrationTest
  99. [ERROR] Tests run: 1, Failures: 0, Errors: 1, Skipped: 0, Time elapsed: 0.001 s <<< FAILURE! - in org.openmrs.maven.plugins.CloneIntegrationTest
  100. [ERROR] clone_shouldCloneRepository(org.openmrs.maven.plugins.CloneIntegrationTest) Time elapsed: 0 s <<< ERROR!
  101. org.apache.maven.it.VerificationException:
  102. Exit code was non-zero: 127; command line and log =
  103. /opt/apache-maven-3.6.3/bin/mvn -DopenMRSPath=/home/sharif/Documents/openmrs-sdk/integration-tests/target/test-classes/integration-test -DgroupId=org.openmrs.module -DartifactId=appui -DgithubUsername=tmarzeion -DgithubPassword=TEST CASE -DbatchAnswers= -DtestMode=true -e --batch-mode -Dmaven.repo.local=/home/sharif/.m2/repository org.apache.maven.plugins:maven-clean-plugin:clean org.openmrs.maven.plugins:openmrs-sdk-maven-plugin:4.2.0-SNAPSHOT:clone
  104. /bin/sh: 1: /opt/apache-maven-3.6.3/bin/mvn: not found
  105.  
  106. at org.openmrs.maven.plugins.CloneIntegrationTest.clone_shouldCloneRepository(CloneIntegrationTest.java:27)
  107.  
  108. [INFO] Running org.openmrs.maven.plugins.BuildIntegrationTest
  109. [ERROR] Tests run: 6, Failures: 0, Errors: 6, Skipped: 0, Time elapsed: 0.024 s <<< FAILURE! - in org.openmrs.maven.plugins.BuildIntegrationTest
  110. [ERROR] build_shouldBuildOwaProject(org.openmrs.maven.plugins.BuildIntegrationTest) Time elapsed: 0.003 s <<< ERROR!
  111. org.apache.maven.it.VerificationException:
  112. Exit code was non-zero: 127; command line and log =
  113. /opt/apache-maven-3.6.3/bin/mvn -DopenMRSPath=/home/sharif/Documents/openmrs-sdk/integration-tests/target/test-classes/integration-test/buildIT -Ddistro=referenceapplication:2.2 -Ddebug=1044 -DdbDriver=mysql -DdbUser=mysql -DdbPassword=mysql -DdbUri=@DBNAME@ -DdbSql=null -DbatchAnswers=5929f62c-15d6-4f5b-86dd-b4b59191d8ce,/usr/lib/jvm/java-8-openjdk-amd64/jre,8080 -e --batch-mode -Dmaven.repo.local=/home/sharif/.m2/repository org.apache.maven.plugins:maven-clean-plugin:clean org.openmrs.maven.plugins:openmrs-sdk-maven-plugin:4.2.0-SNAPSHOT:setup
  114. /bin/sh: 1: /opt/apache-maven-3.6.3/bin/mvn: not found
  115.  
  116. at org.openmrs.maven.plugins.BuildIntegrationTest.setup(BuildIntegrationTest.java:34)
  117.  
  118. [ERROR] build_shouldBuildOwaProject(org.openmrs.maven.plugins.BuildIntegrationTest) Time elapsed: 0.004 s <<< ERROR!
  119. java.lang.NullPointerException
  120. at org.openmrs.maven.plugins.BuildIntegrationTest.deleteServer(BuildIntegrationTest.java:48)
  121.  
  122. [ERROR] build_shouldBuildAllWatchedProjects(org.openmrs.maven.plugins.BuildIntegrationTest) Time elapsed: 0.01 s <<< ERROR!
  123. org.apache.maven.it.VerificationException:
  124. Exit code was non-zero: 127; command line and log =
  125. /opt/apache-maven-3.6.3/bin/mvn -DopenMRSPath=/home/sharif/Documents/openmrs-sdk/integration-tests/target/test-classes/integration-test/buildIT -Ddistro=referenceapplication:2.2 -Ddebug=1044 -DdbDriver=mysql -DdbUser=mysql -DdbPassword=mysql -DdbUri=@DBNAME@ -DdbSql=null -DbatchAnswers=7c6ce09b-3d7f-4f9f-a60f-16e81568137f,/usr/lib/jvm/java-8-openjdk-amd64/jre,8080 -e --batch-mode -Dmaven.repo.local=/home/sharif/.m2/repository org.apache.maven.plugins:maven-clean-plugin:clean org.openmrs.maven.plugins:openmrs-sdk-maven-plugin:4.2.0-SNAPSHOT:setup
  126. /bin/sh: 1: /opt/apache-maven-3.6.3/bin/mvn: not found
  127.  
  128. at org.openmrs.maven.plugins.BuildIntegrationTest.setup(BuildIntegrationTest.java:34)
  129.  
  130. [ERROR] build_shouldBuildAllWatchedProjects(org.openmrs.maven.plugins.BuildIntegrationTest) Time elapsed: 0.01 s <<< ERROR!
  131. java.lang.NullPointerException
  132. at org.openmrs.maven.plugins.BuildIntegrationTest.deleteServer(BuildIntegrationTest.java:48)
  133.  
  134. [ERROR] build_shouldDetectMavenProject(org.openmrs.maven.plugins.BuildIntegrationTest) Time elapsed: 0.009 s <<< ERROR!
  135. org.apache.maven.it.VerificationException:
  136. Exit code was non-zero: 127; command line and log =
  137. /opt/apache-maven-3.6.3/bin/mvn -DopenMRSPath=/home/sharif/Documents/openmrs-sdk/integration-tests/target/test-classes/integration-test/buildIT -Ddistro=referenceapplication:2.2 -Ddebug=1044 -DdbDriver=mysql -DdbUser=mysql -DdbPassword=mysql -DdbUri=@DBNAME@ -DdbSql=null -DbatchAnswers=0808ed04-ecaa-4255-b402-91d4206694f8,/usr/lib/jvm/java-8-openjdk-amd64/jre,8080 -e --batch-mode -Dmaven.repo.local=/home/sharif/.m2/repository org.apache.maven.plugins:maven-clean-plugin:clean org.openmrs.maven.plugins:openmrs-sdk-maven-plugin:4.2.0-SNAPSHOT:setup
  138. /bin/sh: 1: /opt/apache-maven-3.6.3/bin/mvn: not found
  139.  
  140. at org.openmrs.maven.plugins.BuildIntegrationTest.setup(BuildIntegrationTest.java:34)
  141.  
  142. [ERROR] build_shouldDetectMavenProject(org.openmrs.maven.plugins.BuildIntegrationTest) Time elapsed: 0.009 s <<< ERROR!
  143. java.lang.NullPointerException
  144. at org.openmrs.maven.plugins.BuildIntegrationTest.deleteServer(BuildIntegrationTest.java:48)
  145.  
  146. [INFO] Running org.openmrs.maven.plugins.BuildDistroIntegrationTest
  147. [ERROR] Tests run: 3, Failures: 0, Errors: 3, Skipped: 0, Time elapsed: 0.022 s <<< FAILURE! - in org.openmrs.maven.plugins.BuildDistroIntegrationTest
  148. [ERROR] testBuildDistroFromDistroFile(org.openmrs.maven.plugins.BuildDistroIntegrationTest) Time elapsed: 0 s <<< ERROR!
  149. org.apache.maven.it.VerificationException:
  150. Exit code was non-zero: 127; command line and log =
  151. /opt/apache-maven-3.6.3/bin/mvn -DopenMRSPath=/home/sharif/Documents/openmrs-sdk/integration-tests/target/test-classes/integration-test -Ddir=target -DbatchAnswers= -DtestMode=true -e --batch-mode -Dmaven.repo.local=/home/sharif/.m2/repository org.apache.maven.plugins:maven-clean-plugin:clean org.openmrs.maven.plugins:openmrs-sdk-maven-plugin:4.2.0-SNAPSHOT:build-distro
  152. /bin/sh: 1: /opt/apache-maven-3.6.3/bin/mvn: not found
  153.  
  154. at org.openmrs.maven.plugins.BuildDistroIntegrationTest.testBuildDistroFromDistroFile(BuildDistroIntegrationTest.java:13)
  155.  
  156. [ERROR] testBundledBuildDistro(org.openmrs.maven.plugins.BuildDistroIntegrationTest) Time elapsed: 0.005 s <<< ERROR!
  157. org.apache.maven.it.VerificationException:
  158. Exit code was non-zero: 127; command line and log =
  159. /opt/apache-maven-3.6.3/bin/mvn -DopenMRSPath=/home/sharif/Documents/openmrs-sdk/integration-tests/target/test-classes/integration-test -Ddistro=referenceapplication:2.3.1 -Ddir=referenceapplication-bundled -Dbundled=true -DbatchAnswers= -DtestMode=true -e --batch-mode -Dmaven.repo.local=/home/sharif/.m2/repository org.apache.maven.plugins:maven-clean-plugin:clean org.openmrs.maven.plugins:openmrs-sdk-maven-plugin:4.2.0-SNAPSHOT:build-distro
  160. /bin/sh: 1: /opt/apache-maven-3.6.3/bin/mvn: not found
  161.  
  162. at org.openmrs.maven.plugins.BuildDistroIntegrationTest.testBundledBuildDistro(BuildDistroIntegrationTest.java:56)
  163.  
  164. [ERROR] testBuildDistroRefApp23(org.openmrs.maven.plugins.BuildDistroIntegrationTest) Time elapsed: 0.017 s <<< ERROR!
  165. org.apache.maven.it.VerificationException:
  166. Exit code was non-zero: 127; command line and log =
  167. /opt/apache-maven-3.6.3/bin/mvn -DopenMRSPath=/home/sharif/Documents/openmrs-sdk/integration-tests/target/test-classes/integration-test -Ddistro=referenceapplication:2.3.1 -Ddir=referenceapplication -DbatchAnswers= -DtestMode=true -e --batch-mode -Dmaven.repo.local=/home/sharif/.m2/repository org.apache.maven.plugins:maven-clean-plugin:clean org.openmrs.maven.plugins:openmrs-sdk-maven-plugin:4.2.0-SNAPSHOT:build-distro
  168. /bin/sh: 1: /opt/apache-maven-3.6.3/bin/mvn: not found
  169.  
  170. at org.openmrs.maven.plugins.BuildDistroIntegrationTest.testBuildDistroRefApp23(BuildDistroIntegrationTest.java:35)
  171.  
  172. [INFO] Running org.openmrs.maven.plugins.CreateProjectIntegrationTest
  173. [ERROR] Tests run: 3, Failures: 0, Errors: 3, Skipped: 0, Time elapsed: 0.647 s <<< FAILURE! - in org.openmrs.maven.plugins.CreateProjectIntegrationTest
  174. [ERROR] createProject_shouldCreateRefappModuleProject(org.openmrs.maven.plugins.CreateProjectIntegrationTest) Time elapsed: 0.617 s <<< ERROR!
  175. org.apache.maven.it.VerificationException:
  176. Exit code was non-zero: 127; command line and log =
  177. /opt/apache-maven-3.6.3/bin/mvn -DopenMRSPath=/home/sharif/Documents/openmrs-sdk/integration-tests/target/test-classes/integration-test -Dtype=referenceapplication-module -DmoduleId=test -DmoduleName=Test -DmoduleDescription=none -DgroupId=org.openmrs.module -Dversion=1.0.0-SNAPSHOT -DbatchAnswers=2.4 -DbatchAnswers=2.4 -DtestMode=true -e --batch-mode -Dmaven.repo.local=/home/sharif/.m2/repository org.apache.maven.plugins:maven-clean-plugin:clean org.openmrs.maven.plugins:openmrs-sdk-maven-plugin:4.2.0-SNAPSHOT:create-project
  178. /bin/sh: 1: /opt/apache-maven-3.6.3/bin/mvn: not found
  179.  
  180. at org.openmrs.maven.plugins.CreateProjectIntegrationTest.createProject_shouldCreateRefappModuleProject(CreateProjectIntegrationTest.java:42)
  181.  
  182. [ERROR] createProject_shouldCreatePlatformModuleProject(org.openmrs.maven.plugins.CreateProjectIntegrationTest) Time elapsed: 0.019 s <<< ERROR!
  183. org.apache.maven.it.VerificationException:
  184. Exit code was non-zero: 127; command line and log =
  185. /opt/apache-maven-3.6.3/bin/mvn -DopenMRSPath=/home/sharif/Documents/openmrs-sdk/integration-tests/target/test-classes/integration-test -Dtype=platform-module -DmoduleId=test -DmoduleName=Test -DmoduleDescription=none -DgroupId=org.openmrs.module -Dversion=1.0.0-SNAPSHOT -DbatchAnswers=1.11.6 -DbatchAnswers=1.11.6 -DtestMode=true -e --batch-mode -Dmaven.repo.local=/home/sharif/.m2/repository org.apache.maven.plugins:maven-clean-plugin:clean org.openmrs.maven.plugins:openmrs-sdk-maven-plugin:4.2.0-SNAPSHOT:create-project
  186. /bin/sh: 1: /opt/apache-maven-3.6.3/bin/mvn: not found
  187.  
  188. at org.openmrs.maven.plugins.CreateProjectIntegrationTest.createProject_shouldCreatePlatformModuleProject(CreateProjectIntegrationTest.java:75)
  189.  
  190. [ERROR] createProject_shouldCreateRefappModuleProjectUsingBatchAnswers(org.openmrs.maven.plugins.CreateProjectIntegrationTest) Time elapsed: 0.01 s <<< ERROR!
  191. org.apache.maven.it.VerificationException:
  192. Exit code was non-zero: 127; command line and log =
  193. /opt/apache-maven-3.6.3/bin/mvn -DopenMRSPath=/home/sharif/Documents/openmrs-sdk/integration-tests/target/test-classes/integration-test -DbatchAnswers=Reference Application module,test,Test,none,org.openmrs.module,1.0.0-SNAPSHOT,2.4 -DtestMode=true -e --batch-mode -Dmaven.repo.local=/home/sharif/.m2/repository org.apache.maven.plugins:maven-clean-plugin:clean org.openmrs.maven.plugins:openmrs-sdk-maven-plugin:4.2.0-SNAPSHOT:create-project
  194. /bin/sh: 1: /opt/apache-maven-3.6.3/bin/mvn: not found
  195.  
  196. at org.openmrs.maven.plugins.CreateProjectIntegrationTest.createProject_shouldCreateRefappModuleProjectUsingBatchAnswers(CreateProjectIntegrationTest.java:57)
  197.  
  198. [INFO] Running org.openmrs.maven.plugins.SetupIntegrationTest
  199. [ERROR] Tests run: 12, Failures: 0, Errors: 12, Skipped: 0, Time elapsed: 0.251 s <<< FAILURE! - in org.openmrs.maven.plugins.SetupIntegrationTest
  200. [ERROR] setup_shouldInstallServerWithSpecifiedLatestSnapshotDistroVersionByUsingKeywordInInteractiveMode(org.openmrs.maven.plugins.SetupIntegrationTest) Time elapsed: 0.012 s <<< ERROR!
  201. org.apache.maven.it.VerificationException:
  202. Exit code was non-zero: 127; command line and log =
  203. /opt/apache-maven-3.6.3/bin/mvn -DopenMRSPath=/home/sharif/Documents/openmrs-sdk/integration-tests/target/test-classes/integration-test -Ddebug=1044 -DdbDriver=mysql -DdbUser=mysql -DdbPassword=mysql -DdbUri=@DBNAME@ -DdbSql=null -DbatchAnswers=28b2ac57-2ca4-47bf-b21d-2e22d47d5b12,Platform,LATEST-SNAPSHOT,/usr/lib/jvm/java-8-openjdk-amd64/jre,8080 -DtestMode=true -e --batch-mode -Dmaven.repo.local=/home/sharif/.m2/repository org.apache.maven.plugins:maven-clean-plugin:clean org.openmrs.maven.plugins:openmrs-sdk-maven-plugin:4.2.0-SNAPSHOT:setup
  204. /bin/sh: 1: /opt/apache-maven-3.6.3/bin/mvn: not found
  205.  
  206. at org.openmrs.maven.plugins.SetupIntegrationTest.setup_shouldInstallServerWithSpecifiedLatestSnapshotDistroVersionByUsingKeywordInInteractiveMode(SetupIntegrationTest.java:244)
  207.  
  208. [ERROR] setup_shouldInstallDistroPlatform2_0_2(org.openmrs.maven.plugins.SetupIntegrationTest) Time elapsed: 0.031 s <<< ERROR!
  209. org.apache.maven.it.VerificationException:
  210. Exit code was non-zero: 127; command line and log =
  211. /opt/apache-maven-3.6.3/bin/mvn -DopenMRSPath=/home/sharif/Documents/openmrs-sdk/integration-tests/target/test-classes/integration-test -Dplatform=2.0.2 -DdbDriver=mysql -DdbUser=mysql -DdbPassword=mysql -DdbUri=@DBNAME@ -DdbSql=null -DbatchAnswers=e91a0b15-438c-4ed3-9a97-31e141c1b884,8080,1044,/usr/lib/jvm/java-8-openjdk-amd64/jre -DtestMode=true -e --batch-mode -Dmaven.repo.local=/home/sharif/.m2/repository org.apache.maven.plugins:maven-clean-plugin:clean org.openmrs.maven.plugins:openmrs-sdk-maven-plugin:4.2.0-SNAPSHOT:setup
  212. /bin/sh: 1: /opt/apache-maven-3.6.3/bin/mvn: not found
  213.  
  214. at org.openmrs.maven.plugins.SetupIntegrationTest.setup_shouldInstallDistroPlatform2_0_2(SetupIntegrationTest.java:96)
  215.  
  216. [ERROR] setup_shouldInstallServerFromDistroPropertiesDir(org.openmrs.maven.plugins.SetupIntegrationTest) Time elapsed: 0.026 s <<< ERROR!
  217. org.apache.maven.it.VerificationException:
  218. Exit code was non-zero: 127; command line and log =
  219. /opt/apache-maven-3.6.3/bin/mvn -DopenMRSPath=/home/sharif/Documents/openmrs-sdk/integration-tests/target/test-classes/integration-test -DserverId=249b79dc-0875-4b3f-8c64-0ad5b62d36cf -Ddebug=1044 -DdbDriver=mysql -DdbUser=mysql -DdbPassword=mysql -DdbUri=@DBNAME@ -DdbSql=null -DbatchAnswers=OpenMRS Concepts OWA server 1.0 from current directory,nameValue,/usr/lib/jvm/java-8-openjdk-amd64/jre,8080 -DtestMode=true -e --batch-mode -Dmaven.repo.local=/home/sharif/.m2/repository org.apache.maven.plugins:maven-clean-plugin:clean org.openmrs.maven.plugins:openmrs-sdk-maven-plugin:4.2.0-SNAPSHOT:setup
  220. /bin/sh: 1: /opt/apache-maven-3.6.3/bin/mvn: not found
  221.  
  222. at org.openmrs.maven.plugins.SetupIntegrationTest.setup_shouldInstallServerFromDistroPropertiesDir(SetupIntegrationTest.java:152)
  223.  
  224. [ERROR] setup_shouldInstallServerWithDefaultJavaHome(org.openmrs.maven.plugins.SetupIntegrationTest) Time elapsed: 0.021 s <<< ERROR!
  225. org.apache.maven.it.VerificationException:
  226. Exit code was non-zero: 127; command line and log =
  227. /opt/apache-maven-3.6.3/bin/mvn -DopenMRSPath=/home/sharif/Documents/openmrs-sdk/integration-tests/target/test-classes/integration-test -Ddebug=1044 -DdbDriver=mysql -DdbUser=mysql -DdbPassword=mysql -DdbUri=@DBNAME@ -DdbSql=null -DbatchAnswers=351eafc5-b8f3-4620-8f0a-640d683e34f1,Distribution,referenceapplication:2.2,/usr/lib/jvm/java-8-openjdk-amd64/jre,8080 -DtestMode=true -e --batch-mode -Dmaven.repo.local=/home/sharif/.m2/repository org.apache.maven.plugins:maven-clean-plugin:clean org.openmrs.maven.plugins:openmrs-sdk-maven-plugin:4.2.0-SNAPSHOT:setup
  228. /bin/sh: 1: /opt/apache-maven-3.6.3/bin/mvn: not found
  229.  
  230. at org.openmrs.maven.plugins.SetupIntegrationTest.setup_shouldInstallServerWithDefaultJavaHome(SetupIntegrationTest.java:190)
  231.  
  232. [ERROR] setup_shouldInstallServerFromGivenDistroProperties(org.openmrs.maven.plugins.SetupIntegrationTest) Time elapsed: 0.037 s <<< ERROR!
  233. org.apache.maven.it.VerificationException:
  234. Exit code was non-zero: 127; command line and log =
  235. /opt/apache-maven-3.6.3/bin/mvn -DopenMRSPath=/home/sharif/Documents/openmrs-sdk/integration-tests/target/test-classes/integration-test -Ddistro=/home/sharif/Documents/openmrs-sdk/integration-tests/target/test-classes/integration-test/openmrs-distro.properties -Ddebug=1044 -DdbDriver=mysql -DdbUser=mysql -DdbPassword=mysql -DdbUri=@DBNAME@ -DdbSql=null -DbatchAnswers=8b7af518-4c0d-4d2d-a7c5-90ceee6589b1,nameValue,/usr/lib/jvm/java-8-openjdk-amd64/jre,8080 -DtestMode=true -e --batch-mode -Dmaven.repo.local=/home/sharif/.m2/repository org.apache.maven.plugins:maven-clean-plugin:clean org.openmrs.maven.plugins:openmrs-sdk-maven-plugin:4.2.0-SNAPSHOT:setup
  236. /bin/sh: 1: /opt/apache-maven-3.6.3/bin/mvn: not found
  237.  
  238. at org.openmrs.maven.plugins.SetupIntegrationTest.setup_shouldInstallServerFromGivenDistroProperties(SetupIntegrationTest.java:124)
  239.  
  240. [ERROR] setup_shouldInstallServerWithSpecifiedLatestReleasedDistroVersionByUsingKeywordInBatchMode(org.openmrs.maven.plugins.SetupIntegrationTest) Time elapsed: 0.007 s <<< ERROR!
  241. org.apache.maven.it.VerificationException:
  242. Exit code was non-zero: 127; command line and log =
  243. /opt/apache-maven-3.6.3/bin/mvn -DopenMRSPath=/home/sharif/Documents/openmrs-sdk/integration-tests/target/test-classes/integration-test -Ddebug=1044 -Dplatform=LATEST -DdbDriver=mysql -DdbUser=mysql -DdbPassword=mysql -DdbUri=@DBNAME@ -DdbSql=null -DbatchAnswers=a68f09e7-e6e6-4627-b010-a7f760d3a99e,/usr/lib/jvm/java-8-openjdk-amd64/jre,8080 -DtestMode=true -e --batch-mode -Dmaven.repo.local=/home/sharif/.m2/repository org.apache.maven.plugins:maven-clean-plugin:clean org.openmrs.maven.plugins:openmrs-sdk-maven-plugin:4.2.0-SNAPSHOT:setup
  244. /bin/sh: 1: /opt/apache-maven-3.6.3/bin/mvn: not found
  245.  
  246. at org.openmrs.maven.plugins.SetupIntegrationTest.setup_shouldInstallServerWithSpecifiedLatestReleasedDistroVersionByUsingKeywordInBatchMode(SetupIntegrationTest.java:272)
  247.  
  248. [ERROR] setup_shouldInstallPlatform1_11_5(org.openmrs.maven.plugins.SetupIntegrationTest) Time elapsed: 0.016 s <<< ERROR!
  249. org.apache.maven.it.VerificationException:
  250. Exit code was non-zero: 127; command line and log =
  251. /opt/apache-maven-3.6.3/bin/mvn -DopenMRSPath=/home/sharif/Documents/openmrs-sdk/integration-tests/target/test-classes/integration-test -Dplatform=1.11.5 -DdbDriver=mysql -DdbUser=mysql -DdbPassword=mysql -DdbUri=@DBNAME@ -DdbSql=null -DbatchAnswers=845f9495-91af-467c-b8ee-48bfd7cdf92e,8080,1044,/usr/lib/jvm/java-8-openjdk-amd64/jre -DtestMode=true -e --batch-mode -Dmaven.repo.local=/home/sharif/.m2/repository org.apache.maven.plugins:maven-clean-plugin:clean org.openmrs.maven.plugins:openmrs-sdk-maven-plugin:4.2.0-SNAPSHOT:setup
  252. /bin/sh: 1: /opt/apache-maven-3.6.3/bin/mvn: not found
  253.  
  254. at org.openmrs.maven.plugins.SetupIntegrationTest.setup_shouldInstallPlatform1_11_5(SetupIntegrationTest.java:68)
  255.  
  256. [ERROR] setup_shouldInstallRefapp2_3_1(org.openmrs.maven.plugins.SetupIntegrationTest) Time elapsed: 0.03 s <<< ERROR!
  257. org.apache.maven.it.VerificationException:
  258. Exit code was non-zero: 127; command line and log =
  259. /opt/apache-maven-3.6.3/bin/mvn -DopenMRSPath=/home/sharif/Documents/openmrs-sdk/integration-tests/target/test-classes/integration-test -Ddistro=referenceapplication:2.3.1 -DdbDriver=mysql -DdbUser=mysql -DdbPassword=mysql -DdbUri=@DBNAME@ -DdbSql=null -DbatchAnswers=50fe09ee-8c70-4173-b4a2-0dac702d05e5,8080,1044,/usr/lib/jvm/java-8-openjdk-amd64/jre -DtestMode=true -e --batch-mode -Dmaven.repo.local=/home/sharif/.m2/repository org.apache.maven.plugins:maven-clean-plugin:clean org.openmrs.maven.plugins:openmrs-sdk-maven-plugin:4.2.0-SNAPSHOT:setup
  260. /bin/sh: 1: /opt/apache-maven-3.6.3/bin/mvn: not found
  261.  
  262. at org.openmrs.maven.plugins.SetupIntegrationTest.setup_shouldInstallRefapp2_3_1(SetupIntegrationTest.java:39)
  263.  
  264. [ERROR] setup_shouldInstallServerWithSpecifiedLatestSnapshotDistroVersionByUsingKeywordInBatchMode(org.openmrs.maven.plugins.SetupIntegrationTest) Time elapsed: 0.028 s <<< ERROR!
  265. org.apache.maven.it.VerificationException:
  266. Exit code was non-zero: 127; command line and log =
  267. /opt/apache-maven-3.6.3/bin/mvn -DopenMRSPath=/home/sharif/Documents/openmrs-sdk/integration-tests/target/test-classes/integration-test -Ddebug=1044 -Dplatform=LATEST-SNAPSHOT -DdbDriver=mysql -DdbUser=mysql -DdbPassword=mysql -DdbUri=@DBNAME@ -DdbSql=null -DbatchAnswers=4d542671-8384-408c-89d0-b5656aca5f27,/usr/lib/jvm/java-8-openjdk-amd64/jre,8080 -DtestMode=true -e --batch-mode -Dmaven.repo.local=/home/sharif/.m2/repository org.apache.maven.plugins:maven-clean-plugin:clean org.openmrs.maven.plugins:openmrs-sdk-maven-plugin:4.2.0-SNAPSHOT:setup
  268. /bin/sh: 1: /opt/apache-maven-3.6.3/bin/mvn: not found
  269.  
  270. at org.openmrs.maven.plugins.SetupIntegrationTest.setup_shouldInstallServerWithSpecifiedLatestSnapshotDistroVersionByUsingKeywordInBatchMode(SetupIntegrationTest.java:214)
  271.  
  272. [ERROR] setup_shouldInstallServerWithGivenJavaHomeAndAddJavaHomeToSdkProperties(org.openmrs.maven.plugins.SetupIntegrationTest) Time elapsed: 0.028 s <<< ERROR!
  273. org.apache.maven.it.VerificationException:
  274. Exit code was non-zero: 127; command line and log =
  275. /opt/apache-maven-3.6.3/bin/mvn -DopenMRSPath=/home/sharif/Documents/openmrs-sdk/integration-tests/target/test-classes/integration-test -DjavaHome=/usr/lib/jvm/java-8-openjdk-amd64/jre -DdbDriver=mysql -DdbUser=mysql -DdbPassword=mysql -DdbUri=@DBNAME@ -DdbSql=null -DbatchAnswers=146d2eec-b7c8-4974-8912-2367142a6978,Distribution,referenceapplication:2.2,8080,1044 -DtestMode=true -e --batch-mode -Dmaven.repo.local=/home/sharif/.m2/repository org.apache.maven.plugins:maven-clean-plugin:clean org.openmrs.maven.plugins:openmrs-sdk-maven-plugin:4.2.0-SNAPSHOT:setup
  276. /bin/sh: 1: /opt/apache-maven-3.6.3/bin/mvn: not found
  277.  
  278. at org.openmrs.maven.plugins.SetupIntegrationTest.setup_shouldInstallServerWithGivenJavaHomeAndAddJavaHomeToSdkProperties(SetupIntegrationTest.java:333)
  279.  
  280. [ERROR] setup_shouldInstallWithParentDistroSpecifiedInDistroProperties(org.openmrs.maven.plugins.SetupIntegrationTest) Time elapsed: 0.006 s <<< ERROR!
  281. org.apache.maven.it.VerificationException:
  282. Exit code was non-zero: 127; command line and log =
  283. /opt/apache-maven-3.6.3/bin/mvn -DopenMRSPath=/home/sharif/Documents/openmrs-sdk/integration-tests/target/test-classes/integration-test -Ddistro=/home/sharif/Documents/openmrs-sdk/integration-tests/target/test-classes/integration-test/parent-distro-properties/openmrs-distro.properties -DdbDriver=mysql -DdbUser=mysql -DdbPassword=mysql -DdbUri=@DBNAME@ -DdbSql=null -DbatchAnswers=17be1e5b-d239-48c8-91ef-33e60fb0a6cb,1044,8080 -DtestMode=true -e --batch-mode -Dmaven.repo.local=/home/sharif/.m2/repository org.apache.maven.plugins:maven-clean-plugin:clean org.openmrs.maven.plugins:openmrs-sdk-maven-plugin:4.2.0-SNAPSHOT:setup
  284. /bin/sh: 1: /opt/apache-maven-3.6.3/bin/mvn: not found
  285.  
  286. at org.openmrs.maven.plugins.SetupIntegrationTest.setup_shouldInstallWithParentDistroSpecifiedInDistroProperties(SetupIntegrationTest.java:363)
  287.  
  288. [ERROR] setup_shouldInstallServerWithSpecifiedLatestReleasedDistroVersionByUsingKeywordInInteractiveMode(org.openmrs.maven.plugins.SetupIntegrationTest) Time elapsed: 0.007 s <<< ERROR!
  289. org.apache.maven.it.VerificationException:
  290. Exit code was non-zero: 127; command line and log =
  291. /opt/apache-maven-3.6.3/bin/mvn -DopenMRSPath=/home/sharif/Documents/openmrs-sdk/integration-tests/target/test-classes/integration-test -Ddebug=1044 -DdbDriver=mysql -DdbUser=mysql -DdbPassword=mysql -DdbUri=@DBNAME@ -DdbSql=null -DbatchAnswers=1bf58fa1-659c-409d-9907-1baa5145500e,Platform,LATEST,/usr/lib/jvm/java-8-openjdk-amd64/jre,8080 -DtestMode=true -e --batch-mode -Dmaven.repo.local=/home/sharif/.m2/repository org.apache.maven.plugins:maven-clean-plugin:clean org.openmrs.maven.plugins:openmrs-sdk-maven-plugin:4.2.0-SNAPSHOT:setup
  292. /bin/sh: 1: /opt/apache-maven-3.6.3/bin/mvn: not found
  293.  
  294. at org.openmrs.maven.plugins.SetupIntegrationTest.setup_shouldInstallServerWithSpecifiedLatestReleasedDistroVersionByUsingKeywordInInteractiveMode(SetupIntegrationTest.java:302)
  295.  
  296. [INFO] Running org.openmrs.maven.plugins.PullIntegrationTest
  297. [ERROR] Tests run: 8, Failures: 0, Errors: 8, Skipped: 0, Time elapsed: 0.11 s <<< FAILURE! - in org.openmrs.maven.plugins.PullIntegrationTest
  298. [ERROR] shouldNotifyThereIsNoWatchedProjects(org.openmrs.maven.plugins.PullIntegrationTest) Time elapsed: 0 s <<< ERROR!
  299. org.apache.maven.it.VerificationException:
  300. Exit code was non-zero: 127; command line and log =
  301. /opt/apache-maven-3.6.3/bin/mvn -DopenMRSPath=/home/sharif/Documents/openmrs-sdk/integration-tests/target/test-classes/integration-test -Ddistro=referenceapplication:2.2 -Ddebug=1044 -DdbDriver=mysql -DdbUser=mysql -DdbPassword=mysql -DdbUri=@DBNAME@ -DdbSql=null -DbatchAnswers=a561bf5b-1964-4be5-b595-d9ac9c2f6d64,/usr/lib/jvm/java-8-openjdk-amd64/jre,8080 -e --batch-mode -Dmaven.repo.local=/home/sharif/.m2/repository org.apache.maven.plugins:maven-clean-plugin:clean org.openmrs.maven.plugins:openmrs-sdk-maven-plugin:4.2.0-SNAPSHOT:setup
  302. /bin/sh: 1: /opt/apache-maven-3.6.3/bin/mvn: not found
  303.  
  304. at org.openmrs.maven.plugins.PullIntegrationTest.setup(PullIntegrationTest.java:34)
  305.  
  306. [ERROR] shouldNotifyThereIsNoWatchedProjects(org.openmrs.maven.plugins.PullIntegrationTest) Time elapsed: 0 s <<< ERROR!
  307. java.lang.NullPointerException
  308. at org.openmrs.maven.plugins.PullIntegrationTest.teardown(PullIntegrationTest.java:44)
  309.  
  310. [ERROR] shouldUpdateGitProjectFromDir(org.openmrs.maven.plugins.PullIntegrationTest) Time elapsed: 0 s <<< ERROR!
  311. org.apache.maven.it.VerificationException:
  312. Exit code was non-zero: 127; command line and log =
  313. /opt/apache-maven-3.6.3/bin/mvn -DopenMRSPath=/home/sharif/Documents/openmrs-sdk/integration-tests/target/test-classes/integration-test -Ddistro=referenceapplication:2.2 -Ddebug=1044 -DdbDriver=mysql -DdbUser=mysql -DdbPassword=mysql -DdbUri=@DBNAME@ -DdbSql=null -DbatchAnswers=cbcfbf86-1511-4f21-a266-1439e0577b00,/usr/lib/jvm/java-8-openjdk-amd64/jre,8080 -e --batch-mode -Dmaven.repo.local=/home/sharif/.m2/repository org.apache.maven.plugins:maven-clean-plugin:clean org.openmrs.maven.plugins:openmrs-sdk-maven-plugin:4.2.0-SNAPSHOT:setup
  314. /bin/sh: 1: /opt/apache-maven-3.6.3/bin/mvn: not found
  315.  
  316. at org.openmrs.maven.plugins.PullIntegrationTest.setup(PullIntegrationTest.java:34)
  317.  
  318. [ERROR] shouldUpdateGitProjectFromDir(org.openmrs.maven.plugins.PullIntegrationTest) Time elapsed: 0 s <<< ERROR!
  319. java.lang.NullPointerException
  320. at org.openmrs.maven.plugins.PullIntegrationTest.teardown(PullIntegrationTest.java:44)
  321.  
  322. [ERROR] shouldUpdateWatchedProjectsWithGivenServerIdFromGitProjectDir(org.openmrs.maven.plugins.PullIntegrationTest) Time elapsed: 0.003 s <<< ERROR!
  323. org.apache.maven.it.VerificationException:
  324. Exit code was non-zero: 127; command line and log =
  325. /opt/apache-maven-3.6.3/bin/mvn -DopenMRSPath=/home/sharif/Documents/openmrs-sdk/integration-tests/target/test-classes/integration-test -Ddistro=referenceapplication:2.2 -Ddebug=1044 -DdbDriver=mysql -DdbUser=mysql -DdbPassword=mysql -DdbUri=@DBNAME@ -DdbSql=null -DbatchAnswers=7638650b-d2da-4841-9fb8-8f505fd51052,/usr/lib/jvm/java-8-openjdk-amd64/jre,8080 -e --batch-mode -Dmaven.repo.local=/home/sharif/.m2/repository org.apache.maven.plugins:maven-clean-plugin:clean org.openmrs.maven.plugins:openmrs-sdk-maven-plugin:4.2.0-SNAPSHOT:setup
  326. /bin/sh: 1: /opt/apache-maven-3.6.3/bin/mvn: not found
  327.  
  328. at org.openmrs.maven.plugins.PullIntegrationTest.setup(PullIntegrationTest.java:34)
  329.  
  330. [ERROR] shouldUpdateWatchedProjectsWithGivenServerIdFromGitProjectDir(org.openmrs.maven.plugins.PullIntegrationTest) Time elapsed: 0.003 s <<< ERROR!
  331. java.lang.NullPointerException
  332. at org.openmrs.maven.plugins.PullIntegrationTest.teardown(PullIntegrationTest.java:44)
  333.  
  334. [ERROR] shouldUpdateWatchedProjectsToLatestUpstreamMaster(org.openmrs.maven.plugins.PullIntegrationTest) Time elapsed: 0.106 s <<< ERROR!
  335. org.apache.maven.it.VerificationException:
  336. Exit code was non-zero: 127; command line and log =
  337. /opt/apache-maven-3.6.3/bin/mvn -DopenMRSPath=/home/sharif/Documents/openmrs-sdk/integration-tests/target/test-classes/integration-test -Ddistro=referenceapplication:2.2 -Ddebug=1044 -DdbDriver=mysql -DdbUser=mysql -DdbPassword=mysql -DdbUri=@DBNAME@ -DdbSql=null -DbatchAnswers=1d176ba5-bb67-4c84-9c70-17671d615401,/usr/lib/jvm/java-8-openjdk-amd64/jre,8080 -e --batch-mode -Dmaven.repo.local=/home/sharif/.m2/repository org.apache.maven.plugins:maven-clean-plugin:clean org.openmrs.maven.plugins:openmrs-sdk-maven-plugin:4.2.0-SNAPSHOT:setup
  338. /bin/sh: 1: /opt/apache-maven-3.6.3/bin/mvn: not found
  339.  
  340. at org.openmrs.maven.plugins.PullIntegrationTest.setup(PullIntegrationTest.java:34)
  341.  
  342. [ERROR] shouldUpdateWatchedProjectsToLatestUpstreamMaster(org.openmrs.maven.plugins.PullIntegrationTest) Time elapsed: 0.106 s <<< ERROR!
  343. java.lang.NullPointerException
  344. at org.openmrs.maven.plugins.PullIntegrationTest.teardown(PullIntegrationTest.java:44)
  345.  
  346. [INFO] Running org.openmrs.maven.plugins.FetchIntegrationTest
  347. [ERROR] Tests run: 3, Failures: 0, Errors: 3, Skipped: 0, Time elapsed: 0.029 s <<< FAILURE! - in org.openmrs.maven.plugins.FetchIntegrationTest
  348. [ERROR] fetch_shouldDownloadProjectInBatchModeWithVersionSpecifiedInProjectName(org.openmrs.maven.plugins.FetchIntegrationTest) Time elapsed: 0.003 s <<< ERROR!
  349. org.apache.maven.it.VerificationException:
  350. Exit code was non-zero: 127; command line and log =
  351. /opt/apache-maven-3.6.3/bin/mvn -DopenMRSPath=/home/sharif/Documents/openmrs-sdk/integration-tests/target/test-classes/integration-test -Ddir=/home/sharif/Documents/openmrs-sdk/integration-tests/target/test-classes/integration-test/fetch -DartifactId=owa:1.5 -DbatchAnswers= -DtestMode=true -e --batch-mode -Dmaven.repo.local=/home/sharif/.m2/repository org.apache.maven.plugins:maven-clean-plugin:clean org.openmrs.maven.plugins:openmrs-sdk-maven-plugin:4.2.0-SNAPSHOT:fetch
  352. /bin/sh: 1: /opt/apache-maven-3.6.3/bin/mvn: not found
  353.  
  354. at org.openmrs.maven.plugins.FetchIntegrationTest.fetch_shouldDownloadProjectInBatchModeWithVersionSpecifiedInProjectName(FetchIntegrationTest.java:34)
  355.  
  356. [ERROR] fetch_shouldDownloadProjectInInteractiveMode(org.openmrs.maven.plugins.FetchIntegrationTest) Time elapsed: 0.008 s <<< ERROR!
  357. org.apache.maven.it.VerificationException:
  358. Exit code was non-zero: 127; command line and log =
  359. /opt/apache-maven-3.6.3/bin/mvn -DopenMRSPath=/home/sharif/Documents/openmrs-sdk/integration-tests/target/test-classes/integration-test -Ddir=/home/sharif/Documents/openmrs-sdk/integration-tests/target/test-classes/integration-test/fetch -DbatchAnswers=Module,webservices.rest,2.16 -DtestMode=true -e --batch-mode -Dmaven.repo.local=/home/sharif/.m2/repository org.apache.maven.plugins:maven-clean-plugin:clean org.openmrs.maven.plugins:openmrs-sdk-maven-plugin:4.2.0-SNAPSHOT:fetch
  360. /bin/sh: 1: /opt/apache-maven-3.6.3/bin/mvn: not found
  361.  
  362. at org.openmrs.maven.plugins.FetchIntegrationTest.fetch_shouldDownloadProjectInInteractiveMode(FetchIntegrationTest.java:53)
  363.  
  364. [ERROR] fetch_shouldDownloadProjectInBatchModeWithVersionSpecifiedInVersion(org.openmrs.maven.plugins.FetchIntegrationTest) Time elapsed: 0.017 s <<< ERROR!
  365. org.apache.maven.it.VerificationException:
  366. Exit code was non-zero: 127; command line and log =
  367. /opt/apache-maven-3.6.3/bin/mvn -DopenMRSPath=/home/sharif/Documents/openmrs-sdk/integration-tests/target/test-classes/integration-test -Ddir=/home/sharif/Documents/openmrs-sdk/integration-tests/target/test-classes/integration-test/fetch -Dowa=conceptdictionary -Dversion=1.0.0 -DbatchAnswers= -DtestMode=true -e --batch-mode -Dmaven.repo.local=/home/sharif/.m2/repository org.apache.maven.plugins:maven-clean-plugin:clean org.openmrs.maven.plugins:openmrs-sdk-maven-plugin:4.2.0-SNAPSHOT:fetch
  368. /bin/sh: 1: /opt/apache-maven-3.6.3/bin/mvn: not found
  369.  
  370. at org.openmrs.maven.plugins.FetchIntegrationTest.fetch_shouldDownloadProjectInBatchModeWithVersionSpecifiedInVersion(FetchIntegrationTest.java:43)
  371.  
  372. [INFO]
  373. [INFO] Results:
  374. [INFO]
  375. [ERROR] Errors:
  376. [ERROR] BuildDistroIntegrationTest.testBuildDistroFromDistroFile:13->AbstractSdkIntegrationTest.executeTask:169 » Verification
  377. [ERROR] BuildDistroIntegrationTest.testBuildDistroRefApp23:35->AbstractSdkIntegrationTest.executeTask:169 » Verification
  378. [ERROR] BuildDistroIntegrationTest.testBundledBuildDistro:56->AbstractSdkIntegrationTest.executeTask:169 » Verification
  379. [ERROR] org.openmrs.maven.plugins.BuildIntegrationTest.build_shouldBuildAllWatchedProjects(org.openmrs.maven.plugins.BuildIntegrationTest)
  380. [ERROR] Run 1: BuildIntegrationTest.setup:34->AbstractSdkIntegrationTest.setupTestServer:120 » Verification
  381. [ERROR] Run 2: BuildIntegrationTest.deleteServer:48->AbstractSdkIntegrationTest.deleteTestServer:132 » NullPointer
  382. [INFO]
  383. [ERROR] org.openmrs.maven.plugins.BuildIntegrationTest.build_shouldBuildOwaProject(org.openmrs.maven.plugins.BuildIntegrationTest)
  384. [ERROR] Run 1: BuildIntegrationTest.setup:34->AbstractSdkIntegrationTest.setupTestServer:120 » Verification
  385. [ERROR] Run 2: BuildIntegrationTest.deleteServer:48->AbstractSdkIntegrationTest.deleteTestServer:132 » NullPointer
  386. [INFO]
  387. [ERROR] org.openmrs.maven.plugins.BuildIntegrationTest.build_shouldDetectMavenProject(org.openmrs.maven.plugins.BuildIntegrationTest)
  388. [ERROR] Run 1: BuildIntegrationTest.setup:34->AbstractSdkIntegrationTest.setupTestServer:120 » Verification
  389. [ERROR] Run 2: BuildIntegrationTest.deleteServer:48->AbstractSdkIntegrationTest.deleteTestServer:132 » NullPointer
  390. [INFO]
  391. [ERROR] CloneIntegrationTest.clone_shouldCloneRepository:27->AbstractSdkIntegrationTest.executeTask:169 » Verification
  392. [ERROR] CreateProjectIntegrationTest.createProject_shouldCreatePlatformModuleProject:75->AbstractSdkIntegrationTest.executeTask:169 » Verification
  393. [ERROR] CreateProjectIntegrationTest.createProject_shouldCreateRefappModuleProject:42->AbstractSdkIntegrationTest.executeTask:169 » Verification
  394. [ERROR] CreateProjectIntegrationTest.createProject_shouldCreateRefappModuleProjectUsingBatchAnswers:57->AbstractSdkIntegrationTest.executeTask:169 » Verification
  395. [ERROR] org.openmrs.maven.plugins.DeployIntegrationTest.deploy_shouldDowngradeDistroTo2_1(org.openmrs.maven.plugins.DeployIntegrationTest)
  396. [ERROR] Run 1: DeployIntegrationTest.setupServer:27->AbstractSdkIntegrationTest.setupTestServer:120 » Verification
  397. [ERROR] Run 2: DeployIntegrationTest.deleteServer:32->AbstractSdkIntegrationTest.deleteTestServer:132 » NullPointer
  398. [INFO]
  399. [ERROR] org.openmrs.maven.plugins.DeployIntegrationTest.deploy_shouldInstallModule(org.openmrs.maven.plugins.DeployIntegrationTest)
  400. [ERROR] Run 1: DeployIntegrationTest.setupServer:27->AbstractSdkIntegrationTest.setupTestServer:120 » Verification
  401. [ERROR] Run 2: DeployIntegrationTest.deleteServer:32->AbstractSdkIntegrationTest.deleteTestServer:132 » NullPointer
  402. [INFO]
  403. [ERROR] org.openmrs.maven.plugins.DeployIntegrationTest.deploy_shouldInstallModuleFromPomInDir(org.openmrs.maven.plugins.DeployIntegrationTest)
  404. [ERROR] Run 1: DeployIntegrationTest.setupServer:27->AbstractSdkIntegrationTest.setupTestServer:120 » Verification
  405. [ERROR] Run 2: DeployIntegrationTest.deleteServer:32->AbstractSdkIntegrationTest.deleteTestServer:132 » NullPointer
  406. [INFO]
  407. [ERROR] org.openmrs.maven.plugins.DeployIntegrationTest.deploy_shouldInstallOwaAndOwaModule(org.openmrs.maven.plugins.DeployIntegrationTest)
  408. [ERROR] Run 1: DeployIntegrationTest.setupServer:27->AbstractSdkIntegrationTest.setupTestServer:120 » Verification
  409. [ERROR] Run 2: DeployIntegrationTest.deleteServer:32->AbstractSdkIntegrationTest.deleteTestServer:132 » NullPointer
  410. [INFO]
  411. [ERROR] org.openmrs.maven.plugins.DeployIntegrationTest.deploy_shouldReplaceDistroPlatform(org.openmrs.maven.plugins.DeployIntegrationTest)
  412. [ERROR] Run 1: DeployIntegrationTest.setupServer:27->AbstractSdkIntegrationTest.setupTestServer:120 » Verification
  413. [ERROR] Run 2: DeployIntegrationTest.deleteServer:32->AbstractSdkIntegrationTest.deleteTestServer:132 » NullPointer
  414. [INFO]
  415. [ERROR] org.openmrs.maven.plugins.DeployIntegrationTest.deploy_shouldReplaceWebapp(org.openmrs.maven.plugins.DeployIntegrationTest)
  416. [ERROR] Run 1: DeployIntegrationTest.setupServer:27->AbstractSdkIntegrationTest.setupTestServer:120 » Verification
  417. [ERROR] Run 2: DeployIntegrationTest.deleteServer:32->AbstractSdkIntegrationTest.deleteTestServer:132 » NullPointer
  418. [INFO]
  419. [ERROR] org.openmrs.maven.plugins.DeployIntegrationTest.deploy_shouldUpgradeDistroFromDistroProperties(org.openmrs.maven.plugins.DeployIntegrationTest)
  420. [ERROR] Run 1: DeployIntegrationTest.setupServer:27->AbstractSdkIntegrationTest.setupTestServer:120 » Verification
  421. [ERROR] Run 2: DeployIntegrationTest.deleteServer:32->AbstractSdkIntegrationTest.deleteTestServer:132 » NullPointer
  422. [INFO]
  423. [ERROR] org.openmrs.maven.plugins.DeployIntegrationTest.deploy_shouldUpgradeDistroTo2_3_1(org.openmrs.maven.plugins.DeployIntegrationTest)
  424. [ERROR] Run 1: DeployIntegrationTest.setupServer:27->AbstractSdkIntegrationTest.setupTestServer:120 » Verification
  425. [ERROR] Run 2: DeployIntegrationTest.deleteServer:32->AbstractSdkIntegrationTest.deleteTestServer:132 » NullPointer
  426. [INFO]
  427. [ERROR] FetchIntegrationTest.fetch_shouldDownloadProjectInBatchModeWithVersionSpecifiedInProjectName:34->AbstractSdkIntegrationTest.executeTask:169 » Verification
  428. [ERROR] FetchIntegrationTest.fetch_shouldDownloadProjectInBatchModeWithVersionSpecifiedInVersion:43->AbstractSdkIntegrationTest.executeTask:169 » Verification
  429. [ERROR] FetchIntegrationTest.fetch_shouldDownloadProjectInInteractiveMode:53->AbstractSdkIntegrationTest.executeTask:169 » Verification
  430. [ERROR] org.openmrs.maven.plugins.PullIntegrationTest.shouldNotifyThereIsNoWatchedProjects(org.openmrs.maven.plugins.PullIntegrationTest)
  431. [ERROR] Run 1: PullIntegrationTest.setup:34->AbstractSdkIntegrationTest.setupTestServer:120 » Verification
  432. [ERROR] Run 2: PullIntegrationTest.teardown:44->AbstractSdkIntegrationTest.deleteTestServer:132 » NullPointer
  433. [INFO]
  434. [ERROR] org.openmrs.maven.plugins.PullIntegrationTest.shouldUpdateGitProjectFromDir(org.openmrs.maven.plugins.PullIntegrationTest)
  435. [ERROR] Run 1: PullIntegrationTest.setup:34->AbstractSdkIntegrationTest.setupTestServer:120 » Verification
  436. [ERROR] Run 2: PullIntegrationTest.teardown:44->AbstractSdkIntegrationTest.deleteTestServer:132 » NullPointer
  437. [INFO]
  438. [ERROR] org.openmrs.maven.plugins.PullIntegrationTest.shouldUpdateWatchedProjectsToLatestUpstreamMaster(org.openmrs.maven.plugins.PullIntegrationTest)
  439. [ERROR] Run 1: PullIntegrationTest.setup:34->AbstractSdkIntegrationTest.setupTestServer:120 » Verification
  440. [ERROR] Run 2: PullIntegrationTest.teardown:44->AbstractSdkIntegrationTest.deleteTestServer:132 » NullPointer
  441. [INFO]
  442. [ERROR] org.openmrs.maven.plugins.PullIntegrationTest.shouldUpdateWatchedProjectsWithGivenServerIdFromGitProjectDir(org.openmrs.maven.plugins.PullIntegrationTest)
  443. [ERROR] Run 1: PullIntegrationTest.setup:34->AbstractSdkIntegrationTest.setupTestServer:120 » Verification
  444. [ERROR] Run 2: PullIntegrationTest.teardown:44->AbstractSdkIntegrationTest.deleteTestServer:132 » NullPointer
  445. [INFO]
  446. [ERROR] SetupIntegrationTest.setup_shouldInstallDistroPlatform2_0_2:96->AbstractSdkIntegrationTest.executeTask:169 » Verification
  447. [ERROR] SetupIntegrationTest.setup_shouldInstallPlatform1_11_5:68->AbstractSdkIntegrationTest.executeTask:169 » Verification
  448. [ERROR] SetupIntegrationTest.setup_shouldInstallRefapp2_3_1:39->AbstractSdkIntegrationTest.executeTask:169 » Verification
  449. [ERROR] SetupIntegrationTest.setup_shouldInstallServerFromDistroPropertiesDir:152->AbstractSdkIntegrationTest.executeTask:169 » Verification
  450. [ERROR] SetupIntegrationTest.setup_shouldInstallServerFromGivenDistroProperties:124->AbstractSdkIntegrationTest.executeTask:169 » Verification
  451. [ERROR] SetupIntegrationTest.setup_shouldInstallServerWithDefaultJavaHome:190->AbstractSdkIntegrationTest.executeTask:169 » Verification
  452. [ERROR] SetupIntegrationTest.setup_shouldInstallServerWithGivenJavaHomeAndAddJavaHomeToSdkProperties:333->AbstractSdkIntegrationTest.executeTask:169 » Verification
  453. [ERROR] SetupIntegrationTest.setup_shouldInstallServerWithSpecifiedLatestReleasedDistroVersionByUsingKeywordInBatchMode:272->AbstractSdkIntegrationTest.executeTask:169 » Verification
  454. [ERROR] SetupIntegrationTest.setup_shouldInstallServerWithSpecifiedLatestReleasedDistroVersionByUsingKeywordInInteractiveMode:302->AbstractSdkIntegrationTest.executeTask:169 » Verification
  455. [ERROR] SetupIntegrationTest.setup_shouldInstallServerWithSpecifiedLatestSnapshotDistroVersionByUsingKeywordInBatchMode:214->AbstractSdkIntegrationTest.executeTask:169 » Verification
  456. [ERROR] SetupIntegrationTest.setup_shouldInstallServerWithSpecifiedLatestSnapshotDistroVersionByUsingKeywordInInteractiveMode:244->AbstractSdkIntegrationTest.executeTask:169 » Verification
  457. [ERROR] SetupIntegrationTest.setup_shouldInstallWithParentDistroSpecifiedInDistroProperties:363->AbstractSdkIntegrationTest.executeTask:169 » Verification
  458. [INFO]
  459. [ERROR] Tests run: 37, Failures: 0, Errors: 37, Skipped: 0
  460. [INFO]
  461.  
Advertisement
RAW Paste Data Copied
Advertisement