SHARE
TWEET

Untitled

a guest Jul 16th, 2019 83 Never
Not a member of Pastebin yet? Sign Up, it unlocks many cool features!
  1. [291/1191] Building CXX object src/CMakeFiles/idlobjects.dir/autogen/server/zone                                                                               /managers/planet/PlanetManager.cpp.o
  2. FAILED: src/CMakeFiles/idlobjects.dir/autogen/server/zone/managers/planet/Planet                                                                               Manager.cpp.o
  3. ccache /usr/bin/c++   -DCOMPILE_CORE3_TESTS -DDEFAULT_DYNAMIC_CAST -DODB_REFEREN                                                                               CES -I/usr/local/include -I/usr/include/mysql -I/home/vagrant/workspace/Core3/MM                                                                               OEngine/include -I../../../utils/googletest-release-1.8.0/googletest/include -I.                                                                               ./../../utils/googletest-release-1.8.0/googlemock/include -I../../../src -I../..                                                                               /../src/autogen -I../../../utils -I../../../src/. -Wall -Wextra -Wno-unused -Wno                                                                               -sign-compare -Wno-multichar -Wno-unused-parameter -Wno-overloaded-virtual -Wno-                                                                               missing-declarations -Werror -march=native -fno-omit-frame-pointer -g   -std=gnu                                                                               ++11 -MD -MT src/CMakeFiles/idlobjects.dir/autogen/server/zone/managers/planet/P                                                                               lanetManager.cpp.o -MF src/CMakeFiles/idlobjects.dir/autogen/server/zone/manager                                                                               s/planet/PlanetManager.cpp.o.d -o src/CMakeFiles/idlobjects.dir/autogen/server/z                                                                               one/managers/planet/PlanetManager.cpp.o -c /home/vagrant/workspace/Core3/MMOCore                                                                               ORB/src/autogen/server/zone/managers/planet/PlanetManager.cpp
  4. In file included from ../../../src/server/metrics/Metrics.h:11:0,
  5.                  from ../../../src/autogen/server/zone/objects/scene/SceneObject                                                                               .h:227,
  6.                  from ../../../src/autogen/server/zone/objects/area/ActiveArea.h                                                                               :69,
  7.                  from ../../../src/server/zone/ActiveAreasVector.h:13,
  8.                  from ../../../src/autogen/server/zone/Zone.h:175,
  9.                  from ../../../src/server/zone/managers/planet/MissionTargetMap.                                                                               h:11,
  10.                  from /home/vagrant/workspace/Core3/MMOCoreORB/src/autogen/serve                                                                               r/zone/managers/planet/PlanetManager.h:129,
  11.                  from /home/vagrant/workspace/Core3/MMOCoreORB/src/autogen/serve                                                                               r/zone/managers/planet/PlanetManager.cpp:5:
  12. ../../../src/conf/ConfigManager.h: In member function ‘sys::uint64 conf::ConfigM                                                                               anager::getConfigDataAgeMs()’:
  13. ../../../src/conf/ConfigManager.h:182:27: error: ‘class sys::util::Timer’ has no                                                                                member named ‘elapsedMs’; did you mean ‘elapsed’?
  14.     return configStartTime.elapsedMs();
  15.                            ^~~~~~~~~
  16. ninja: build stopped: subcommand failed.
  17. Makefile:137: recipe for target 'build-ninja-debug' failed
  18. make: *** [build-ninja-debug] Error 1
  19. ** BUILD FAILED **
RAW Paste Data
We use cookies for various purposes including analytics. By continuing to use Pastebin, you agree to our use of cookies as described in the Cookies Policy. OK, I Understand
Not a member of Pastebin yet?
Sign Up, it unlocks many cool features!
 
Top