daily pastebin goal
22%
SHARE
TWEET

Untitled

a guest Jun 25th, 2012 71 Never
Not a member of Pastebin yet? Sign Up, it unlocks many cool features!
  1. patching file part/syntax/data/bash.xml
  2. -- The C compiler identification is GNU 4.7.1
  3. -- The CXX compiler identification is GNU 4.7.1
  4. -- Check for working C compiler: /usr/bin/gcc
  5. -- Check for working C compiler: /usr/bin/gcc -- works
  6. -- Detecting C compiler ABI info
  7. -- Detecting C compiler ABI info - done
  8. -- Check for working CXX compiler: /usr/bin/c++
  9. -- Check for working CXX compiler: /usr/bin/c++ -- works
  10. -- Detecting CXX compiler ABI info
  11. -- Detecting CXX compiler ABI info - done
  12. -- Looking for Q_WS_X11
  13. -- Looking for Q_WS_X11 - found
  14. -- Looking for Q_WS_WIN
  15. -- Looking for Q_WS_WIN - not found.
  16. -- Looking for Q_WS_QWS
  17. -- Looking for Q_WS_QWS - not found.
  18. -- Looking for Q_WS_MAC
  19. -- Looking for Q_WS_MAC - not found.
  20. -- Found Qt-Version 4.8.2 (using /usr/bin/qmake)
  21. -- Looking for XOpenDisplay in /usr/lib/libX11.so;/usr/lib/libXext.so;/usr/lib/libXft.so;/usr/lib/libXau.so;/usr/lib/libXdmcp.so;/usr/lib/libXpm.so
  22. -- Looking for XOpenDisplay in /usr/lib/libX11.so;/usr/lib/libXext.so;/usr/lib/libXft.so;/usr/lib/libXau.so;/usr/lib/libXdmcp.so;/usr/lib/libXpm.so - found
  23. -- Looking for gethostbyname
  24. -- Looking for gethostbyname - found
  25. -- Looking for connect
  26. -- Looking for connect - found
  27. -- Looking for remove
  28. -- Looking for remove - found
  29. -- Looking for shmat
  30. -- Looking for shmat - found
  31. -- Looking for IceConnectionNumber in ICE
  32. -- Looking for IceConnectionNumber in ICE - found
  33. -- Found X11: /usr/lib/libX11.so
  34. -- Looking for include file pthread.h
  35. -- Looking for include file pthread.h - found
  36. -- Looking for pthread_create
  37. -- Looking for pthread_create - not found.
  38. -- Looking for pthread_create in pthreads
  39. -- Looking for pthread_create in pthreads - not found
  40. -- Looking for pthread_create in pthread
  41. -- Looking for pthread_create in pthread - found
  42. -- Found Threads: TRUE  
  43. -- Found OpenSSL: /usr/lib/libssl.so
  44. -- Looking for _POSIX_TIMERS
  45. -- Looking for _POSIX_TIMERS - found
  46. -- Found Automoc4: /usr/bin/automoc4
  47. -- Found Perl: /usr/bin/perl (found version "5.16.0")
  48. -- Found Phonon: /usr/include
  49. -- Performing Test _OFFT_IS_64BIT
  50. -- Performing Test _OFFT_IS_64BIT - Success
  51. -- Performing Test HAVE_FPIE_SUPPORT
  52. -- Performing Test HAVE_FPIE_SUPPORT - Success
  53. -- Performing Test __KDE_HAVE_W_OVERLOADED_VIRTUAL
  54. -- Performing Test __KDE_HAVE_W_OVERLOADED_VIRTUAL - Success
  55. -- Performing Test __KDE_HAVE_GCC_VISIBILITY
  56. -- Performing Test __KDE_HAVE_GCC_VISIBILITY - Success
  57. -- Found KDE 4.8 include dir: /usr/include
  58. -- Found KDE 4.8 library dir: /usr/lib
  59. -- Found the KDE4 kconfig_compiler preprocessor: /usr/bin/kconfig_compiler
  60. -- Found automoc4: /usr/bin/automoc4
  61. -- Looking for fdatasync
  62. -- Looking for fdatasync - found
  63. -- remember to port kate/plugins/filetemplate to new knewstuff2
  64. -- Found SharedMimeInfo: /usr/bin/update-mime-database  (found version "1.0", required is "0.30")
  65. -- remember to find maintainers for these plugins and port them to the kate 3.0 interfaces...
  66. -- Configuring done
  67. -- Generating done
  68. -- Build files have been written to: /home/eithrial/AUR/kate/src/build
  69. Scanning dependencies of target katepart_automoc
  70. Scanning dependencies of target katepartinterfaces_automoc
  71. Scanning dependencies of target GeneratePhpXmlFiles
  72. [  0%] [  0%] Built target katepart_automoc
  73. Generating css-php.xml
  74. Scanning dependencies of target ktexteditor_hlselection_automoc
  75. [  0%] Generating html-php.xml
  76. Generating hlselectionplugin.moc
  77. [  0%] Generating javascript-php.xml
  78. [  0%] Built target GeneratePhpXmlFiles
  79. Generating katecompletiontree.moc
  80. Scanning dependencies of target ktexteditor_insertfile_automoc
  81. [  0%] Built target ktexteditor_hlselection_automoc
  82. Generating insertfileplugin.moc
  83. Scanning dependencies of target ktexteditor_kdatatool_automoc
  84. Generating kate_kdatatool.moc
  85. Generating katedialogs.moc
  86. [  0%] [  0%] Built target ktexteditor_insertfile_automoc
  87. Built target ktexteditor_kdatatool_automoc
  88. Scanning dependencies of target ktexteditor_exporter_automoc
  89. Scanning dependencies of target ktexteditor_autobrace_automoc
  90. Generating exporterpluginview.moc
  91. Generating autobrace_config.moc
  92. Generating autobrace.moc
  93. Generating exporterplugin.moc
  94. [  0%] Generating katecompletionwidget.moc
  95. Built target ktexteditor_exporter_automoc
  96. Scanning dependencies of target ktexteditor_iconinserter_automoc
  97. Generating iconinserterplugin.moc
  98. [  0%] Built target ktexteditor_autobrace_automoc
  99. Scanning dependencies of target ktexteditor_insanehtml_le_automoc
  100. Generating insanehtmlplugin_le.moc
  101. [  0%] Built target ktexteditor_iconinserter_automoc
  102. Generating katelayoutcache.moc
  103. Scanning dependencies of target ktexteditor_python-encoding_automoc
  104. Generating python_encoding.moc
  105. [  0%] Built target ktexteditor_insanehtml_le_automoc
  106. Scanning dependencies of target bug213964_test_automoc
  107. Generating moc_bug213964.cpp
  108. [  0%] Generating katesearchbar.moc
  109. Built target ktexteditor_python-encoding_automoc
  110. Scanning dependencies of target bug242723_test_automoc
  111. [  0%] Built target bug213964_test_automoc
  112. Generating moc_bug242723_test.cpp
  113. Scanning dependencies of target completion_test_automoc
  114. [  0%] Generating completion_test.moc
  115. Built target bug242723_test_automoc
  116. Scanning dependencies of target indenttest_automoc
  117. Generating ontheflycheck.moc
  118. Generating moc_indenttest.cpp
  119. Generating codecompletiontestmodels.moc
  120. Generating moc_testutils.cpp
  121. Generating codecompletiontestmodel.moc
  122. Generating katestyletreewidget.moc
  123. [  0%] Built target indenttest_automoc
  124. Scanning dependencies of target katedocument_test_automoc
  125. [  0%] Built target completion_test_automoc
  126. Generating moc_katedocument_test.cpp
  127. Scanning dependencies of target katefolding_test_automoc
  128. Generating moc_katefolding_test.cpp
  129. Generating katedocument_test.moc
  130. Generating kateargumenthintmodel.moc
  131. [  0%] Built target katefolding_test_automoc
  132. Scanning dependencies of target katetextbuffertest_automoc
  133. Generating moc_katetextbuffertest.cpp
  134. Generating kateviewinternal.moc
  135. [  0%] Built target katedocument_test_automoc
  136. [  0%] Scanning dependencies of target kateview_test_automoc
  137. Built target katetextbuffertest_automoc
  138. Generating kateargumenthinttree.moc
  139. Scanning dependencies of target modificationsystem_test_automoc
  140. Generating moc_kateview_test.cpp
  141. Generating moc_modificationsystem_test.cpp
  142. [  0%] Built target kateview_test_automoc
  143. Scanning dependencies of target movingcursor_test_automoc
  144. [  0%] Built target modificationsystem_test_automoc
  145. Scanning dependencies of target movingrange_test_automoc
  146. Generating moc_movingcursor_test.cpp
  147. Generating kateprinter.moc
  148. Generating moc_movingrange_test.cpp
  149. [  0%] Built target movingcursor_test_automoc
  150. [  0%] Built target movingrange_test_automoc
  151. Scanning dependencies of target plaintextsearch_test_automoc
  152. Generating spellingmenu.moc
  153. Scanning dependencies of target range_test_automoc
  154. Generating moc_plaintextsearch_test.cpp
  155. Generating moc_range_test.cpp
  156. [  0%] Built target plaintextsearch_test_automoc
  157. Scanning dependencies of target regexpsearch_test_automoc
  158. [  0%] Generating moc_regexpsearch_test.cpp
  159. Built target range_test_automoc
  160. Generating kateautoindent.moc
  161. Scanning dependencies of target revision_test_automoc
  162. [  0%] Generating moc_revision_test.cpp
  163. Built target regexpsearch_test_automoc
  164. Scanning dependencies of target scriptdocument_test_automoc
  165. [  0%] Generating moc_scriptdocument_test.cpp
  166. Built target revision_test_automoc
  167. Scanning dependencies of target searchbar_test_automoc
  168. Generating moc_searchbar_test.cpp
  169. [  0%] Built target scriptdocument_test_automoc
  170. Generating spellcheck.moc
  171. Scanning dependencies of target templatehandler_test_automoc
  172. [  0%] Generating moc_templatehandler_test.cpp
  173. Built target searchbar_test_automoc
  174. Scanning dependencies of target undomanager_test_automoc
  175. Generating moc_undomanager_test.cpp
  176. [  0%] Generating katecompletionmodel.moc
  177. Built target templatehandler_test_automoc
  178. [  0%] Scanning dependencies of target vimode_test_automoc
  179. Built target undomanager_test_automoc
  180. Generating moc_vimode_test.cpp
  181. Scanning dependencies of target kateencodingtest_automoc
  182. [  0%] Built target kateencodingtest_automoc
  183. Generating kateschema.moc
  184. Scanning dependencies of target kdeinit_kate_automoc
  185. Generating katemain.moc
  186. [  0%] Built target vimode_test_automoc
  187. Scanning dependencies of target kateinterfaces_automoc
  188. [  0%] Built target kdeinit_kate_automoc
  189. Generating katemodemenu.moc
  190. Generating katemainwindow.moc
  191. Scanning dependencies of target kategdbplugin_automoc
  192. Generating plugin_kategdb.moc
  193. Generating katesession.moc
  194. Generating configview.moc
  195. Generating katedocument.moc
  196. Generating application.moc
  197. Generating katedocmanageradaptor.moc
  198. Generating debugview.moc
  199. Generating ioview.moc
  200. Generating kateviewhelpers.moc
  201. Generating katemwmodonhddialog.moc
  202. Generating moc_localsview.cpp
  203. Generating katecompletionconfig.moc
  204. Generating kateviewspace.moc
  205. [  0%] Built target kategdbplugin_automoc
  206. Scanning dependencies of target katetextfilterplugin_automoc
  207. Generating plugin_katetextfilter.moc
  208. Generating pluginconfigpageinterface.moc
  209. Generating katetemplatehandler.moc
  210. Generating expandingdelegate.moc
  211. Generating kateappadaptor.moc
  212. [  0%] Built target katetextfilterplugin_automoc
  213. Scanning dependencies of target katekonsoleplugin_automoc
  214. Generating kateconsole.moc
  215. Generating mainwindow.moc
  216. Generating katepartpluginmanager.moc
  217. [  0%] Built target katekonsoleplugin_automoc
  218. Generating kateconfigdialog.moc
  219. Scanning dependencies of target katefilebrowserplugin_automoc
  220. Generating katescriptconsole.moc
  221. Generating katefilebrowserplugin.moc
  222. Generating katemainwindowadaptor.moc
  223. Generating katefilebrowser.moc
  224. Generating katebookmarks.moc
  225. Generating kateconfigplugindialogpage.moc
  226. Generating katehighlightmenu.moc
  227. Generating katebookmarkhandler.moc
  228. Generating kateapp.moc
  229. Generating spellcheckdialog.moc
  230. Generating katefilebrowserconfig.moc
  231. Generating pluginmanager.moc
  232. Generating katemodeconfigpage.moc
  233. Generating plugin.moc
  234. [  0%] Built target katefilebrowserplugin_automoc
  235. Scanning dependencies of target katemailfilesplugin_automoc
  236. Generating katemailfilesdialog.moc
  237. Generating kateviewmanager.moc
  238. Generating katemailfiles.moc
  239. Generating katepluginmanager.moc
  240. Generating katesyntaxmanager.moc
  241. [  0%] Built target katemailfilesplugin_automoc
  242. Scanning dependencies of target katetabbarextensionplugin_automoc
  243. Generating katedocmanager.moc
  244. Generating ktinytabbarconfigpage.moc
  245. Generating kateview.moc
  246. Generating katesavemodifieddialog.moc
  247. Generating plugin_katetabbarextension.moc
  248. Generating documentmanager.moc
  249. Generating kateglobal.moc
  250. Generating katecontainer.moc
  251. Generating ktinytabbarconfigdialog.moc
  252. Generating katemdi.moc
  253. Generating ktinytabbar.moc
  254. Generating katedocumenthelpers.moc
  255. Generating moc_katerunninginstanceinfo.cpp
  256. Generating ktinytabbutton.moc
  257. [  0%] Built target kateinterfaces_automoc
  258. Scanning dependencies of target katesymbolviewerplugin_automoc
  259. Generating katebuffer.moc
  260. Generating plugin_katesymbolviewer.moc
  261. [  0%] Built target katetabbarextensionplugin_automoc
  262. Scanning dependencies of target katebacktracebrowserplugin_automoc
  263. Generating katebacktracebrowser.moc
  264. Generating expandingwidgetmodel.moc
  265. [  0%] Built target katesymbolviewerplugin_automoc
  266. Scanning dependencies of target katequickdocumentswitcherplugin_automoc
  267. Generating plugin_katequickdocumentswitcher.moc
  268. Generating moc_btfileindexer.cpp
  269. Generating katewordcompletion.moc
  270. [  0%] Built target katebacktracebrowserplugin_automoc
  271. Scanning dependencies of target katefiletemplates_automoc
  272. [  0%] Built target katequickdocumentswitcherplugin_automoc
  273. Generating filetemplates.moc
  274. Scanning dependencies of target katectagsplugin_automoc
  275. Generating moc_kate_ctags_view.cpp
  276. Generating moc_variablelistview.cpp
  277. [  0%] Generating moc_katevimodebar.cpp
  278. Built target katefiletemplates_automoc
  279. Scanning dependencies of target katebuildplugin_automoc
  280. Generating moc_kate_ctags_plugin.cpp
  281. Generating targets.moc
  282. [  0%] Generating plugin_katebuild.moc
  283. Built target katectagsplugin_automoc
  284. Scanning dependencies of target katesearchplugin_automoc
  285. Generating plugin_search.moc
  286. Generating moc_katescriptview.cpp
  287. [  0%] Built target katebuildplugin_automoc
  288. Generating moc_katescriptmanager.cpp
  289. Scanning dependencies of target kate_kttsd_automoc
  290. Generating search_open_files.moc
  291. Generating katekttsd.moc
  292. Generating replace_matches.moc
  293. [  0%] Built target kate_kttsd_automoc
  294. Generating moc_katescriptaction.cpp
  295. Scanning dependencies of target kateopenheaderplugin_automoc
  296. Generating plugin_kateopenheader.moc
  297. Generating search_folder.moc
  298. [  0%] [  0%] Built target katesearchplugin_automoc
  299. Built target kateopenheaderplugin_automoc
  300. Scanning dependencies of target katexmltoolsplugin_automoc
  301. Scanning dependencies of target katexmlcheckplugin_automoc
  302. Generating moc_katevimodebase.cpp
  303. Generating plugin_katexmltools.moc
  304. Generating plugin_katexmlcheck.moc
  305. [  0%] Built target katexmlcheckplugin_automoc
  306. [  0%] Built target katexmltoolsplugin_automoc
  307. Scanning dependencies of target katesnippets_tngplugin_automoc
  308. Scanning dependencies of target ktexteditor_codesnippets_core_automoc
  309. Generating moc_katetextbuffer.cpp
  310. Generating selector.moc
  311. Generating repository.moc
  312. Generating jowennsnippets.moc
  313. Generating completionmodel.moc
  314. Generating moc_katecodefolding.cpp
  315. /home/eithrial/AUR/kate/src/kate-4.8.4/kate/plugins/snippets_tng/jowennsnippets.h:99: Warning: Class KateSnippetsPlugin implements the interface KTextEditor::TemplateScriptRegistrar but does not list it in Q_INTERFACES. qobject_cast to KTextEditor::TemplateScriptRegistrar will not work!
  316. Generating internalcompletionmodel.moc
  317. Generating moc_kateundomanager.cpp
  318. [  0%] Built target katesnippets_tngplugin_automoc
  319. Scanning dependencies of target ktesnippets_editor_automoc
  320. Generating moc_kateviinputmodemanager.cpp
  321. Generating snippeteditornewdialog.moc
  322. Generating dbus_helpers.moc
  323. [  0%] Built target ktexteditor_codesnippets_core_automoc
  324. Generating completionmodel.moc
  325. Scanning dependencies of target katetabifyplugin_automoc
  326. Generating moc_katevinormalmode.cpp
  327. Generating moc_tabify.cpp
  328. Generating internalcompletionmodel.moc
  329. [  0%] Built target katetabifyplugin_automoc
  330. Scanning dependencies of target katesqlplugin_automoc
  331. Generating editorapp.moc
  332. Generating moc_connectionmodel.cpp
  333. Generating moc_katerecoverbar.cpp
  334. Generating snippeteditorwindow.moc
  335. Generating moc_sqlmanager.cpp
  336. Generating moc_katehelpbutton.cpp
  337. Generating moc_katesqlplugin.cpp
  338. Generating moc_dbus_helpers.cpp
  339. /home/eithrial/AUR/kate/src/kate-4.8.4/kate/plugins/snippets_tng/lib/dbus_helpers.h:0: Note: No relevant classes found. No output generated.
  340. [  0%] Generating moc_variablelineedit.cpp
  341. Built target ktesnippets_editor_automoc
  342. Scanning dependencies of target katefiletreeplugin_automoc
  343. Generating moc_dataoutputmodel.cpp
  344. Generating katefiletreeplugin.moc
  345. Generating moc_katesqlview.cpp
  346. Generating moc_kateswapfile.cpp
  347. Generating moc_katesqlconfigpage.cpp
  348. Generating katefiletree.moc
  349. Generating moc_variableeditor.cpp
  350. Generating moc_katefiletreeconfigpage.cpp
  351. Generating moc_schemawidget.cpp
  352. Generating moc_katefiletreemodel.cpp
  353. Generating moc_katebrokenswapfilebar.cpp
  354. Generating moc_dataoutputview.cpp
  355. Generating moc_katefiletreeproxymodel.cpp
  356. [  0%] Built target katefiletreeplugin_automoc
  357. Generating moc_schemabrowserwidget.cpp
  358. Scanning dependencies of target plasma_applet_katesession_automoc
  359. Generating moc_katescriptdocument.cpp
  360. Generating katesessionapplet.moc
  361. Generating moc_dataoutputwidget.cpp
  362. Generating moc_katevivisualmode.cpp
  363. Generating moc_outputstylewidget.cpp
  364. [  0%] Built target plasma_applet_katesession_automoc
  365. Scanning dependencies of target kdeinit_kwrite_automoc
  366. Generating kwritemain.moc
  367. Generating moc_cachedsqlquerymodel.cpp
  368. Generating moc_textoutputwidget.cpp
  369. [  0%] Built target katepartinterfaces_automoc
  370. Scanning dependencies of target acomment
  371. Generating moc_kwriteapp.cpp
  372. [  1%] Building CXX object playground/kte_acomment/CMakeFiles/acomment.dir/artisticcomment.o
  373. [  1%] Built target katesqlplugin_automoc
  374. Scanning dependencies of target ktexteditor_acomment_automoc
  375. [  1%] Generating acommentview.moc
  376. Built target kdeinit_kwrite_automoc
  377. Scanning dependencies of target kate-handbook
  378. [  1%] [  1%] Generating index.cache.bz2
  379. Built target ktexteditor_acomment_automoc
  380. Scanning dependencies of target kate-manpage-man-kate
  381. [  1%] Generating kate.1
  382. Warn: AUTHOR sect.: no personblurb|contrib for Lauri Watts         kate
  383. Note: AUTHOR sect.: see see http://docbook.sf.net/el/contrib       kate
  384. Note: AUTHOR sect.: see see http://docbook.sf.net/el/personblurb   kate
  385. Note: Writing kate.1
  386. [  1%] Built target kate-manpage-man-kate
  387. Scanning dependencies of target kwrite-handbook
  388. [  2%] Generating index.cache.bz2
  389. Linking CXX static library ../../lib/libacomment.a
  390. [  2%] Built target acomment
  391. [  3%] Generating ui_howtoimportschema.h
  392. [  3%] Generating ui_textareaappearanceconfigwidget.h
  393. [  3%] Generating ui_bordersappearanceconfigwidget.h
  394. [  3%] Generating ui_commandmenuconfigwidget.h
  395. [  4%] Generating ui_commandmenueditwidget.h
  396. [  4%] Generating ui_completionconfigtab.h
  397. [  4%] Generating ui_cursorconfigwidget.h
  398. [  5%] Generating ui_editconfigwidget.h
  399. [  5%] Generating ui_filetypeconfigwidget.h
  400. [  5%] Generating ui_indentationconfigwidget.h
  401. [  5%] Generating ui_opensaveconfigwidget.h
  402. [  6%] Generating ui_opensaveconfigadvwidget.h
  403. [  6%] Generating ui_modonhdwidget.h
  404. [  6%] Generating ui_schemaconfigcolortab.h
  405. /home/eithrial/AUR/kate/src/kate-4.8.4/part/dialogs/schemaconfigcolortab.ui: Warning: The name 'gridLayout' (QGridLayout) is already in use, defaulting to 'gridLayout1'.
  406. [  7%] Generating ui_completionconfigwidget.h
  407. [  7%] Generating ui_searchbarincremental.h
  408. [  7%] Generating ui_searchbarpower.h
  409. [  7%] Generating ui_viinputmodeconfigwidget.h
  410. [  8%] Generating ui_spellcheckconfigwidget.h
  411. [  8%] Generating ui_recoverwidget.h
  412. [  8%] Generating ui_brokenswapfilewidget.h
  413. [  8%] Built target kwrite-handbook
  414. Scanning dependencies of target ktexteditor_hlselection
  415. [  8%] Building CXX object part/plugins/hlselection/CMakeFiles/ktexteditor_hlselection.dir/ktexteditor_hlselection_automoc.o
  416. [  8%] Building CXX object part/plugins/hlselection/CMakeFiles/ktexteditor_hlselection.dir/hlselectionplugin.o
  417. Scanning dependencies of target katepartinterfaces
  418. [  8%] Building CXX object part/CMakeFiles/katepartinterfaces.dir/katepartinterfaces_automoc.o
  419. Linking CXX shared module ../../../lib/ktexteditor_hlselection.so
  420. [  8%] Built target ktexteditor_hlselection
  421. Scanning dependencies of target ktexteditor_insertfile
  422. [  9%] Building CXX object part/plugins/insertfile/CMakeFiles/ktexteditor_insertfile.dir/ktexteditor_insertfile_automoc.o
  423. [  9%] Building CXX object part/plugins/insertfile/CMakeFiles/ktexteditor_insertfile.dir/insertfileplugin.o
  424. [  9%] Built target kate-handbook
  425. [  9%] Building CXX object part/CMakeFiles/katepartinterfaces.dir/buffer/katetextbuffer.o
  426. [  9%] Building CXX object part/CMakeFiles/katepartinterfaces.dir/buffer/katetextblock.o
  427. Linking CXX shared module ../../../lib/ktexteditor_insertfile.so
  428. [  9%] Built target ktexteditor_insertfile
  429. Scanning dependencies of target ktexteditor_kdatatool
  430. [  9%] Building CXX object part/plugins/kdatatool/CMakeFiles/ktexteditor_kdatatool.dir/ktexteditor_kdatatool_automoc.o
  431. [ 10%] Building CXX object part/plugins/kdatatool/CMakeFiles/ktexteditor_kdatatool.dir/kate_kdatatool.o
  432. /home/eithrial/AUR/kate/src/kate-4.8.4/part/plugins/kdatatool/kate_kdatatool.cpp: In member function ‘void KTextEditor::KDataToolPluginView::slotToolActivated(const KDataToolInfo&, const QString&)’:
  433. /home/eithrial/AUR/kate/src/kate-4.8.4/part/plugins/kdatatool/kate_kdatatool.cpp:219:8: warning: variable ‘line’ set but not used [-Wunused-but-set-variable]
  434. /home/eithrial/AUR/kate/src/kate-4.8.4/part/plugins/kdatatool/kate_kdatatool.cpp:219:14: warning: variable ‘col’ set but not used [-Wunused-but-set-variable]
  435. [ 11%] Building CXX object part/CMakeFiles/katepartinterfaces.dir/buffer/katetextline.o
  436. [ 11%] Building CXX object part/CMakeFiles/katepartinterfaces.dir/buffer/katetextcursor.o
  437. [ 11%] Building CXX object part/CMakeFiles/katepartinterfaces.dir/buffer/katetextrange.o
  438. Linking CXX shared module ../../../lib/ktexteditor_kdatatool.so
  439. [ 11%] Built target ktexteditor_kdatatool
  440. Scanning dependencies of target ktexteditor_exporter
  441. [ 11%] Building CXX object part/plugins/exporter/CMakeFiles/ktexteditor_exporter.dir/ktexteditor_exporter_automoc.o
  442. [ 11%] Building CXX object part/plugins/exporter/CMakeFiles/ktexteditor_exporter.dir/exporterplugin.o
  443. [ 12%] Building CXX object part/CMakeFiles/katepartinterfaces.dir/buffer/katetexthistory.o
  444. [ 12%] Building CXX object part/CMakeFiles/katepartinterfaces.dir/completion/codecompletionmodelcontrollerinterfacev4.o
  445. [ 12%] Building CXX object part/plugins/exporter/CMakeFiles/ktexteditor_exporter.dir/exporterpluginview.o
  446. In file included from /home/eithrial/AUR/kate/src/kate-4.8.4/part/completion/codecompletionmodelcontrollerinterfacev4.cpp:20:0:
  447. /home/eithrial/AUR/kate/src/kate-4.8.4/part/completion/codecompletionmodelcontrollerinterfacev4.h:46:1: warning: ‘CodeCompletionModelControllerInterface4’ is deprecated (declared at /home/eithrial/AUR/kate/src/kate-4.8.4/part/completion/codecompletionmodelcontrollerinterfacev4.h:32) [-Wdeprecated-declarations]
  448. /home/eithrial/AUR/kate/src/kate-4.8.4/part/completion/codecompletionmodelcontrollerinterfacev4.h:46:1: warning: ‘CodeCompletionModelControllerInterface4’ is deprecated (declared at /home/eithrial/AUR/kate/src/kate-4.8.4/part/completion/codecompletionmodelcontrollerinterfacev4.h:32) [-Wdeprecated-declarations]
  449. /home/eithrial/AUR/kate/src/kate-4.8.4/part/completion/codecompletionmodelcontrollerinterfacev4.h:46:1: warning: ‘CodeCompletionModelControllerInterface4’ is deprecated (declared at /home/eithrial/AUR/kate/src/kate-4.8.4/part/completion/codecompletionmodelcontrollerinterfacev4.h:32) [-Wdeprecated-declarations]
  450. /home/eithrial/AUR/kate/src/kate-4.8.4/part/completion/codecompletionmodelcontrollerinterfacev4.h: In function ‘T qobject_cast(QObject*) [with T = KTextEditor::CodeCompletionModelControllerInterface4*]’:
  451. /home/eithrial/AUR/kate/src/kate-4.8.4/part/completion/codecompletionmodelcontrollerinterfacev4.h:46:1: warning: ‘CodeCompletionModelControllerInterface4’ is deprecated (declared at /home/eithrial/AUR/kate/src/kate-4.8.4/part/completion/codecompletionmodelcontrollerinterfacev4.h:32) [-Wdeprecated-declarations]
  452. /home/eithrial/AUR/kate/src/kate-4.8.4/part/completion/codecompletionmodelcontrollerinterfacev4.h: At global scope:
  453. /home/eithrial/AUR/kate/src/kate-4.8.4/part/completion/codecompletionmodelcontrollerinterfacev4.h:46:1: warning: ‘CodeCompletionModelControllerInterface4’ is deprecated (declared at /home/eithrial/AUR/kate/src/kate-4.8.4/part/completion/codecompletionmodelcontrollerinterfacev4.h:32) [-Wdeprecated-declarations]
  454. /home/eithrial/AUR/kate/src/kate-4.8.4/part/completion/codecompletionmodelcontrollerinterfacev4.h:46:1: warning: ‘CodeCompletionModelControllerInterface4’ is deprecated (declared at /home/eithrial/AUR/kate/src/kate-4.8.4/part/completion/codecompletionmodelcontrollerinterfacev4.h:32) [-Wdeprecated-declarations]
  455. /home/eithrial/AUR/kate/src/kate-4.8.4/part/completion/codecompletionmodelcontrollerinterfacev4.h: In function ‘T qobject_cast(const QObject*) [with T = KTextEditor::CodeCompletionModelControllerInterface4*]’:
  456. /home/eithrial/AUR/kate/src/kate-4.8.4/part/completion/codecompletionmodelcontrollerinterfacev4.h:46:1: warning: ‘CodeCompletionModelControllerInterface4’ is deprecated (declared at /home/eithrial/AUR/kate/src/kate-4.8.4/part/completion/codecompletionmodelcontrollerinterfacev4.h:32) [-Wdeprecated-declarations]
  457. [ 12%] Building CXX object part/CMakeFiles/katepartinterfaces.dir/completion/katecompletionwidget.o
  458. [ 12%] Building CXX object part/CMakeFiles/katepartinterfaces.dir/completion/katecompletionmodel.o
  459. [ 13%] Building CXX object part/plugins/exporter/CMakeFiles/ktexteditor_exporter.dir/htmlexporter.o
  460. In file included from /home/eithrial/AUR/kate/src/kate-4.8.4/part/completion/katecompletionmodel.cpp:39:0:
  461. /home/eithrial/AUR/kate/src/kate-4.8.4/part/completion/codecompletionmodelcontrollerinterfacev4.h:46:1: warning: ‘CodeCompletionModelControllerInterface4’ is deprecated (declared at /home/eithrial/AUR/kate/src/kate-4.8.4/part/completion/codecompletionmodelcontrollerinterfacev4.h:32) [-Wdeprecated-declarations]
  462. /home/eithrial/AUR/kate/src/kate-4.8.4/part/completion/codecompletionmodelcontrollerinterfacev4.h:46:1: warning: ‘CodeCompletionModelControllerInterface4’ is deprecated (declared at /home/eithrial/AUR/kate/src/kate-4.8.4/part/completion/codecompletionmodelcontrollerinterfacev4.h:32) [-Wdeprecated-declarations]
  463. /home/eithrial/AUR/kate/src/kate-4.8.4/part/completion/codecompletionmodelcontrollerinterfacev4.h:46:1: warning: ‘CodeCompletionModelControllerInterface4’ is deprecated (declared at /home/eithrial/AUR/kate/src/kate-4.8.4/part/completion/codecompletionmodelcontrollerinterfacev4.h:32) [-Wdeprecated-declarations]
  464. /home/eithrial/AUR/kate/src/kate-4.8.4/part/completion/codecompletionmodelcontrollerinterfacev4.h: In function ‘T qobject_cast(QObject*) [with T = KTextEditor::CodeCompletionModelControllerInterface4*]’:
  465. /home/eithrial/AUR/kate/src/kate-4.8.4/part/completion/codecompletionmodelcontrollerinterfacev4.h:46:1: warning: ‘CodeCompletionModelControllerInterface4’ is deprecated (declared at /home/eithrial/AUR/kate/src/kate-4.8.4/part/completion/codecompletionmodelcontrollerinterfacev4.h:32) [-Wdeprecated-declarations]
  466. /home/eithrial/AUR/kate/src/kate-4.8.4/part/completion/codecompletionmodelcontrollerinterfacev4.h: At global scope:
  467. /home/eithrial/AUR/kate/src/kate-4.8.4/part/completion/codecompletionmodelcontrollerinterfacev4.h:46:1: warning: ‘CodeCompletionModelControllerInterface4’ is deprecated (declared at /home/eithrial/AUR/kate/src/kate-4.8.4/part/completion/codecompletionmodelcontrollerinterfacev4.h:32) [-Wdeprecated-declarations]
  468. /home/eithrial/AUR/kate/src/kate-4.8.4/part/completion/codecompletionmodelcontrollerinterfacev4.h:46:1: warning: ‘CodeCompletionModelControllerInterface4’ is deprecated (declared at /home/eithrial/AUR/kate/src/kate-4.8.4/part/completion/codecompletionmodelcontrollerinterfacev4.h:32) [-Wdeprecated-declarations]
  469. /home/eithrial/AUR/kate/src/kate-4.8.4/part/completion/codecompletionmodelcontrollerinterfacev4.h: In function ‘T qobject_cast(const QObject*) [with T = KTextEditor::CodeCompletionModelControllerInterface4*]’:
  470. /home/eithrial/AUR/kate/src/kate-4.8.4/part/completion/codecompletionmodelcontrollerinterfacev4.h:46:1: warning: ‘CodeCompletionModelControllerInterface4’ is deprecated (declared at /home/eithrial/AUR/kate/src/kate-4.8.4/part/completion/codecompletionmodelcontrollerinterfacev4.h:32) [-Wdeprecated-declarations]
  471. /home/eithrial/AUR/kate/src/kate-4.8.4/part/completion/katecompletionmodel.cpp: In member function ‘bool KateCompletionModel::shouldMatchHideCompletionList() const’:
  472. /home/eithrial/AUR/kate/src/kate-4.8.4/part/completion/katecompletionmodel.cpp:1730:63: warning: ‘CodeCompletionModelControllerInterface2’ is deprecated (declared at /usr/include/ktexteditor/codecompletionmodelcontrollerinterface.h:170) [-Wdeprecated-declarations]
  473. /home/eithrial/AUR/kate/src/kate-4.8.4/part/completion/katecompletionmodel.cpp:1730:137: warning: ‘CodeCompletionModelControllerInterface2’ is deprecated (declared at /usr/include/ktexteditor/codecompletionmodelcontrollerinterface.h:170) [-Wdeprecated-declarations]
  474. /home/eithrial/AUR/kate/src/kate-4.8.4/part/completion/katecompletionmodel.cpp: In member function ‘void KateCompletionModel::makeGroupItemsUnique(bool)’:
  475. /home/eithrial/AUR/kate/src/kate-4.8.4/part/completion/katecompletionmodel.cpp:2000:59: warning: ‘CodeCompletionModelControllerInterface4’ is deprecated (declared at /home/eithrial/AUR/kate/src/kate-4.8.4/part/completion/codecompletionmodelcontrollerinterfacev4.h:32) [-Wdeprecated-declarations]
  476. /home/eithrial/AUR/kate/src/kate-4.8.4/part/completion/katecompletionmodel.cpp:2000:129: warning: ‘CodeCompletionModelControllerInterface4’ is deprecated (declared at /home/eithrial/AUR/kate/src/kate-4.8.4/part/completion/codecompletionmodelcontrollerinterfacev4.h:32) [-Wdeprecated-declarations]
  477. Linking CXX shared module ../../../lib/ktexteditor_exporter.so
  478. [ 13%] Built target ktexteditor_exporter
  479. Scanning dependencies of target ktexteditor_autobrace
  480. [ 14%] Building CXX object part/plugins/autobrace/CMakeFiles/ktexteditor_autobrace.dir/ktexteditor_autobrace_automoc.o
  481. [ 14%] Building CXX object part/plugins/autobrace/CMakeFiles/ktexteditor_autobrace.dir/autobrace.o
  482. [ 15%] Building CXX object part/CMakeFiles/katepartinterfaces.dir/completion/katecompletiontree.o
  483. [ 15%] Building CXX object part/plugins/autobrace/CMakeFiles/ktexteditor_autobrace.dir/autobrace_config.o
  484. [ 15%] Building CXX object part/CMakeFiles/katepartinterfaces.dir/completion/katecompletionconfig.o
  485. [ 15%] Building CXX object part/CMakeFiles/katepartinterfaces.dir/completion/kateargumenthinttree.o
  486. Linking CXX shared module ../../../lib/ktexteditor_autobrace.so
  487. [ 15%] Built target ktexteditor_autobrace
  488. Scanning dependencies of target ktexteditor_iconinserter
  489. [ 16%] Building CXX object part/plugins/kte_iconinserter/CMakeFiles/ktexteditor_iconinserter.dir/ktexteditor_iconinserter_automoc.o
  490. [ 16%] Building CXX object part/plugins/kte_iconinserter/CMakeFiles/ktexteditor_iconinserter.dir/iconinserterplugin.o
  491. /home/eithrial/AUR/kate/src/kate-4.8.4/part/completion/kateargumenthinttree.cpp: In member function ‘void KateArgumentHintTree::updateGeometry(QRect)’:
  492. /home/eithrial/AUR/kate/src/kate-4.8.4/part/completion/kateargumenthinttree.cpp:129:9: warning: variable ‘topRect’ set but not used [-Wunused-but-set-variable]
  493. /home/eithrial/AUR/kate/src/kate-4.8.4/part/completion/kateargumenthinttree.cpp:130:9: warning: variable ‘contentRect’ set but not used [-Wunused-but-set-variable]
  494. [ 17%] Building CXX object part/CMakeFiles/katepartinterfaces.dir/completion/kateargumenthintmodel.o
  495. [ 17%] Building CXX object part/CMakeFiles/katepartinterfaces.dir/completion/katecompletiondelegate.o
  496. Linking CXX shared module ../../../lib/ktexteditor_iconinserter.so
  497. [ 17%] Built target ktexteditor_iconinserter
  498. Scanning dependencies of target ktexteditor_insanehtml_le
  499. [ 17%] Building CXX object part/plugins/kte_insanehtml_le/CMakeFiles/ktexteditor_insanehtml_le.dir/ktexteditor_insanehtml_le_automoc.o
  500. [ 17%] Building CXX object part/plugins/kte_insanehtml_le/CMakeFiles/ktexteditor_insanehtml_le.dir/insanehtmlplugin_le.o
  501. [ 17%] Building CXX object part/CMakeFiles/katepartinterfaces.dir/completion/expandingtree/expandingwidgetmodel.o
  502. [ 17%] Building CXX object part/CMakeFiles/katepartinterfaces.dir/completion/expandingtree/expandingdelegate.o
  503. /home/eithrial/AUR/kate/src/kate-4.8.4/part/completion/expandingtree/expandingdelegate.cpp: In member function ‘virtual void ExpandingDelegate::drawDisplay(QPainter*, const QStyleOptionViewItem&, const QRect&, const QString&) const’:
  504. /home/eithrial/AUR/kate/src/kate-4.8.4/part/completion/expandingtree/expandingdelegate.cpp:166:9: warning: variable ‘textRect’ set but not used [-Wunused-but-set-variable]
  505. /home/eithrial/AUR/kate/src/kate-4.8.4/part/completion/expandingtree/expandingdelegate.cpp: In member function ‘virtual bool ExpandingDelegate::editorEvent(QEvent*, QAbstractItemModel*, const QStyleOptionViewItem&, const QModelIndex&)’:
  506. /home/eithrial/AUR/kate/src/kate-4.8.4/part/completion/expandingtree/expandingdelegate.cpp:302:14: warning: variable ‘keyEvent’ set but not used [-Wunused-but-set-variable]
  507. Linking CXX shared module ../../../lib/ktexteditor_insanehtml_le.so
  508. [ 18%] Building CXX object part/CMakeFiles/katepartinterfaces.dir/completion/expandingtree/expandingtree.o
  509. [ 18%] Built target ktexteditor_insanehtml_le
  510. Scanning dependencies of target ktexteditor_python-encoding
  511. [ 18%] Building CXX object part/plugins/pythonencoding/CMakeFiles/ktexteditor_python-encoding.dir/ktexteditor_python-encoding_automoc.o
  512. [ 18%] Building CXX object part/plugins/pythonencoding/CMakeFiles/ktexteditor_python-encoding.dir/python_encoding.o
  513. [ 18%] Building CXX object part/CMakeFiles/katepartinterfaces.dir/completion/katewordcompletion.o
  514. [ 18%] Building CXX object part/CMakeFiles/katepartinterfaces.dir/dialogs/katedialogs.o
  515. In file included from /home/eithrial/AUR/kate/src/kate-4.8.4/part/completion/katewordcompletion.h:30:0,
  516.                  from /home/eithrial/AUR/kate/src/kate-4.8.4/part/completion/katewordcompletion.cpp:23:
  517. /home/eithrial/AUR/kate/src/kate-4.8.4/part/completion/codecompletionmodelcontrollerinterfacev4.h:46:1: warning: ‘CodeCompletionModelControllerInterface4’ is deprecated (declared at /home/eithrial/AUR/kate/src/kate-4.8.4/part/completion/codecompletionmodelcontrollerinterfacev4.h:32) [-Wdeprecated-declarations]
  518. /home/eithrial/AUR/kate/src/kate-4.8.4/part/completion/codecompletionmodelcontrollerinterfacev4.h:46:1: warning: ‘CodeCompletionModelControllerInterface4’ is deprecated (declared at /home/eithrial/AUR/kate/src/kate-4.8.4/part/completion/codecompletionmodelcontrollerinterfacev4.h:32) [-Wdeprecated-declarations]
  519. /home/eithrial/AUR/kate/src/kate-4.8.4/part/completion/codecompletionmodelcontrollerinterfacev4.h:46:1: warning: ‘CodeCompletionModelControllerInterface4’ is deprecated (declared at /home/eithrial/AUR/kate/src/kate-4.8.4/part/completion/codecompletionmodelcontrollerinterfacev4.h:32) [-Wdeprecated-declarations]
  520. /home/eithrial/AUR/kate/src/kate-4.8.4/part/completion/codecompletionmodelcontrollerinterfacev4.h: In function ‘T qobject_cast(QObject*) [with T = KTextEditor::CodeCompletionModelControllerInterface4*]’:
  521. /home/eithrial/AUR/kate/src/kate-4.8.4/part/completion/codecompletionmodelcontrollerinterfacev4.h:46:1: warning: ‘CodeCompletionModelControllerInterface4’ is deprecated (declared at /home/eithrial/AUR/kate/src/kate-4.8.4/part/completion/codecompletionmodelcontrollerinterfacev4.h:32) [-Wdeprecated-declarations]
  522. /home/eithrial/AUR/kate/src/kate-4.8.4/part/completion/codecompletionmodelcontrollerinterfacev4.h: At global scope:
  523. /home/eithrial/AUR/kate/src/kate-4.8.4/part/completion/codecompletionmodelcontrollerinterfacev4.h:46:1: warning: ‘CodeCompletionModelControllerInterface4’ is deprecated (declared at /home/eithrial/AUR/kate/src/kate-4.8.4/part/completion/codecompletionmodelcontrollerinterfacev4.h:32) [-Wdeprecated-declarations]
  524. /home/eithrial/AUR/kate/src/kate-4.8.4/part/completion/codecompletionmodelcontrollerinterfacev4.h:46:1: warning: ‘CodeCompletionModelControllerInterface4’ is deprecated (declared at /home/eithrial/AUR/kate/src/kate-4.8.4/part/completion/codecompletionmodelcontrollerinterfacev4.h:32) [-Wdeprecated-declarations]
  525. /home/eithrial/AUR/kate/src/kate-4.8.4/part/completion/codecompletionmodelcontrollerinterfacev4.h: In function ‘T qobject_cast(const QObject*) [with T = KTextEditor::CodeCompletionModelControllerInterface4*]’:
  526. /home/eithrial/AUR/kate/src/kate-4.8.4/part/completion/codecompletionmodelcontrollerinterfacev4.h:46:1: warning: ‘CodeCompletionModelControllerInterface4’ is deprecated (declared at /home/eithrial/AUR/kate/src/kate-4.8.4/part/completion/codecompletionmodelcontrollerinterfacev4.h:32) [-Wdeprecated-declarations]
  527. Linking CXX shared module ../../../lib/ktexteditor_python-encoding.so
  528. [ 18%] Built target ktexteditor_python-encoding
  529. In file included from /home/eithrial/AUR/kate/src/kate-4.8.4/part/completion/katewordcompletion.cpp:574:0:
  530. /home/eithrial/AUR/kate/src/build/part/katewordcompletion.moc: In member function ‘virtual void* KateWordCompletionModel::qt_metacast(const char*)’:
  531. /home/eithrial/AUR/kate/src/build/part/katewordcompletion.moc:72:81: warning: ‘CodeCompletionModelControllerInterface4’ is deprecated (declared at /home/eithrial/AUR/kate/src/kate-4.8.4/part/completion/codecompletionmodelcontrollerinterfacev4.h:32) [-Wdeprecated-declarations]
  532. In file included from /home/eithrial/AUR/kate/src/kate-4.8.4/part/completion/katewordcompletion.cpp:574:0:
  533. /home/eithrial/AUR/kate/src/build/part/katewordcompletion.moc:74:81: warning: ‘CodeCompletionModelControllerInterface4’ is deprecated (declared at /home/eithrial/AUR/kate/src/kate-4.8.4/part/completion/codecompletionmodelcontrollerinterfacev4.h:32) [-Wdeprecated-declarations]
  534. Scanning dependencies of target kateinterfaces
  535. [ 18%] Building CXX object kate/app/CMakeFiles/kateinterfaces.dir/kateinterfaces_automoc.o
  536. [ 18%] Building CXX object kate/app/CMakeFiles/kateinterfaces.dir/kateappadaptor.o
  537. [ 19%] Building CXX object part/CMakeFiles/katepartinterfaces.dir/document/katedocument.o
  538. [ 20%] Building CXX object kate/app/CMakeFiles/kateinterfaces.dir/katemainwindowadaptor.o
  539. /home/eithrial/AUR/kate/src/kate-4.8.4/part/document/katedocument.cpp: In member function ‘virtual bool KateDocument::saveFile()’:
  540. /home/eithrial/AUR/kate/src/kate-4.8.4/part/document/katedocument.cpp:2211:15: warning: variable ‘perms’ set but not used [-Wunused-but-set-variable]
  541. /home/eithrial/AUR/kate/src/kate-4.8.4/part/document/katedocument.cpp: In member function ‘void KateDocument::comment(KateView*, uint, uint, int)’:
  542. /home/eithrial/AUR/kate/src/kate-4.8.4/part/document/katedocument.cpp:3345:7: warning: variable ‘l’ set but not used [-Wunused-but-set-variable]
  543. [ 20%] Building CXX object kate/app/CMakeFiles/kateinterfaces.dir/__/interfaces/kate/application.o
  544. [ 20%] Building CXX object part/CMakeFiles/katepartinterfaces.dir/document/katedocumenthelpers.o
  545. [ 20%] Building CXX object kate/app/CMakeFiles/kateinterfaces.dir/__/interfaces/kate/mainwindow.o
  546. [ 20%] Building CXX object part/CMakeFiles/katepartinterfaces.dir/document/katebuffer.o
  547. [ 21%] Building CXX object kate/app/CMakeFiles/kateinterfaces.dir/__/interfaces/kate/documentmanager.o
  548. [ 21%] Building CXX object kate/app/CMakeFiles/kateinterfaces.dir/__/interfaces/kate/pluginmanager.o
  549. [ 21%] Building CXX object part/CMakeFiles/katepartinterfaces.dir/undo/kateundo.o
  550. [ 21%] Building CXX object kate/app/CMakeFiles/kateinterfaces.dir/__/interfaces/kate/plugin.o
  551. [ 21%] Building CXX object kate/app/CMakeFiles/kateinterfaces.dir/__/interfaces/kate/pluginconfigpageinterface.o
  552. [ 22%] Building CXX object part/CMakeFiles/katepartinterfaces.dir/undo/katemodifiedundo.o
  553. [ 23%] Building CXX object kate/app/CMakeFiles/kateinterfaces.dir/kateapp.o
  554. [ 23%] Building CXX object part/CMakeFiles/katepartinterfaces.dir/undo/kateundomanager.o
  555. [ 23%] Building CXX object part/CMakeFiles/katepartinterfaces.dir/script/katescript.o
  556. [ 24%] Building CXX object part/CMakeFiles/katepartinterfaces.dir/script/kateindentscript.o
  557. [ 24%] Building CXX object kate/app/CMakeFiles/kateinterfaces.dir/kateconfigdialog.o
  558. [ 24%] Building CXX object part/CMakeFiles/katepartinterfaces.dir/script/katecommandlinescript.o
  559. [ 24%] Building CXX object part/CMakeFiles/katepartinterfaces.dir/script/katetemplatescript.o
  560. /home/eithrial/AUR/kate/src/kate-4.8.4/kate/app/kateconfigdialog.cpp:294:6: warning: unused parameter ‘before’ [-Wunused-parameter]
  561. [ 24%] Building CXX object kate/app/CMakeFiles/kateinterfaces.dir/kateconfigplugindialogpage.o
  562. [ 24%] Building CXX object part/CMakeFiles/katepartinterfaces.dir/script/katescriptmanager.o
  563. [ 25%] Building CXX object part/CMakeFiles/katepartinterfaces.dir/script/katescriptaction.o
  564. [ 26%] Building CXX object kate/app/CMakeFiles/kateinterfaces.dir/katedocmanager.o
  565. [ 26%] Building CXX object part/CMakeFiles/katepartinterfaces.dir/script/katescriptconsole.o
  566. [ 26%] Building CXX object part/CMakeFiles/katepartinterfaces.dir/script/katescriptdocument.o
  567. [ 27%] Building CXX object part/CMakeFiles/katepartinterfaces.dir/script/katescriptview.o
  568. [ 27%] Building CXX object kate/app/CMakeFiles/kateinterfaces.dir/katemainwindow.o
  569. /home/eithrial/AUR/kate/src/kate-4.8.4/kate/app/katemainwindow.cpp:643:2: warning: #warning there appear to be invalid clients after session switching [-Wcpp]
  570. [ 27%] Building CXX object part/CMakeFiles/katepartinterfaces.dir/script/katescripthelpers.o
  571. [ 27%] Building CXX object part/CMakeFiles/katepartinterfaces.dir/mode/katemodemanager.o
  572. /home/eithrial/AUR/kate/src/kate-4.8.4/kate/app/katemainwindow.cpp: In member function ‘void KateMainWindow::queueModifiedOnDisc(KTextEditor::Document*)’:
  573. /home/eithrial/AUR/kate/src/kate-4.8.4/kate/app/katemainwindow.cpp:957:10: warning: unused variable ‘res’ [-Wunused-variable]
  574. [ 27%] Building CXX object part/CMakeFiles/katepartinterfaces.dir/mode/katemodeconfigpage.o
  575. [ 28%] Building CXX object part/CMakeFiles/katepartinterfaces.dir/mode/katemodemenu.o
  576. [ 28%] Building CXX object kate/app/CMakeFiles/kateinterfaces.dir/katepluginmanager.o
  577. [ 28%] Building CXX object part/CMakeFiles/katepartinterfaces.dir/mode/katewildcardmatcher.o
  578. [ 28%] Building CXX object part/CMakeFiles/katepartinterfaces.dir/variableeditor/variablelineedit.o
  579. [ 29%] Building CXX object part/CMakeFiles/katepartinterfaces.dir/variableeditor/variablelistview.o
  580. [ 29%] Building CXX object kate/app/CMakeFiles/kateinterfaces.dir/kateviewmanager.o
  581. [ 29%] Building CXX object part/CMakeFiles/katepartinterfaces.dir/variableeditor/variableeditor.o
  582. [ 29%] Building CXX object part/CMakeFiles/katepartinterfaces.dir/variableeditor/variableitem.o
  583. [ 29%] Building CXX object part/CMakeFiles/katepartinterfaces.dir/variableeditor/katehelpbutton.o
  584. [ 30%] Building CXX object part/CMakeFiles/katepartinterfaces.dir/render/katerenderer.o
  585. [ 31%] Building CXX object kate/app/CMakeFiles/kateinterfaces.dir/kateviewspace.o
  586. [ 31%] Generating ui_snippet_repository.h
  587. Scanning dependencies of target ktexteditor_codesnippets_core
  588. [ 32%] Building CXX object kate/plugins/snippets_tng/lib/CMakeFiles/ktexteditor_codesnippets_core.dir/ktexteditor_codesnippets_core_automoc.o
  589. [ 32%] Building CXX object kate/plugins/snippets_tng/lib/CMakeFiles/ktexteditor_codesnippets_core.dir/completionmodel.o
  590. In file included from /home/eithrial/AUR/kate/src/kate-4.8.4/kate/plugins/snippets_tng/lib/completionmodel.h:29:0,
  591.                  from /home/eithrial/AUR/kate/src/kate-4.8.4/kate/plugins/snippets_tng/lib/completionmodel.cpp:19:
  592. /home/eithrial/AUR/kate/src/kate-4.8.4/kate/plugins/../../ktexteditor/codecompletionmodelcontrollerinterface.h:343:1: warning: ‘CodeCompletionModelControllerInterface’ is deprecated (declared at /home/eithrial/AUR/kate/src/kate-4.8.4/kate/plugins/../../ktexteditor/codecompletionmodelcontrollerinterface.h:70) [-Wdeprecated-declarations]
  593. /home/eithrial/AUR/kate/src/kate-4.8.4/kate/plugins/../../ktexteditor/codecompletionmodelcontrollerinterface.h:343:1: warning: ‘CodeCompletionModelControllerInterface’ is deprecated (declared at /home/eithrial/AUR/kate/src/kate-4.8.4/kate/plugins/../../ktexteditor/codecompletionmodelcontrollerinterface.h:70) [-Wdeprecated-declarations]
  594. /home/eithrial/AUR/kate/src/kate-4.8.4/kate/plugins/../../ktexteditor/codecompletionmodelcontrollerinterface.h:343:1: warning: ‘CodeCompletionModelControllerInterface’ is deprecated (declared at /home/eithrial/AUR/kate/src/kate-4.8.4/kate/plugins/../../ktexteditor/codecompletionmodelcontrollerinterface.h:70) [-Wdeprecated-declarations]
  595. /home/eithrial/AUR/kate/src/kate-4.8.4/kate/plugins/../../ktexteditor/codecompletionmodelcontrollerinterface.h: In function ‘T qobject_cast(QObject*) [with T = KTextEditor::CodeCompletionModelControllerInterface*]’:
  596. /home/eithrial/AUR/kate/src/kate-4.8.4/kate/plugins/../../ktexteditor/codecompletionmodelcontrollerinterface.h:343:1: warning: ‘CodeCompletionModelControllerInterface’ is deprecated (declared at /home/eithrial/AUR/kate/src/kate-4.8.4/kate/plugins/../../ktexteditor/codecompletionmodelcontrollerinterface.h:70) [-Wdeprecated-declarations]
  597. /home/eithrial/AUR/kate/src/kate-4.8.4/kate/plugins/../../ktexteditor/codecompletionmodelcontrollerinterface.h: At global scope:
  598. /home/eithrial/AUR/kate/src/kate-4.8.4/kate/plugins/../../ktexteditor/codecompletionmodelcontrollerinterface.h:343:1: warning: ‘CodeCompletionModelControllerInterface’ is deprecated (declared at /home/eithrial/AUR/kate/src/kate-4.8.4/kate/plugins/../../ktexteditor/codecompletionmodelcontrollerinterface.h:70) [-Wdeprecated-declarations]
  599. /home/eithrial/AUR/kate/src/kate-4.8.4/kate/plugins/../../ktexteditor/codecompletionmodelcontrollerinterface.h:343:1: warning: ‘CodeCompletionModelControllerInterface’ is deprecated (declared at /home/eithrial/AUR/kate/src/kate-4.8.4/kate/plugins/../../ktexteditor/codecompletionmodelcontrollerinterface.h:70) [-Wdeprecated-declarations]
  600. /home/eithrial/AUR/kate/src/kate-4.8.4/kate/plugins/../../ktexteditor/codecompletionmodelcontrollerinterface.h: In function ‘T qobject_cast(const QObject*) [with T = KTextEditor::CodeCompletionModelControllerInterface*]’:
  601. /home/eithrial/AUR/kate/src/kate-4.8.4/kate/plugins/../../ktexteditor/codecompletionmodelcontrollerinterface.h:343:1: warning: ‘CodeCompletionModelControllerInterface’ is deprecated (declared at /home/eithrial/AUR/kate/src/kate-4.8.4/kate/plugins/../../ktexteditor/codecompletionmodelcontrollerinterface.h:70) [-Wdeprecated-declarations]
  602. /home/eithrial/AUR/kate/src/kate-4.8.4/kate/plugins/../../ktexteditor/codecompletionmodelcontrollerinterface.h: At global scope:
  603. /home/eithrial/AUR/kate/src/kate-4.8.4/kate/plugins/../../ktexteditor/codecompletionmodelcontrollerinterface.h:344:1: warning: ‘CodeCompletionModelControllerInterface2’ is deprecated (declared at /home/eithrial/AUR/kate/src/kate-4.8.4/kate/plugins/../../ktexteditor/codecompletionmodelcontrollerinterface.h:170) [-Wdeprecated-declarations]
  604. /home/eithrial/AUR/kate/src/kate-4.8.4/kate/plugins/../../ktexteditor/codecompletionmodelcontrollerinterface.h:344:1: warning: ‘CodeCompletionModelControllerInterface2’ is deprecated (declared at /home/eithrial/AUR/kate/src/kate-4.8.4/kate/plugins/../../ktexteditor/codecompletionmodelcontrollerinterface.h:170) [-Wdeprecated-declarations]
  605. /home/eithrial/AUR/kate/src/kate-4.8.4/kate/plugins/../../ktexteditor/codecompletionmodelcontrollerinterface.h:344:1: warning: ‘CodeCompletionModelControllerInterface2’ is deprecated (declared at /home/eithrial/AUR/kate/src/kate-4.8.4/kate/plugins/../../ktexteditor/codecompletionmodelcontrollerinterface.h:170) [-Wdeprecated-declarations]
  606. /home/eithrial/AUR/kate/src/kate-4.8.4/kate/plugins/../../ktexteditor/codecompletionmodelcontrollerinterface.h: In function ‘T qobject_cast(QObject*) [with T = KTextEditor::CodeCompletionModelControllerInterface2*]’:
  607. /home/eithrial/AUR/kate/src/kate-4.8.4/kate/plugins/../../ktexteditor/codecompletionmodelcontrollerinterface.h:344:1: warning: ‘CodeCompletionModelControllerInterface2’ is deprecated (declared at /home/eithrial/AUR/kate/src/kate-4.8.4/kate/plugins/../../ktexteditor/codecompletionmodelcontrollerinterface.h:170) [-Wdeprecated-declarations]
  608. /home/eithrial/AUR/kate/src/kate-4.8.4/kate/plugins/../../ktexteditor/codecompletionmodelcontrollerinterface.h: At global scope:
  609. /home/eithrial/AUR/kate/src/kate-4.8.4/kate/plugins/../../ktexteditor/codecompletionmodelcontrollerinterface.h:344:1: warning: ‘CodeCompletionModelControllerInterface2’ is deprecated (declared at /home/eithrial/AUR/kate/src/kate-4.8.4/kate/plugins/../../ktexteditor/codecompletionmodelcontrollerinterface.h:170) [-Wdeprecated-declarations]
  610. /home/eithrial/AUR/kate/src/kate-4.8.4/kate/plugins/../../ktexteditor/codecompletionmodelcontrollerinterface.h:344:1: warning: ‘CodeCompletionModelControllerInterface2’ is deprecated (declared at /home/eithrial/AUR/kate/src/kate-4.8.4/kate/plugins/../../ktexteditor/codecompletionmodelcontrollerinterface.h:170) [-Wdeprecated-declarations]
  611. /home/eithrial/AUR/kate/src/kate-4.8.4/kate/plugins/../../ktexteditor/codecompletionmodelcontrollerinterface.h: In function ‘T qobject_cast(const QObject*) [with T = KTextEditor::CodeCompletionModelControllerInterface2*]’:
  612. /home/eithrial/AUR/kate/src/kate-4.8.4/kate/plugins/../../ktexteditor/codecompletionmodelcontrollerinterface.h:344:1: warning: ‘CodeCompletionModelControllerInterface2’ is deprecated (declared at /home/eithrial/AUR/kate/src/kate-4.8.4/kate/plugins/../../ktexteditor/codecompletionmodelcontrollerinterface.h:170) [-Wdeprecated-declarations]
  613. In file included from /home/eithrial/AUR/kate/src/kate-4.8.4/kate/plugins/snippets_tng/lib/completionmodel.cpp:19:0:
  614. /home/eithrial/AUR/kate/src/kate-4.8.4/kate/plugins/snippets_tng/lib/completionmodel.h: At global scope:
  615. /home/eithrial/AUR/kate/src/kate-4.8.4/kate/plugins/snippets_tng/lib/completionmodel.h:128:29: warning: unused parameter ‘index’ [-Wunused-parameter]
  616. /home/eithrial/AUR/kate/src/kate-4.8.4/part/render/katerenderer.cpp:291:6: warning: unused parameter ‘row’ [-Wunused-parameter]
  617. /home/eithrial/AUR/kate/src/kate-4.8.4/kate/plugins/snippets_tng/lib/completionmodel.cpp:972:14: warning: unused parameter ‘view’ [-Wunused-parameter]
  618. /home/eithrial/AUR/kate/src/kate-4.8.4/kate/plugins/snippets_tng/lib/completionmodel.cpp:972:14: warning: unused parameter ‘range’ [-Wunused-parameter]
  619. /home/eithrial/AUR/kate/src/kate-4.8.4/kate/plugins/snippets_tng/lib/completionmodel.cpp:972:14: warning: unused parameter ‘invocationType’ [-Wunused-parameter]
  620. /home/eithrial/AUR/kate/src/kate-4.8.4/kate/plugins/snippets_tng/lib/completionmodel.cpp:1033:14: warning: unused parameter ‘word’ [-Wunused-parameter]
  621. /home/eithrial/AUR/kate/src/kate-4.8.4/kate/plugins/snippets_tng/lib/completionmodel.cpp:1060:14: warning: unused parameter ‘view’ [-Wunused-parameter]
  622. [ 32%] Building CXX object kate/app/CMakeFiles/kateinterfaces.dir/katesavemodifieddialog.o
  623. [ 32%] Building CXX object part/CMakeFiles/katepartinterfaces.dir/render/katerenderrange.o
  624. [ 32%] Building CXX object kate/plugins/snippets_tng/lib/CMakeFiles/ktexteditor_codesnippets_core.dir/repository.o
  625. [ 32%] Building CXX object kate/app/CMakeFiles/kateinterfaces.dir/katemwmodonhddialog.o
  626. [ 32%] Building CXX object part/CMakeFiles/katepartinterfaces.dir/render/katelayoutcache.o
  627. In file included from /home/eithrial/AUR/kate/src/kate-4.8.4/kate/plugins/snippets_tng/lib/completionmodel.h:29:0,
  628.                  from /home/eithrial/AUR/kate/src/kate-4.8.4/kate/plugins/snippets_tng/lib/repository.cpp:22:
  629. /home/eithrial/AUR/kate/src/kate-4.8.4/kate/plugins/../../ktexteditor/codecompletionmodelcontrollerinterface.h:343:1: warning: ‘CodeCompletionModelControllerInterface’ is deprecated (declared at /home/eithrial/AUR/kate/src/kate-4.8.4/kate/plugins/../../ktexteditor/codecompletionmodelcontrollerinterface.h:70) [-Wdeprecated-declarations]
  630. /home/eithrial/AUR/kate/src/kate-4.8.4/kate/plugins/../../ktexteditor/codecompletionmodelcontrollerinterface.h:343:1: warning: ‘CodeCompletionModelControllerInterface’ is deprecated (declared at /home/eithrial/AUR/kate/src/kate-4.8.4/kate/plugins/../../ktexteditor/codecompletionmodelcontrollerinterface.h:70) [-Wdeprecated-declarations]
  631. /home/eithrial/AUR/kate/src/kate-4.8.4/kate/plugins/../../ktexteditor/codecompletionmodelcontrollerinterface.h:343:1: warning: ‘CodeCompletionModelControllerInterface’ is deprecated (declared at /home/eithrial/AUR/kate/src/kate-4.8.4/kate/plugins/../../ktexteditor/codecompletionmodelcontrollerinterface.h:70) [-Wdeprecated-declarations]
  632. /home/eithrial/AUR/kate/src/kate-4.8.4/kate/plugins/../../ktexteditor/codecompletionmodelcontrollerinterface.h: In function ‘T qobject_cast(QObject*) [with T = KTextEditor::CodeCompletionModelControllerInterface*]’:
  633. /home/eithrial/AUR/kate/src/kate-4.8.4/kate/plugins/../../ktexteditor/codecompletionmodelcontrollerinterface.h:343:1: warning: ‘CodeCompletionModelControllerInterface’ is deprecated (declared at /home/eithrial/AUR/kate/src/kate-4.8.4/kate/plugins/../../ktexteditor/codecompletionmodelcontrollerinterface.h:70) [-Wdeprecated-declarations]
  634. /home/eithrial/AUR/kate/src/kate-4.8.4/kate/plugins/../../ktexteditor/codecompletionmodelcontrollerinterface.h: At global scope:
  635. /home/eithrial/AUR/kate/src/kate-4.8.4/kate/plugins/../../ktexteditor/codecompletionmodelcontrollerinterface.h:343:1: warning: ‘CodeCompletionModelControllerInterface’ is deprecated (declared at /home/eithrial/AUR/kate/src/kate-4.8.4/kate/plugins/../../ktexteditor/codecompletionmodelcontrollerinterface.h:70) [-Wdeprecated-declarations]
  636. /home/eithrial/AUR/kate/src/kate-4.8.4/kate/plugins/../../ktexteditor/codecompletionmodelcontrollerinterface.h:343:1: warning: ‘CodeCompletionModelControllerInterface’ is deprecated (declared at /home/eithrial/AUR/kate/src/kate-4.8.4/kate/plugins/../../ktexteditor/codecompletionmodelcontrollerinterface.h:70) [-Wdeprecated-declarations]
  637. /home/eithrial/AUR/kate/src/kate-4.8.4/kate/plugins/../../ktexteditor/codecompletionmodelcontrollerinterface.h: In function ‘T qobject_cast(const QObject*) [with T = KTextEditor::CodeCompletionModelControllerInterface*]’:
  638. /home/eithrial/AUR/kate/src/kate-4.8.4/kate/plugins/../../ktexteditor/codecompletionmodelcontrollerinterface.h:343:1: warning: ‘CodeCompletionModelControllerInterface’ is deprecated (declared at /home/eithrial/AUR/kate/src/kate-4.8.4/kate/plugins/../../ktexteditor/codecompletionmodelcontrollerinterface.h:70) [-Wdeprecated-declarations]
  639. /home/eithrial/AUR/kate/src/kate-4.8.4/kate/plugins/../../ktexteditor/codecompletionmodelcontrollerinterface.h: At global scope:
  640. /home/eithrial/AUR/kate/src/kate-4.8.4/kate/plugins/../../ktexteditor/codecompletionmodelcontrollerinterface.h:344:1: warning: ‘CodeCompletionModelControllerInterface2’ is deprecated (declared at /home/eithrial/AUR/kate/src/kate-4.8.4/kate/plugins/../../ktexteditor/codecompletionmodelcontrollerinterface.h:170) [-Wdeprecated-declarations]
  641. /home/eithrial/AUR/kate/src/kate-4.8.4/kate/plugins/../../ktexteditor/codecompletionmodelcontrollerinterface.h:344:1: warning: ‘CodeCompletionModelControllerInterface2’ is deprecated (declared at /home/eithrial/AUR/kate/src/kate-4.8.4/kate/plugins/../../ktexteditor/codecompletionmodelcontrollerinterface.h:170) [-Wdeprecated-declarations]
  642. /home/eithrial/AUR/kate/src/kate-4.8.4/kate/plugins/../../ktexteditor/codecompletionmodelcontrollerinterface.h:344:1: warning: ‘CodeCompletionModelControllerInterface2’ is deprecated (declared at /home/eithrial/AUR/kate/src/kate-4.8.4/kate/plugins/../../ktexteditor/codecompletionmodelcontrollerinterface.h:170) [-Wdeprecated-declarations]
  643. /home/eithrial/AUR/kate/src/kate-4.8.4/kate/plugins/../../ktexteditor/codecompletionmodelcontrollerinterface.h: In function ‘T qobject_cast(QObject*) [with T = KTextEditor::CodeCompletionModelControllerInterface2*]’:
  644. /home/eithrial/AUR/kate/src/kate-4.8.4/kate/plugins/../../ktexteditor/codecompletionmodelcontrollerinterface.h:344:1: warning: ‘CodeCompletionModelControllerInterface2’ is deprecated (declared at /home/eithrial/AUR/kate/src/kate-4.8.4/kate/plugins/../../ktexteditor/codecompletionmodelcontrollerinterface.h:170) [-Wdeprecated-declarations]
  645. /home/eithrial/AUR/kate/src/kate-4.8.4/kate/plugins/../../ktexteditor/codecompletionmodelcontrollerinterface.h: At global scope:
  646. /home/eithrial/AUR/kate/src/kate-4.8.4/kate/plugins/../../ktexteditor/codecompletionmodelcontrollerinterface.h:344:1: warning: ‘CodeCompletionModelControllerInterface2’ is deprecated (declared at /home/eithrial/AUR/kate/src/kate-4.8.4/kate/plugins/../../ktexteditor/codecompletionmodelcontrollerinterface.h:170) [-Wdeprecated-declarations]
  647. /home/eithrial/AUR/kate/src/kate-4.8.4/kate/plugins/../../ktexteditor/codecompletionmodelcontrollerinterface.h:344:1: warning: ‘CodeCompletionModelControllerInterface2’ is deprecated (declared at /home/eithrial/AUR/kate/src/kate-4.8.4/kate/plugins/../../ktexteditor/codecompletionmodelcontrollerinterface.h:170) [-Wdeprecated-declarations]
  648. /home/eithrial/AUR/kate/src/kate-4.8.4/kate/plugins/../../ktexteditor/codecompletionmodelcontrollerinterface.h: In function ‘T qobject_cast(const QObject*) [with T = KTextEditor::CodeCompletionModelControllerInterface2*]’:
  649. /home/eithrial/AUR/kate/src/kate-4.8.4/kate/plugins/../../ktexteditor/codecompletionmodelcontrollerinterface.h:344:1: warning: ‘CodeCompletionModelControllerInterface2’ is deprecated (declared at /home/eithrial/AUR/kate/src/kate-4.8.4/kate/plugins/../../ktexteditor/codecompletionmodelcontrollerinterface.h:170) [-Wdeprecated-declarations]
  650. In file included from /home/eithrial/AUR/kate/src/kate-4.8.4/kate/plugins/snippets_tng/lib/repository.cpp:22:0:
  651. /home/eithrial/AUR/kate/src/kate-4.8.4/kate/plugins/snippets_tng/lib/completionmodel.h: At global scope:
  652. /home/eithrial/AUR/kate/src/kate-4.8.4/kate/plugins/snippets_tng/lib/completionmodel.h:128:29: warning: unused parameter ‘index’ [-Wunused-parameter]
  653. /home/eithrial/AUR/kate/src/kate-4.8.4/kate/plugins/snippets_tng/lib/repository.cpp:211:10: warning: unused parameter ‘painter’ [-Wunused-parameter]
  654. /home/eithrial/AUR/kate/src/kate-4.8.4/kate/plugins/snippets_tng/lib/repository.cpp:211:10: warning: unused parameter ‘option’ [-Wunused-parameter]
  655. /home/eithrial/AUR/kate/src/kate-4.8.4/kate/plugins/snippets_tng/lib/repository.cpp:211:10: warning: unused parameter ‘index’ [-Wunused-parameter]
  656. /home/eithrial/AUR/kate/src/kate-4.8.4/kate/plugins/snippets_tng/lib/repository.cpp: In constructor ‘KTextEditor::CodesnippetsCore::SnippetRepositoryModel::SnippetRepositoryModel(QObject*, KTextEditor::TemplateScriptRegistrar*)’:
  657. /home/eithrial/AUR/kate/src/kate-4.8.4/kate/plugins/snippets_tng/lib/repository.cpp:235:12: warning: unused variable ‘register_service’ [-Wunused-variable]
  658. [ 33%] Building CXX object kate/app/CMakeFiles/kateinterfaces.dir/katesession.o
  659. [ 34%] Building CXX object part/CMakeFiles/katepartinterfaces.dir/render/katetextlayout.o
  660. [ 35%] Building CXX object kate/plugins/snippets_tng/lib/CMakeFiles/ktexteditor_codesnippets_core.dir/dbus_helpers.o
  661. [ 35%] Building CXX object part/CMakeFiles/katepartinterfaces.dir/render/katelinelayout.o
  662. Linking CXX shared library ../../../../lib/libktexteditor_codesnippets_core.so
  663. [ 35%] Built target ktexteditor_codesnippets_core
  664. [ 35%] Generating ui_katesessionConfig.h
  665. Scanning dependencies of target plasma_applet_katesession
  666. [ 36%] Building CXX object kate/plasma/session/CMakeFiles/plasma_applet_katesession.dir/plasma_applet_katesession_automoc.o
  667. [ 36%] Building CXX object kate/plasma/session/CMakeFiles/plasma_applet_katesession.dir/katesessionapplet.o
  668. [ 36%] Building CXX object part/CMakeFiles/katepartinterfaces.dir/search/kateregexp.o
  669. [ 36%] Building CXX object part/CMakeFiles/katepartinterfaces.dir/search/kateplaintextsearch.o
  670. [ 36%] Building CXX object kate/app/CMakeFiles/kateinterfaces.dir/katemdi.o
  671. [ 37%] Building CXX object part/CMakeFiles/katepartinterfaces.dir/search/kateregexpsearch.o
  672. Linking CXX shared module ../../../lib/plasma_applet_katesession.so
  673. [ 37%] Built target plasma_applet_katesession
  674. Scanning dependencies of target kdeinit_kwrite
  675. [ 38%] Building CXX object kwrite/CMakeFiles/kdeinit_kwrite.dir/kdeinit_kwrite_automoc.o
  676. [ 38%] Building CXX object part/CMakeFiles/katepartinterfaces.dir/search/katematch.o
  677. In file included from /usr/include/kxmlguiwindow.h:34:0,
  678.                  from /usr/include/kparts/mainwindow.h:25,
  679.                  from /home/eithrial/AUR/kate/src/build/kwrite/../../kate-4.8.4/kwrite/kwritemain.h:27,
  680.                  from /home/eithrial/AUR/kate/src/build/kwrite/../../kate-4.8.4/kwrite/kwriteapp.h:22,
  681.                  from /home/eithrial/AUR/kate/src/build/kwrite/moc_kwriteapp.cpp:10,
  682.                  from /home/eithrial/AUR/kate/src/build/kwrite/kdeinit_kwrite_automoc.cpp:4:
  683. /usr/include/kmainwindow.h:585:18: warning: ‘virtual void KMainWindow::saveProperties(KConfigGroup&)’ was hidden [-Woverloaded-virtual]
  684. In file included from /home/eithrial/AUR/kate/src/build/kwrite/../../kate-4.8.4/kwrite/kwriteapp.h:22:0,
  685.                  from /home/eithrial/AUR/kate/src/build/kwrite/moc_kwriteapp.cpp:10,
  686.                  from /home/eithrial/AUR/kate/src/build/kwrite/kdeinit_kwrite_automoc.cpp:4:
  687. /home/eithrial/AUR/kate/src/build/kwrite/../../kate-4.8.4/kwrite/kwritemain.h:103:10: warning:   by ‘void KWrite::saveProperties(KSharedConfigPtr)’ [-Woverloaded-virtual]
  688. In file included from /usr/include/kxmlguiwindow.h:34:0,
  689.                  from /usr/include/kparts/mainwindow.h:25,
  690.                  from /home/eithrial/AUR/kate/src/build/kwrite/../../kate-4.8.4/kwrite/kwritemain.h:27,
  691.                  from /home/eithrial/AUR/kate/src/build/kwrite/../../kate-4.8.4/kwrite/kwriteapp.h:22,
  692.                  from /home/eithrial/AUR/kate/src/build/kwrite/moc_kwriteapp.cpp:10,
  693.                  from /home/eithrial/AUR/kate/src/build/kwrite/kdeinit_kwrite_automoc.cpp:4:
  694. /usr/include/kmainwindow.h:592:18: warning: ‘virtual void KMainWindow::readProperties(const KConfigGroup&)’ was hidden [-Woverloaded-virtual]
  695. In file included from /home/eithrial/AUR/kate/src/build/kwrite/../../kate-4.8.4/kwrite/kwriteapp.h:22:0,
  696.                  from /home/eithrial/AUR/kate/src/build/kwrite/moc_kwriteapp.cpp:10,
  697.                  from /home/eithrial/AUR/kate/src/build/kwrite/kdeinit_kwrite_automoc.cpp:4:
  698. /home/eithrial/AUR/kate/src/build/kwrite/../../kate-4.8.4/kwrite/kwritemain.h:102:10: warning:   by ‘void KWrite::readProperties(KSharedConfigPtr)’ [-Woverloaded-virtual]
  699. [ 38%] Building CXX object kwrite/CMakeFiles/kdeinit_kwrite.dir/kwritemain.o
  700. [ 38%] Building CXX object part/CMakeFiles/katepartinterfaces.dir/search/katesearchbar.o
  701. [ 38%] Building CXX object kate/app/CMakeFiles/kateinterfaces.dir/katedocmanageradaptor.o
  702. In file included from /usr/include/kxmlguiwindow.h:34:0,
  703.                  from /usr/include/kparts/mainwindow.h:25,
  704.                  from /home/eithrial/AUR/kate/src/kate-4.8.4/kwrite/kwritemain.h:27,
  705.                  from /home/eithrial/AUR/kate/src/kate-4.8.4/kwrite/kwritemain.cpp:21:
  706. /usr/include/kmainwindow.h:585:18: warning: ‘virtual void KMainWindow::saveProperties(KConfigGroup&)’ was hidden [-Woverloaded-virtual]
  707. In file included from /home/eithrial/AUR/kate/src/kate-4.8.4/kwrite/kwritemain.cpp:21:0:
  708. /home/eithrial/AUR/kate/src/kate-4.8.4/kwrite/kwritemain.h:103:10: warning:   by ‘void KWrite::saveProperties(KSharedConfigPtr)’ [-Woverloaded-virtual]
  709. In file included from /usr/include/kxmlguiwindow.h:34:0,
  710.                  from /usr/include/kparts/mainwindow.h:25,
  711.                  from /home/eithrial/AUR/kate/src/kate-4.8.4/kwrite/kwritemain.h:27,
  712.                  from /home/eithrial/AUR/kate/src/kate-4.8.4/kwrite/kwritemain.cpp:21:
  713. /usr/include/kmainwindow.h:592:18: warning: ‘virtual void KMainWindow::readProperties(const KConfigGroup&)’ was hidden [-Woverloaded-virtual]
  714. In file included from /home/eithrial/AUR/kate/src/kate-4.8.4/kwrite/kwritemain.cpp:21:0:
  715. /home/eithrial/AUR/kate/src/kate-4.8.4/kwrite/kwritemain.h:102:10: warning:   by ‘void KWrite::readProperties(KSharedConfigPtr)’ [-Woverloaded-virtual]
  716. /home/eithrial/AUR/kate/src/kate-4.8.4/kate/app/katedocmanageradaptor.cpp:31:2: warning: #warning "kde4: need to port kate lib to dbus" [-Wcpp]
  717. [ 38%] Building CXX object kate/app/CMakeFiles/kateinterfaces.dir/katecontainer.o
  718. [ 38%] Building CXX object kwrite/CMakeFiles/kdeinit_kwrite.dir/kwriteapp.o
  719. [ 39%] Building CXX object kate/app/CMakeFiles/kateinterfaces.dir/katerunninginstanceinfo.o
  720. In file included from /usr/include/kxmlguiwindow.h:34:0,
  721.                  from /usr/include/kparts/mainwindow.h:25,
  722.                  from /home/eithrial/AUR/kate/src/kate-4.8.4/kwrite/kwritemain.h:27,
  723.                  from /home/eithrial/AUR/kate/src/kate-4.8.4/kwrite/kwriteapp.h:22,
  724.                  from /home/eithrial/AUR/kate/src/kate-4.8.4/kwrite/kwriteapp.cpp:19:
  725. /usr/include/kmainwindow.h:585:18: warning: ‘virtual void KMainWindow::saveProperties(KConfigGroup&)’ was hidden [-Woverloaded-virtual]
  726. In file included from /home/eithrial/AUR/kate/src/kate-4.8.4/kwrite/kwriteapp.h:22:0,
  727.                  from /home/eithrial/AUR/kate/src/kate-4.8.4/kwrite/kwriteapp.cpp:19:
  728. /home/eithrial/AUR/kate/src/kate-4.8.4/kwrite/kwritemain.h:103:10: warning:   by ‘void KWrite::saveProperties(KSharedConfigPtr)’ [-Woverloaded-virtual]
  729. In file included from /usr/include/kxmlguiwindow.h:34:0,
  730.                  from /usr/include/kparts/mainwindow.h:25,
  731.                  from /home/eithrial/AUR/kate/src/kate-4.8.4/kwrite/kwritemain.h:27,
  732.                  from /home/eithrial/AUR/kate/src/kate-4.8.4/kwrite/kwriteapp.h:22,
  733.                  from /home/eithrial/AUR/kate/src/kate-4.8.4/kwrite/kwriteapp.cpp:19:
  734. /usr/include/kmainwindow.h:592:18: warning: ‘virtual void KMainWindow::readProperties(const KConfigGroup&)’ was hidden [-Woverloaded-virtual]
  735. In file included from /home/eithrial/AUR/kate/src/kate-4.8.4/kwrite/kwriteapp.h:22:0,
  736.                  from /home/eithrial/AUR/kate/src/kate-4.8.4/kwrite/kwriteapp.cpp:19:
  737. /home/eithrial/AUR/kate/src/kate-4.8.4/kwrite/kwritemain.h:102:10: warning:   by ‘void KWrite::readProperties(KSharedConfigPtr)’ [-Woverloaded-virtual]
  738. Linking CXX shared library ../lib/libkdeinit4_kwrite.so
  739. [ 40%] Building CXX object part/CMakeFiles/katepartinterfaces.dir/syntax/katesyntaxmanager.o
  740. [ 40%] Building CXX object kate/app/CMakeFiles/kateinterfaces.dir/kateappcommands.o
  741. [ 40%] Built target kdeinit_kwrite
  742. [ 40%] Generating ui_styledialog.h
  743. Scanning dependencies of target ktexteditor_acomment
  744. [ 41%] Building CXX object playground/kte_acomment/CMakeFiles/ktexteditor_acomment.dir/ktexteditor_acomment_automoc.o
  745. [ 41%] Building CXX object playground/kte_acomment/CMakeFiles/ktexteditor_acomment.dir/acommentplugin.o
  746. Linking CXX shared library ../../lib/libkateinterfaces.so
  747. [ 41%] Built target kateinterfaces
  748. [ 41%] Building CXX object part/CMakeFiles/katepartinterfaces.dir/syntax/katehighlight.o
  749. [ 41%] Building CXX object playground/kte_acomment/CMakeFiles/ktexteditor_acomment.dir/artisticcomment.o
  750. [ 41%] Building CXX object part/CMakeFiles/katepartinterfaces.dir/syntax/katehighlighthelpers.o
  751. Linking CXX shared module ../../lib/ktexteditor_acomment.so
  752. [ 41%] Built target ktexteditor_acomment
  753. Scanning dependencies of target kdeinit_kate
  754. [ 41%] Building CXX object kate/app/CMakeFiles/kdeinit_kate.dir/kdeinit_kate_automoc.o
  755. [ 41%] Building CXX object kate/app/CMakeFiles/kdeinit_kate.dir/katemain.o
  756. /home/eithrial/AUR/kate/src/kate-4.8.4/kate/app/katemain.cpp: In function ‘int kdemain(int, char**)’:
  757. /home/eithrial/AUR/kate/src/kate-4.8.4/kate/app/katemain.cpp:174:8: warning: variable ‘start_session_set’ set but not used [-Wunused-but-set-variable]
  758. [ 42%] Building CXX object part/CMakeFiles/katepartinterfaces.dir/syntax/katehighlightmenu.o
  759. Linking CXX shared library ../../lib/libkdeinit4_kate.so
  760. [ 42%] Built target kdeinit_kate
  761. Scanning dependencies of target kategdbplugin
  762. [ 42%] Building CXX object kate/plugins/gdbplugin/CMakeFiles/kategdbplugin.dir/kategdbplugin_automoc.cpp.o
  763. [ 42%] Building CXX object part/CMakeFiles/katepartinterfaces.dir/syntax/katesyntaxdocument.o
  764. [ 42%] Building CXX object part/CMakeFiles/katepartinterfaces.dir/syntax/katecodefolding.o
  765. [ 43%] Building CXX object kate/plugins/gdbplugin/CMakeFiles/kategdbplugin.dir/plugin_kategdb.cpp.o
  766. [ 43%] Building CXX object part/CMakeFiles/katepartinterfaces.dir/syntax/kateextendedattribute.o
  767. [ 44%] Building CXX object part/CMakeFiles/katepartinterfaces.dir/view/kateview.o
  768. [ 44%] Building CXX object kate/plugins/gdbplugin/CMakeFiles/kategdbplugin.dir/debugview.cpp.o
  769. [ 44%] In file included from /home/eithrial/AUR/kate/src/kate-4.8.4/part/completion/katewordcompletion.h:30:0,
  770.                  from /home/eithrial/AUR/kate/src/kate-4.8.4/part/view/kateview.cpp:51:
  771. /home/eithrial/AUR/kate/src/kate-4.8.4/part/completion/codecompletionmodelcontrollerinterfacev4.h:46:1: warning: ‘CodeCompletionModelControllerInterface4’ is deprecated (declared at /home/eithrial/AUR/kate/src/kate-4.8.4/part/completion/codecompletionmodelcontrollerinterfacev4.h:32) [-Wdeprecated-declarations]
  772. /home/eithrial/AUR/kate/src/kate-4.8.4/part/completion/codecompletionmodelcontrollerinterfacev4.h:46:1: warning: ‘CodeCompletionModelControllerInterface4’ is deprecated (declared at /home/eithrial/AUR/kate/src/kate-4.8.4/part/completion/codecompletionmodelcontrollerinterfacev4.h:32) [-Wdeprecated-declarations]
  773. /home/eithrial/AUR/kate/src/kate-4.8.4/part/completion/codecompletionmodelcontrollerinterfacev4.h:46:1: warning: ‘CodeCompletionModelControllerInterface4’ is deprecated (declared at /home/eithrial/AUR/kate/src/kate-4.8.4/part/completion/codecompletionmodelcontrollerinterfacev4.h:32) [-Wdeprecated-declarations]
  774. /home/eithrial/AUR/kate/src/kate-4.8.4/part/completion/codecompletionmodelcontrollerinterfacev4.h: In function ‘T qobject_cast(QObject*) [with T = KTextEditor::CodeCompletionModelControllerInterface4*]’:
  775. /home/eithrial/AUR/kate/src/kate-4.8.4/part/completion/codecompletionmodelcontrollerinterfacev4.h:46:1: warning: ‘CodeCompletionModelControllerInterface4’ is deprecated (declared at /home/eithrial/AUR/kate/src/kate-4.8.4/part/completion/codecompletionmodelcontrollerinterfacev4.h:32) [-Wdeprecated-declarations]
  776. /home/eithrial/AUR/kate/src/kate-4.8.4/part/completion/codecompletionmodelcontrollerinterfacev4.h: At global scope:
  777. /home/eithrial/AUR/kate/src/kate-4.8.4/part/completion/codecompletionmodelcontrollerinterfacev4.h:46:1: warning: ‘CodeCompletionModelControllerInterface4’ is deprecated (declared at /home/eithrial/AUR/kate/src/kate-4.8.4/part/completion/codecompletionmodelcontrollerinterfacev4.h:32) [-Wdeprecated-declarations]
  778. /home/eithrial/AUR/kate/src/kate-4.8.4/part/completion/codecompletionmodelcontrollerinterfacev4.h:46:1: warning: ‘CodeCompletionModelControllerInterface4’ is deprecated (declared at /home/eithrial/AUR/kate/src/kate-4.8.4/part/completion/codecompletionmodelcontrollerinterfacev4.h:32) [-Wdeprecated-declarations]
  779. /home/eithrial/AUR/kate/src/kate-4.8.4/part/completion/codecompletionmodelcontrollerinterfacev4.h: In function ‘T qobject_cast(const QObject*) [with T = KTextEditor::CodeCompletionModelControllerInterface4*]’:
  780. /home/eithrial/AUR/kate/src/kate-4.8.4/part/completion/codecompletionmodelcontrollerinterfacev4.h:46:1: warning: ‘CodeCompletionModelControllerInterface4’ is deprecated (declared at /home/eithrial/AUR/kate/src/kate-4.8.4/part/completion/codecompletionmodelcontrollerinterfacev4.h:32) [-Wdeprecated-declarations]
  781. Building CXX object part/CMakeFiles/katepartinterfaces.dir/view/kateviewinternal.o
  782. [ 44%] Building CXX object kate/plugins/gdbplugin/CMakeFiles/kategdbplugin.dir/configview.cpp.o
  783. /home/eithrial/AUR/kate/src/kate-4.8.4/part/view/kateviewinternal.cpp: In member function ‘virtual void KateViewInternal::inputMethodEvent(QInputMethodEvent*)’:
  784. /home/eithrial/AUR/kate/src/kate-4.8.4/part/view/kateviewinternal.cpp:3452:8: warning: variable ‘createdPreedit’ set but not used [-Wunused-but-set-variable]
  785. [ 45%] Building CXX object kate/plugins/gdbplugin/CMakeFiles/kategdbplugin.dir/ioview.cpp.o
  786. [ 45%] [ 45%] Building CXX object kate/plugins/gdbplugin/CMakeFiles/kategdbplugin.dir/localsview.cpp.o
  787. Building CXX object part/CMakeFiles/katepartinterfaces.dir/view/kateviewhelpers.o
  788. Linking CXX shared module ../../../lib/kategdbplugin.so
  789. [ 46%] Building CXX object part/CMakeFiles/katepartinterfaces.dir/vimode/kateviinputmodemanager.o
  790. [ 46%] Built target kategdbplugin
  791. [ 46%] Generating ui_textfilterwidget.h
  792. Scanning dependencies of target katetextfilterplugin
  793. [ 47%] Building CXX object kate/plugins/textfilter/CMakeFiles/katetextfilterplugin.dir/katetextfilterplugin_automoc.o
  794. [ 47%] Building CXX object kate/plugins/textfilter/CMakeFiles/katetextfilterplugin.dir/plugin_katetextfilter.o
  795. /home/eithrial/AUR/kate/src/kate-4.8.4/kate/plugins/textfilter/plugin_katetextfilter.cpp:109:6: warning: unused parameter ‘exitCode’ [-Wunused-parameter]
  796. /home/eithrial/AUR/kate/src/kate-4.8.4/kate/plugins/textfilter/plugin_katetextfilter.cpp:109:6: warning: unused parameter ‘exitStatus’ [-Wunused-parameter]
  797. Linking CXX shared module ../../../lib/katetextfilterplugin.so
  798. [ 47%] Built target katetextfilterplugin
  799. Scanning dependencies of target katekonsoleplugin
  800. [ 47%] Building CXX object kate/plugins/konsole/CMakeFiles/katekonsoleplugin.dir/katekonsoleplugin_automoc.o
  801. [ 48%] [ 48%] Building CXX object kate/plugins/konsole/CMakeFiles/katekonsoleplugin.dir/kateconsole.o
  802. Building CXX object part/CMakeFiles/katepartinterfaces.dir/vimode/katevimodebase.o
  803. [ 48%] Building CXX object part/CMakeFiles/katepartinterfaces.dir/vimode/katevinormalmode.o
  804. Linking CXX shared module ../../../lib/katekonsoleplugin.so
  805. [ 48%] Built target katekonsoleplugin
  806. Scanning dependencies of target katefilebrowserplugin
  807. [ 48%] Building CXX object kate/plugins/filebrowser/CMakeFiles/katefilebrowserplugin.dir/katefilebrowserplugin_automoc.o
  808. [ 48%] Building CXX object kate/plugins/filebrowser/CMakeFiles/katefilebrowserplugin.dir/katefilebrowserplugin.o
  809. /home/eithrial/AUR/kate/src/kate-4.8.4/part/vimode/katevimodebase.cpp: In member function ‘void KateViModeBase::switchView(Direction)’:
  810. /home/eithrial/AUR/kate/src/kate-4.8.4/part/vimode/katevimodebase.cpp:1233:102: warning: ‘best_center_x’ may be used uninitialized in this function [-Wmaybe-uninitialized]
  811. /home/eithrial/AUR/kate/src/kate-4.8.4/part/vimode/katevimodebase.cpp:1213:102: warning: ‘best_center_y’ may be used uninitialized in this function [-Wmaybe-uninitialized]
  812. /home/eithrial/AUR/kate/src/kate-4.8.4/part/vimode/katevimodebase.cpp:1240:11: warning: ‘best_y2’ may be used uninitialized in this function [-Wmaybe-uninitialized]
  813. /home/eithrial/AUR/kate/src/kate-4.8.4/part/vimode/katevimodebase.cpp:1231:11: warning: ‘best_y1’ may be used uninitialized in this function [-Wmaybe-uninitialized]
  814. /home/eithrial/AUR/kate/src/kate-4.8.4/part/vimode/katevimodebase.cpp:1211:11: warning: ‘best_x2’ may be used uninitialized in this function [-Wmaybe-uninitialized]
  815. /home/eithrial/AUR/kate/src/kate-4.8.4/part/vimode/katevimodebase.cpp:1221:11: warning: ‘best_x1’ may be used uninitialized in this function [-Wmaybe-uninitialized]
  816. [ 48%] Building CXX object part/CMakeFiles/katepartinterfaces.dir/vimode/kateviinsertmode.o
  817. [ 48%] Building CXX object kate/plugins/filebrowser/CMakeFiles/katefilebrowserplugin.dir/katefilebrowserconfig.o
  818. [ 49%] Building CXX object part/CMakeFiles/katepartinterfaces.dir/vimode/katevicommand.o
  819. [ 49%] Building CXX object part/CMakeFiles/katepartinterfaces.dir/vimode/katevimotion.o
  820. [ 50%] Building CXX object kate/plugins/filebrowser/CMakeFiles/katefilebrowserplugin.dir/katefilebrowser.o
  821. [ 50%] Building CXX object part/CMakeFiles/katepartinterfaces.dir/vimode/katevirange.o
  822. [ 51%] Building CXX object part/CMakeFiles/katepartinterfaces.dir/vimode/katevikeyparser.o
  823. In file included from /home/eithrial/AUR/kate/src/kate-4.8.4/part/vimode/katevimotion.cpp:21:0:
  824. /home/eithrial/AUR/kate/src/kate-4.8.4/part/vimode/katevimotion.h:29:29: warning: type attributes ignored after type is already defined [-Wattributes]
  825. [ 51%] Building CXX object part/CMakeFiles/katepartinterfaces.dir/vimode/kateviglobal.o
  826. /home/eithrial/AUR/kate/src/kate-4.8.4/part/vimode/katevikeyparser.cpp: In member function ‘const QString KateViKeyParser::encodeKeySequence(const QString&) const’:
  827. /home/eithrial/AUR/kate/src/kate-4.8.4/part/vimode/katevikeyparser.cpp:499:7: warning: variable ‘startOfBlock’ set but not used [-Wunused-but-set-variable]
  828. [ 51%] Building CXX object kate/plugins/filebrowser/CMakeFiles/katefilebrowserplugin.dir/katebookmarkhandler.o
  829. [ 51%] Building CXX object part/CMakeFiles/katepartinterfaces.dir/vimode/katevivisualmode.o
  830. [ 51%] Building CXX object part/CMakeFiles/katepartinterfaces.dir/vimode/katevireplacemode.o
  831. Linking CXX shared module ../../../lib/katefilebrowserplugin.so
  832. [ 51%] Built target katefilebrowserplugin
  833. Scanning dependencies of target katemailfilesplugin
  834. [ 51%] Building CXX object kate/plugins/mailfiles/CMakeFiles/katemailfilesplugin.dir/katemailfilesplugin_automoc.o
  835. [ 51%] Building CXX object kate/plugins/mailfiles/CMakeFiles/katemailfilesplugin.dir/katemailfiles.o
  836. [ 52%] Building CXX object part/CMakeFiles/katepartinterfaces.dir/vimode/katevimodebar.o
  837. [ 52%] Building CXX object part/CMakeFiles/katepartinterfaces.dir/spellcheck/prefixstore.o
  838. [ 52%] [ 52%] Building CXX object part/CMakeFiles/katepartinterfaces.dir/spellcheck/ontheflycheck.o
  839. Building CXX object kate/plugins/mailfiles/CMakeFiles/katemailfilesplugin.dir/katemailfilesdialog.o
  840. [ 53%] Building CXX object part/CMakeFiles/katepartinterfaces.dir/spellcheck/spellcheck.o
  841. Linking CXX shared module ../../../lib/katemailfilesplugin.so
  842. [ 53%] Building CXX object part/CMakeFiles/katepartinterfaces.dir/spellcheck/spellcheckdialog.o
  843. [ 53%] Built target katemailfilesplugin
  844. [ 53%] Generating ui_tabbarconfigwidget.h
  845. Scanning dependencies of target katetabbarextensionplugin
  846. [ 53%] Building CXX object kate/plugins/tabbarextension/CMakeFiles/katetabbarextensionplugin.dir/katetabbarextensionplugin_automoc.o
  847. [ 54%] Building CXX object kate/plugins/tabbarextension/CMakeFiles/katetabbarextensionplugin.dir/plugin_katetabbarextension.o
  848. /home/eithrial/AUR/kate/src/kate-4.8.4/kate/plugins/tabbarextension/plugin_katetabbarextension.cpp:241:6: warning: unused parameter ‘config’ [-Wunused-parameter]
  849. /home/eithrial/AUR/kate/src/kate-4.8.4/kate/plugins/tabbarextension/plugin_katetabbarextension.cpp:241:6: warning: unused parameter ‘groupPrefix’ [-Wunused-parameter]
  850. /home/eithrial/AUR/kate/src/kate-4.8.4/kate/plugins/tabbarextension/plugin_katetabbarextension.cpp:245:6: warning: unused parameter ‘config’ [-Wunused-parameter]
  851. /home/eithrial/AUR/kate/src/kate-4.8.4/kate/plugins/tabbarextension/plugin_katetabbarextension.cpp:245:6: warning: unused parameter ‘groupPrefix’ [-Wunused-parameter]
  852. [ 54%] Building CXX object part/CMakeFiles/katepartinterfaces.dir/spellcheck/spellingmenu.o
  853. [ 54%] Building CXX object kate/plugins/tabbarextension/CMakeFiles/katetabbarextensionplugin.dir/ktinytabbutton.o
  854. [ 54%] Building CXX object part/CMakeFiles/katepartinterfaces.dir/utils/katecmds.o
  855. [ 55%] Building CXX object part/CMakeFiles/katepartinterfaces.dir/utils/kateconfig.o
  856. [ 55%] Building CXX object kate/plugins/tabbarextension/CMakeFiles/katetabbarextensionplugin.dir/ktinytabbar.o
  857. [ 55%] Building CXX object part/CMakeFiles/katepartinterfaces.dir/utils/katebookmarks.o
  858. [ 56%] Building CXX object kate/plugins/tabbarextension/CMakeFiles/katetabbarextensionplugin.dir/ktinytabbarconfigdialog.o
  859. [ 56%] Building CXX object part/CMakeFiles/katepartinterfaces.dir/utils/kateautoindent.o
  860. [ 57%] Building CXX object part/CMakeFiles/katepartinterfaces.dir/utils/kateschema.o
  861. [ 57%] Building CXX object kate/plugins/tabbarextension/CMakeFiles/katetabbarextensionplugin.dir/ktinytabbarconfigpage.o
  862. Linking CXX shared module ../../../lib/katetabbarextensionplugin.so
  863. [ 57%] Building CXX object part/CMakeFiles/katepartinterfaces.dir/utils/katetemplatehandler.o
  864. [ 57%] Built target katetabbarextensionplugin
  865. Scanning dependencies of target katesymbolviewerplugin
  866. [ 57%] Building CXX object kate/plugins/symbolviewer/CMakeFiles/katesymbolviewerplugin.dir/katesymbolviewerplugin_automoc.o
  867. [ 57%] Building CXX object kate/plugins/symbolviewer/CMakeFiles/katesymbolviewerplugin.dir/cpp_parser.o
  868. /home/eithrial/AUR/kate/src/kate-4.8.4/part/utils/katetemplatehandler.cpp:860:6: warning: unused parameter ‘document’ [-Wunused-parameter]
  869. /home/eithrial/AUR/kate/src/kate-4.8.4/kate/plugins/symbolviewer/cpp_parser.cpp: In member function ‘void KatePluginSymbolViewerView::parseCppSymbols()’:
  870. /home/eithrial/AUR/kate/src/kate-4.8.4/kate/plugins/symbolviewer/cpp_parser.cpp:26:26: warning: variable ‘retry’ set but not used [-Wunused-but-set-variable]
  871. /home/eithrial/AUR/kate/src/kate-4.8.4/kate/plugins/symbolviewer/cpp_parser.cpp:28:18: warning: variable ‘macro_pos’ set but not used [-Wunused-but-set-variable]
  872. [ 58%] Building CXX object kate/plugins/symbolviewer/CMakeFiles/katesymbolviewerplugin.dir/tcl_parser.o
  873. [ 58%] Building CXX object part/CMakeFiles/katepartinterfaces.dir/utils/kateprinter.o
  874. [ 58%] Building CXX object part/CMakeFiles/katepartinterfaces.dir/utils/kateglobal.o
  875. [ 58%] Building CXX object kate/plugins/symbolviewer/CMakeFiles/katesymbolviewerplugin.dir/fortran_parser.o
  876. /home/eithrial/AUR/kate/src/kate-4.8.4/part/utils/kateprinter.cpp: In static member function ‘static bool KatePrinter::print(KateDocument*)’:
  877. /home/eithrial/AUR/kate/src/kate-4.8.4/part/utils/kateprinter.cpp:359:38: warning: comparison between signed and unsigned integer expressions [-Wsign-compare]
  878. /home/eithrial/AUR/kate/src/kate-4.8.4/part/utils/kateprinter.cpp:151:9: warning: variable ‘startCol’ set but not used [-Wunused-but-set-variable]
  879. /home/eithrial/AUR/kate/src/kate-4.8.4/part/utils/kateprinter.cpp:152:9: warning: variable ‘endCol’ set but not used [-Wunused-but-set-variable]
  880. [ 58%] Building CXX object kate/plugins/symbolviewer/CMakeFiles/katesymbolviewerplugin.dir/perl_parser.o
  881. In file included from /home/eithrial/AUR/kate/src/kate-4.8.4/part/completion/katewordcompletion.h:30:0,
  882.                  from /home/eithrial/AUR/kate/src/kate-4.8.4/part/utils/kateglobal.cpp:37:
  883. /home/eithrial/AUR/kate/src/kate-4.8.4/part/completion/codecompletionmodelcontrollerinterfacev4.h:46:1: warning: ‘CodeCompletionModelControllerInterface4’ is deprecated (declared at /home/eithrial/AUR/kate/src/kate-4.8.4/part/completion/codecompletionmodelcontrollerinterfacev4.h:32) [-Wdeprecated-declarations]
  884. /home/eithrial/AUR/kate/src/kate-4.8.4/part/completion/codecompletionmodelcontrollerinterfacev4.h:46:1: warning: ‘CodeCompletionModelControllerInterface4’ is deprecated (declared at /home/eithrial/AUR/kate/src/kate-4.8.4/part/completion/codecompletionmodelcontrollerinterfacev4.h:32) [-Wdeprecated-declarations]
  885. /home/eithrial/AUR/kate/src/kate-4.8.4/part/completion/codecompletionmodelcontrollerinterfacev4.h:46:1: warning: ‘CodeCompletionModelControllerInterface4’ is deprecated (declared at /home/eithrial/AUR/kate/src/kate-4.8.4/part/completion/codecompletionmodelcontrollerinterfacev4.h:32) [-Wdeprecated-declarations]
  886. /home/eithrial/AUR/kate/src/kate-4.8.4/part/completion/codecompletionmodelcontrollerinterfacev4.h: In function ‘T qobject_cast(QObject*) [with T = KTextEditor::CodeCompletionModelControllerInterface4*]’:
  887. /home/eithrial/AUR/kate/src/kate-4.8.4/part/completion/codecompletionmodelcontrollerinterfacev4.h:46:1: warning: ‘CodeCompletionModelControllerInterface4’ is deprecated (declared at /home/eithrial/AUR/kate/src/kate-4.8.4/part/completion/codecompletionmodelcontrollerinterfacev4.h:32) [-Wdeprecated-declarations]
  888. /home/eithrial/AUR/kate/src/kate-4.8.4/part/completion/codecompletionmodelcontrollerinterfacev4.h: At global scope:
  889. /home/eithrial/AUR/kate/src/kate-4.8.4/part/completion/codecompletionmodelcontrollerinterfacev4.h:46:1: warning: ‘CodeCompletionModelControllerInterface4’ is deprecated (declared at /home/eithrial/AUR/kate/src/kate-4.8.4/part/completion/codecompletionmodelcontrollerinterfacev4.h:32) [-Wdeprecated-declarations]
  890. /home/eithrial/AUR/kate/src/kate-4.8.4/part/completion/codecompletionmodelcontrollerinterfacev4.h:46:1: warning: ‘CodeCompletionModelControllerInterface4’ is deprecated (declared at /home/eithrial/AUR/kate/src/kate-4.8.4/part/completion/codecompletionmodelcontrollerinterfacev4.h:32) [-Wdeprecated-declarations]
  891. /home/eithrial/AUR/kate/src/kate-4.8.4/part/completion/codecompletionmodelcontrollerinterfacev4.h: In function ‘T qobject_cast(const QObject*) [with T = KTextEditor::CodeCompletionModelControllerInterface4*]’:
  892. /home/eithrial/AUR/kate/src/kate-4.8.4/part/completion/codecompletionmodelcontrollerinterfacev4.h:46:1: warning: ‘CodeCompletionModelControllerInterface4’ is deprecated (declared at /home/eithrial/AUR/kate/src/kate-4.8.4/part/completion/codecompletionmodelcontrollerinterfacev4.h:32) [-Wdeprecated-declarations]
  893. [ 59%] Building CXX object part/CMakeFiles/katepartinterfaces.dir/utils/katecmd.o
  894. [ 59%] Building CXX object kate/plugins/symbolviewer/CMakeFiles/katesymbolviewerplugin.dir/php_parser.o
  895. [ 59%] Building CXX object part/CMakeFiles/katepartinterfaces.dir/utils/katestyletreewidget.o
  896. [ 59%] Building CXX object part/CMakeFiles/katepartinterfaces.dir/utils/katepartpluginmanager.o
  897. [ 60%] Building CXX object kate/plugins/symbolviewer/CMakeFiles/katesymbolviewerplugin.dir/xslt_parser.o
  898. [ 61%] Building CXX object part/CMakeFiles/katepartinterfaces.dir/swapfile/katerecoverbar.o
  899. [ 61%] Building CXX object part/CMakeFiles/katepartinterfaces.dir/swapfile/kateswapfile.o
  900. [ 61%] Building CXX object kate/plugins/symbolviewer/CMakeFiles/katesymbolviewerplugin.dir/ruby_parser.o
  901. [ 61%] Building CXX object part/CMakeFiles/katepartinterfaces.dir/swapfile/katebrokenswapfilebar.o
  902. [ 62%] Generating ui_btconfigwidget.h
  903. [ 62%] Generating ui_btbrowserwidget.h
  904. /home/eithrial/AUR/kate/src/kate-4.8.4/kate/plugins/symbolviewer/ruby_parser.cpp: In member function ‘void KatePluginSymbolViewerView::parseRubySymbols()’:
  905. /home/eithrial/AUR/kate/src/kate-4.8.4/kate/plugins/symbolviewer/ruby_parser.cpp:36:19: warning: variable ‘lastMcrNode’ set but not used [-Wunused-but-set-variable]
  906. Scanning dependencies of target katebacktracebrowserplugin
  907. [ 62%] Building CXX object kate/plugins/backtracebrowser/CMakeFiles/katebacktracebrowserplugin.dir/katebacktracebrowserplugin_automoc.o
  908. [ 62%] Building CXX object kate/plugins/symbolviewer/CMakeFiles/katesymbolviewerplugin.dir/python_parser.o
  909. [ 62%] Building CXX object kate/plugins/backtracebrowser/CMakeFiles/katebacktracebrowserplugin.dir/katebacktracebrowser.o
  910. Linking CXX shared library ../lib/libkatepartinterfaces.so
  911. /home/eithrial/AUR/kate/src/kate-4.8.4/kate/plugins/backtracebrowser/katebacktracebrowser.cpp:144:7: warning: unused parameter ‘number’ [-Wunused-parameter]
  912. /home/eithrial/AUR/kate/src/kate-4.8.4/kate/plugins/backtracebrowser/katebacktracebrowser.cpp:176:6: warning: unused parameter ‘config’ [-Wunused-parameter]
  913. /home/eithrial/AUR/kate/src/kate-4.8.4/kate/plugins/backtracebrowser/katebacktracebrowser.cpp:176:6: warning: unused parameter ‘group’ [-Wunused-parameter]
  914. /home/eithrial/AUR/kate/src/kate-4.8.4/kate/plugins/backtracebrowser/katebacktracebrowser.cpp:180:6: warning: unused parameter ‘config’ [-Wunused-parameter]
  915. /home/eithrial/AUR/kate/src/kate-4.8.4/kate/plugins/backtracebrowser/katebacktracebrowser.cpp:180:6: warning: unused parameter ‘group’ [-Wunused-parameter]
  916. [ 63%] Building CXX object kate/plugins/symbolviewer/CMakeFiles/katesymbolviewerplugin.dir/bash_parser.o
  917. /usr/bin/ld: /usr/lib/gcc/x86_64-unknown-linux-gnu/4.7.1/../../../../lib/libm.a(k_standard.o): relocation R_X86_64_32S against `.rodata' can not be used when making a shared object; recompile with -fPIC
  918. /usr/lib/gcc/x86_64-unknown-linux-gnu/4.7.1/../../../../lib/libm.a: could not read symbols: Bad value
  919. collect2: error: ld returned 1 exit status
  920. make[2]: *** [lib/libkatepartinterfaces.so.4.8.0] Error 1
  921. make[1]: *** [part/CMakeFiles/katepartinterfaces.dir/all] Error 2
  922. make[1]: *** Waiting for unfinished jobs....
  923. [ 63%] Building CXX object kate/plugins/backtracebrowser/CMakeFiles/katebacktracebrowserplugin.dir/btparser.o
  924. In file included from /home/eithrial/AUR/kate/src/kate-4.8.4/kate/plugins/backtracebrowser/btparser.cpp:19:0:
  925. /home/eithrial/AUR/kate/src/kate-4.8.4/kate/plugins/backtracebrowser/btparser.h: In function ‘BtInfo parseBtLine(const QString&)’:
  926. /home/eithrial/AUR/kate/src/kate-4.8.4/kate/plugins/backtracebrowser/btparser.h:25:7: warning: ‘info.BtInfo::step’ may be used uninitialized in this function [-Wuninitialized]
  927. /home/eithrial/AUR/kate/src/kate-4.8.4/kate/plugins/backtracebrowser/btparser.cpp:150:10: note: ‘info.BtInfo::step’ was declared here
  928. In file included from /home/eithrial/AUR/kate/src/kate-4.8.4/kate/plugins/backtracebrowser/btparser.cpp:19:0:
  929. /home/eithrial/AUR/kate/src/kate-4.8.4/kate/plugins/backtracebrowser/btparser.h:25:7: warning: ‘info.BtInfo::line’ may be used uninitialized in this function [-Wuninitialized]
  930. /home/eithrial/AUR/kate/src/kate-4.8.4/kate/plugins/backtracebrowser/btparser.cpp:150:10: note: ‘info.BtInfo::line’ was declared here
  931. [ 64%] Building CXX object kate/plugins/backtracebrowser/CMakeFiles/katebacktracebrowserplugin.dir/btfileindexer.o
  932. /home/eithrial/AUR/kate/src/kate-4.8.4/kate/plugins/symbolviewer/bash_parser.cpp: In member function ‘void KatePluginSymbolViewerView::parseBashSymbols()’:
  933. /home/eithrial/AUR/kate/src/kate-4.8.4/kate/plugins/symbolviewer/bash_parser.cpp:34:13: warning: variable ‘mainprog’ set but not used [-Wunused-but-set-variable]
  934. [ 64%] Building CXX object kate/plugins/backtracebrowser/CMakeFiles/katebacktracebrowserplugin.dir/btdatabase.o
  935. [ 64%] Building CXX object kate/plugins/symbolviewer/CMakeFiles/katesymbolviewerplugin.dir/plugin_katesymbolviewer.o
  936. Linking CXX shared module ../../../lib/katebacktracebrowserplugin.so
  937. [ 64%] Built target katebacktracebrowserplugin
  938. /home/eithrial/AUR/kate/src/kate-4.8.4/kate/plugins/symbolviewer/plugin_katesymbolviewer.cpp: In member function ‘void KatePluginSymbolViewerView::parseSymbols()’:
  939. /home/eithrial/AUR/kate/src/kate-4.8.4/kate/plugins/symbolviewer/plugin_katesymbolviewer.cpp:246:20: warning: variable ‘node’ set but not used [-Wunused-but-set-variable]
  940. Linking CXX shared module ../../../lib/katesymbolviewerplugin.so
  941. [ 64%] Built target katesymbolviewerplugin
  942. make: *** [all] Error 2
  943. ==> ERROR:(B A failure occurred in build().(B
  944.     Aborting...(B
RAW Paste Data
We use cookies for various purposes including analytics. By continuing to use Pastebin, you agree to our use of cookies as described in the Cookies Policy. OK, I Understand
 
Top