Advertisement
Guest User

Untitled

a guest
Jul 6th, 2016
124
Never
Not a member of Pastebin yet? Sign Up, it unlocks many cool features!
text 36.45 KB | None
  1. E:\openmrs\openmrs-module-appointmentschedulingui>mnv clean install
  2. 'mnv' is not recognized as an internal or external command,
  3. operable program or batch file.
  4.  
  5. E:\openmrs\openmrs-module-appointmentschedulingui>mvn clean install
  6. Java HotSpot(TM) 64-Bit Server VM warning: ignoring option PermSize=256m; support was removed in 8.0
  7. Java HotSpot(TM) 64-Bit Server VM warning: ignoring option MaxPermSize=512m; support was removed in 8.0
  8. [INFO] Scanning for projects...
  9. [WARNING]
  10. [WARNING] Some problems were encountered while building the effective model for org.openmrs.module:appointmentschedulingui-omod:jar:1.4-SNAPSHOT
  11. [WARNING] 'build.plugins.plugin.(groupId:artifactId)' must be unique but found duplicate declaration of plugin org.apache.maven.plugins:maven-dependency-plugin @ org.openmrs.module:appointmentschedulingui-omod:[unknown-version], E:\openmrs\openmrs-module-appointmentschedulingui\omod\pom.xml, line 187, column 21
  12. [WARNING] 'build.plugins.plugin.version' for org.codehaus.mojo:exec-maven-plugin is missing. @ org.openmrs.module:appointmentschedulingui-omod:[unknown-version], E:\openmrs\openmrs-module-appointmentschedulingui\omod\pom.xml, line 319, column 12
  13. [WARNING]
  14. [WARNING] It is highly recommended to fix these problems because they threaten the stability of your build.
  15. [WARNING]
  16. [WARNING] For this reason, future Maven versions might no longer support building such malformed projects.
  17. [WARNING]
  18. [INFO] ------------------------------------------------------------------------
  19. [INFO] Reactor Build Order:
  20. [INFO]
  21. [INFO] Appointment Scheduling UI Module
  22. [INFO] Appointment Scheduling UI Module API
  23. [INFO] Appointment Scheduling UI Module OMOD
  24. [INFO]
  25. [INFO] ------------------------------------------------------------------------
  26. [INFO] Building Appointment Scheduling UI Module 1.4-SNAPSHOT
  27. [INFO] ------------------------------------------------------------------------
  28. Downloading: http://mavenrepo.openmrs.org/nexus/content/repositories/public/org/apache/maven/plugins/maven-clean-plugin/2.5/maven-clean-plugin-2.5.pom
  29. Downloaded: http://mavenrepo.openmrs.org/nexus/content/repositories/public/org/apache/maven/plugins/maven-clean-plugin/2.5/maven-clean-plugin-2.5.pom (4 KB at 1.6 KB/sec)
  30. Downloading: http://mavenrepo.openmrs.org/nexus/content/repositories/public/org/apache/maven/plugins/maven-install-plugin/2.4/maven-install-plugin-2.4.pom
  31. Downloaded: http://mavenrepo.openmrs.org/nexus/content/repositories/public/org/apache/maven/plugins/maven-install-plugin/2.4/maven-install-plugin-2.4.pom (7 KB at 9.4 KB/sec)
  32. [INFO]
  33. [INFO] --- maven-clean-plugin:2.5:clean (default-clean) @ appointmentschedulingui ---
  34. [INFO]
  35. [INFO] --- maven-install-plugin:2.4:install (default-install) @ appointmentschedulingui ---
  36. Downloading: http://mavenrepo.openmrs.org/nexus/content/repositories/public/org/codehaus/plexus/plexus-utils/3.0.5/plexus-utils-3.0.5.pom
  37. Downloaded: http://mavenrepo.openmrs.org/nexus/content/repositories/public/org/codehaus/plexus/plexus-utils/3.0.5/plexus-utils-3.0.5.pom (3 KB at 4.7 KB/sec)
  38. Downloading: http://mavenrepo.openmrs.org/nexus/content/repositories/public/org/codehaus/plexus/plexus/3.1/plexus-3.1.pom
  39. Downloaded: http://mavenrepo.openmrs.org/nexus/content/repositories/public/org/codehaus/plexus/plexus/3.1/plexus-3.1.pom (19 KB at 10.8 KB/sec)
  40. Downloading: http://mavenrepo.openmrs.org/nexus/content/repositories/public/org/codehaus/plexus/plexus-digest/1.0/plexus-digest-1.0.pom
  41. Downloaded: http://mavenrepo.openmrs.org/nexus/content/repositories/public/org/codehaus/plexus/plexus-digest/1.0/plexus-digest-1.0.pom (2 KB at 2.2 KB/sec)
  42. Downloading: http://mavenrepo.openmrs.org/nexus/content/repositories/public/org/codehaus/plexus/plexus-components/1.1.7/plexus-components-1.1.7.pom
  43. Downloaded: http://mavenrepo.openmrs.org/nexus/content/repositories/public/org/codehaus/plexus/plexus-components/1.1.7/plexus-components-1.1.7.pom (5 KB at 9.2 KB/sec)
  44. Downloading: http://mavenrepo.openmrs.org/nexus/content/repositories/public/org/codehaus/plexus/plexus-digest/1.0/plexus-digest-1.0.jar
  45. Downloading: http://mavenrepo.openmrs.org/nexus/content/repositories/public/org/codehaus/plexus/plexus-utils/3.0.5/plexus-utils-3.0.5.jar
  46. Downloaded: http://mavenrepo.openmrs.org/nexus/content/repositories/public/org/codehaus/plexus/plexus-digest/1.0/plexus-digest-1.0.jar (12 KB at 15.0 KB/sec)
  47. Downloaded: http://mavenrepo.openmrs.org/nexus/content/repositories/public/org/codehaus/plexus/plexus-utils/3.0.5/plexus-utils-3.0.5.jar (226 KB at 41.7 KB/sec)
  48. [INFO] Installing E:\openmrs\openmrs-module-appointmentschedulingui\pom.xml to C:\Users\HossamEldeen\.m2\repository\org\openmrs\module\appointmentschedulingui\1.4-SNAPSHOT\appointmentschedulingui-1.4-SNAPSHOT.pom
  49. [INFO]
  50. [INFO] ------------------------------------------------------------------------
  51. [INFO] Building Appointment Scheduling UI Module API 1.4-SNAPSHOT
  52. [INFO] ------------------------------------------------------------------------
  53. [INFO]
  54. [INFO] --- maven-clean-plugin:2.5:clean (default-clean) @ appointmentschedulingui-api ---
  55. [INFO] Deleting E:\openmrs\openmrs-module-appointmentschedulingui\api\target
  56. [INFO]
  57. [INFO] --- maven-resources-plugin:2.6:resources (default-resources) @ appointmentschedulingui-api ---
  58. [INFO] Using 'UTF-8' encoding to copy filtered resources.
  59. [INFO] Copying 21 resources
  60. [INFO]
  61. [INFO] --- maven-compiler-plugin:3.1:compile (default-compile) @ appointmentschedulingui-api ---
  62. [INFO] Changes detected - recompiling the module!
  63. [INFO] Compiling 9 source files to E:\openmrs\openmrs-module-appointmentschedulingui\api\target\classes
  64. [INFO]
  65. [INFO] --- maven-resources-plugin:2.6:testResources (default-testResources) @ appointmentschedulingui-api ---
  66. [INFO] Using 'UTF-8' encoding to copy filtered resources.
  67. [INFO] Copying 4 resources
  68. [INFO]
  69. [INFO] --- maven-compiler-plugin:3.1:testCompile (default-testCompile) @ appointmentschedulingui-api ---
  70. [INFO] Changes detected - recompiling the module!
  71. [INFO] Compiling 6 source files to E:\openmrs\openmrs-module-appointmentschedulingui\api\target\test-classes
  72. [WARNING] /E:/openmrs/openmrs-module-appointmentschedulingui/api/src/test/java/org/openmrs/module/appointmentschedulingui/htmlformentry/AppointmentCheckInElementTest.java: E:\openmrs\openmrs-module-appointmentschedulingui\api\src\test\java\org\openmrs\module\appointmentschedulingui\htmlformentry\AppointmentCheckInElementTest.java uses unchecked or unsafe operations.
  73. [WARNING] /E:/openmrs/openmrs-module-appointmentschedulingui/api/src/test/java/org/openmrs/module/appointmentschedulingui/htmlformentry/AppointmentCheckInElementTest.java: Recompile with -Xlint:unchecked for details.
  74. [INFO]
  75. [INFO] --- maven-surefire-plugin:2.12.4:test (default-test) @ appointmentschedulingui-api ---
  76. Downloading: http://mavenrepo.openmrs.org/nexus/content/repositories/public/org/apache/maven/surefire/surefire-booter/2.12.4/surefire-booter-2.12.4.pom
  77. Downloaded: http://mavenrepo.openmrs.org/nexus/content/repositories/public/org/apache/maven/surefire/surefire-booter/2.12.4/surefire-booter-2.12.4.pom (3 KB at 2.8 KB/sec)
  78. Downloading: http://mavenrepo.openmrs.org/nexus/content/repositories/public/org/apache/maven/surefire/surefire-api/2.12.4/surefire-api-2.12.4.pom
  79. Downloaded: http://mavenrepo.openmrs.org/nexus/content/repositories/public/org/apache/maven/surefire/surefire-api/2.12.4/surefire-api-2.12.4.pom (3 KB at 3.1 KB/sec)
  80. Downloading: http://mavenrepo.openmrs.org/nexus/content/repositories/public/org/apache/maven/surefire/maven-surefire-common/2.12.4/maven-surefire-common-2.12.4.pom
  81. Downloaded: http://mavenrepo.openmrs.org/nexus/content/repositories/public/org/apache/maven/surefire/maven-surefire-common/2.12.4/maven-surefire-common-2.12.4.pom (6 KB at 6.3 KB/sec)
  82. Downloading: http://mavenrepo.openmrs.org/nexus/content/repositories/public/org/apache/maven/plugin-tools/maven-plugin-annotations/3.1/maven-plugin-annotations-3.1.pom
  83. Downloaded: http://mavenrepo.openmrs.org/nexus/content/repositories/public/org/apache/maven/plugin-tools/maven-plugin-annotations/3.1/maven-plugin-annotations-3.1.pom (2 KB at 1.8 KB/sec)
  84. Downloading: http://mavenrepo.openmrs.org/nexus/content/repositories/public/org/apache/maven/plugin-tools/maven-plugin-tools/3.1/maven-plugin-tools-3.1.pom
  85. Downloaded: http://mavenrepo.openmrs.org/nexus/content/repositories/public/org/apache/maven/plugin-tools/maven-plugin-tools/3.1/maven-plugin-tools-3.1.pom (16 KB at 11.2 KB/sec)
  86. Downloading: http://mavenrepo.openmrs.org/nexus/content/repositories/public/org/apache/maven/reporting/maven-reporting-api/2.0.9/maven-reporting-api-2.0.9.pom
  87. Downloaded: http://mavenrepo.openmrs.org/nexus/content/repositories/public/org/apache/maven/reporting/maven-reporting-api/2.0.9/maven-reporting-api-2.0.9.pom (2 KB at 2.4 KB/sec)
  88. Downloading: http://mavenrepo.openmrs.org/nexus/content/repositories/public/org/apache/maven/reporting/maven-reporting/2.0.9/maven-reporting-2.0.9.pom
  89. Downloaded: http://mavenrepo.openmrs.org/nexus/content/repositories/public/org/apache/maven/reporting/maven-reporting/2.0.9/maven-reporting-2.0.9.pom (2 KB at 2.1 KB/sec)
  90. Downloading: http://mavenrepo.openmrs.org/nexus/content/repositories/public/org/apache/maven/maven-toolchain/2.0.9/maven-toolchain-2.0.9.pom
  91. Downloaded: http://mavenrepo.openmrs.org/nexus/content/repositories/public/org/apache/maven/maven-toolchain/2.0.9/maven-toolchain-2.0.9.pom (4 KB at 4.5 KB/sec)
  92. Downloading: http://mavenrepo.openmrs.org/nexus/content/repositories/public/org/apache/maven/shared/maven-common-artifact-filters/1.3/maven-common-artifact-filters-1.3.pom
  93. Downloaded: http://mavenrepo.openmrs.org/nexus/content/repositories/public/org/apache/maven/shared/maven-common-artifact-filters/1.3/maven-common-artifact-filters-1.3.pom (4 KB at 4.6 KB/sec)
  94. Downloading: http://mavenrepo.openmrs.org/nexus/content/repositories/public/org/apache/maven/shared/maven-shared-components/12/maven-shared-components-12.pom
  95. Downloaded: http://mavenrepo.openmrs.org/nexus/content/repositories/public/org/apache/maven/shared/maven-shared-components/12/maven-shared-components-12.pom (10 KB at 10.3 KB/sec)
  96. Downloading: http://mavenrepo.openmrs.org/nexus/content/repositories/public/org/apache/maven/maven-parent/13/maven-parent-13.pom
  97. Downloaded: http://mavenrepo.openmrs.org/nexus/content/repositories/public/org/apache/maven/maven-parent/13/maven-parent-13.pom (23 KB at 9.8 KB/sec)
  98. Downloading: http://mavenrepo.openmrs.org/nexus/content/repositories/public/org/apache/maven/surefire/surefire-api/2.12.4/surefire-api-2.12.4.jar
  99. Downloading: http://mavenrepo.openmrs.org/nexus/content/repositories/public/org/apache/maven/surefire/surefire-booter/2.12.4/surefire-booter-2.12.4.jar
  100. Downloading: http://mavenrepo.openmrs.org/nexus/content/repositories/public/org/apache/maven/surefire/maven-surefire-common/2.12.4/maven-surefire-common-2.12.4.jar
  101. Downloading: http://mavenrepo.openmrs.org/nexus/content/repositories/public/org/codehaus/plexus/plexus-utils/3.0.8/plexus-utils-3.0.8.jar
  102. Downloading: http://mavenrepo.openmrs.org/nexus/content/repositories/public/org/apache/maven/shared/maven-common-artifact-filters/1.3/maven-common-artifact-filters-1.3.jar
  103. Downloaded: http://mavenrepo.openmrs.org/nexus/content/repositories/public/org/apache/maven/shared/maven-common-artifact-filters/1.3/maven-common-artifact-filters-1.3.jar (31 KB at 7.3 KB/sec)
  104. Downloading: http://mavenrepo.openmrs.org/nexus/content/repositories/public/org/apache/maven/reporting/maven-reporting-api/2.0.9/maven-reporting-api-2.0.9.jar
  105. Downloaded: http://mavenrepo.openmrs.org/nexus/content/repositories/public/org/apache/maven/surefire/surefire-booter/2.12.4/surefire-booter-2.12.4.jar (34 KB at 8.0 KB/sec)
  106. Downloading: http://mavenrepo.openmrs.org/nexus/content/repositories/public/org/apache/maven/maven-toolchain/2.0.9/maven-toolchain-2.0.9.jar
  107. Downloaded: http://mavenrepo.openmrs.org/nexus/content/repositories/public/org/apache/maven/reporting/maven-reporting-api/2.0.9/maven-reporting-api-2.0.9.jar (10 KB at 1.4 KB/sec)
  108. Downloading: http://mavenrepo.openmrs.org/nexus/content/repositories/public/org/apache/maven/plugin-tools/maven-plugin-annotations/3.1/maven-plugin-annotations-3.1.jar
  109. Downloaded: http://mavenrepo.openmrs.org/nexus/content/repositories/public/org/apache/maven/maven-toolchain/2.0.9/maven-toolchain-2.0.9.jar (38 KB at 4.1 KB/sec)
  110. Downloaded: http://mavenrepo.openmrs.org/nexus/content/repositories/public/org/apache/maven/plugin-tools/maven-plugin-annotations/3.1/maven-plugin-annotations-3.1.jar (14 KB at 1.3 KB/sec)
  111. Downloaded: http://mavenrepo.openmrs.org/nexus/content/repositories/public/org/apache/maven/surefire/surefire-api/2.12.4/surefire-api-2.12.4.jar (115 KB at 8.2 KB/sec)
  112. Downloaded: http://mavenrepo.openmrs.org/nexus/content/repositories/public/org/apache/maven/surefire/maven-surefire-common/2.12.4/maven-surefire-common-2.12.4.jar (257 KB at 16.4 KB/sec)
  113. Downloaded: http://mavenrepo.openmrs.org/nexus/content/repositories/public/org/codehaus/plexus/plexus-utils/3.0.8/plexus-utils-3.0.8.jar (227 KB at 10.8 KB/sec)
  114. [INFO] Surefire report directory: E:\openmrs\openmrs-module-appointmentschedulingui\api\target\surefire-reports
  115. Downloading: http://mavenrepo.openmrs.org/nexus/content/repositories/public/org/apache/maven/surefire/surefire-junit4/2.12.4/surefire-junit4-2.12.4.pom
  116. Downloaded: http://mavenrepo.openmrs.org/nexus/content/repositories/public/org/apache/maven/surefire/surefire-junit4/2.12.4/surefire-junit4-2.12.4.pom (3 KB at 2.3 KB/sec)
  117. Downloading: http://mavenrepo.openmrs.org/nexus/content/repositories/public/org/apache/maven/surefire/surefire-providers/2.12.4/surefire-providers-2.12.4.pom
  118. Downloaded: http://mavenrepo.openmrs.org/nexus/content/repositories/public/org/apache/maven/surefire/surefire-providers/2.12.4/surefire-providers-2.12.4.pom (3 KB at 2.1 KB/sec)
  119. Downloading: http://mavenrepo.openmrs.org/nexus/content/repositories/public/org/apache/maven/surefire/surefire-junit4/2.12.4/surefire-junit4-2.12.4.jar
  120. Downloaded: http://mavenrepo.openmrs.org/nexus/content/repositories/public/org/apache/maven/surefire/surefire-junit4/2.12.4/surefire-junit4-2.12.4.jar (37 KB at 10.5 KB/sec)
  121.  
  122. -------------------------------------------------------
  123. T E S T S
  124. -------------------------------------------------------
  125. Running org.openmrs.module.appointmentschedulingui.AppointmentSchedulingUIActivatorTest
  126. log4j:WARN No appenders could be found for logger (org.springframework.test.context.junit4.SpringJUnit4ClassRunner).
  127. log4j:WARN Please initialize the log4j system properly.
  128. Tests run: 1, Failures: 0, Errors: 0, Skipped: 0, Time elapsed: 77.495 sec
  129. Running org.openmrs.module.appointmentschedulingui.htmlformentry.AppointmentCheckInElementTest
  130. Tests run: 1, Failures: 0, Errors: 0, Skipped: 0, Time elapsed: 0.642 sec
  131. Running org.openmrs.module.appointmentschedulingui.htmlformentry.AppointmentCheckInSubmissionActionTest
  132. Tests run: 1, Failures: 0, Errors: 0, Skipped: 0, Time elapsed: 0.346 sec
  133. Running org.openmrs.module.appointmentschedulingui.htmlformentry.AppointmentCheckInTagComponentTest
  134. Tests run: 1, Failures: 0, Errors: 0, Skipped: 0, Time elapsed: 3.02 sec
  135. Running org.openmrs.module.appointmentschedulingui.reporting.converter.AppointmentStatusToLocalizedStatusTypeConverterTest
  136. Tests run: 1, Failures: 0, Errors: 0, Skipped: 0, Time elapsed: 1.151 sec
  137. Running org.openmrs.module.appointmentschedulingui.reporting.library.AppointmentSchedulingUIDataSetDefinitionLibraryTest
  138. Tests run: 1, Failures: 0, Errors: 0, Skipped: 0, Time elapsed: 2.722 sec
  139.  
  140. Results :
  141.  
  142. Tests run: 6, Failures: 0, Errors: 0, Skipped: 0
  143.  
  144. [INFO]
  145. [INFO] --- maven-jar-plugin:2.4:jar (default-jar) @ appointmentschedulingui-api ---
  146. [INFO] Building jar: E:\openmrs\openmrs-module-appointmentschedulingui\api\target\appointmentschedulingui-api-1.4-SNAPSHOT.jar
  147. [INFO]
  148. [INFO] --- maven-install-plugin:2.4:install (default-install) @ appointmentschedulingui-api ---
  149. [INFO] Installing E:\openmrs\openmrs-module-appointmentschedulingui\api\target\appointmentschedulingui-api-1.4-SNAPSHOT.jar to C:\Users\HossamEldeen\.m2\repository\org\openmrs\module\appointmentschedulingui-api\1.4-SNAPSHOT\appointmentschedulingui-api-1.4-SNAPSHOT.jar
  150. [INFO] Installing E:\openmrs\openmrs-module-appointmentschedulingui\api\pom.xml to C:\Users\HossamEldeen\.m2\repository\org\openmrs\module\appointmentschedulingui-api\1.4-SNAPSHOT\appointmentschedulingui-api-1.4-SNAPSHOT.pom
  151. [INFO]
  152. [INFO] ------------------------------------------------------------------------
  153. [INFO] Building Appointment Scheduling UI Module OMOD 1.4-SNAPSHOT
  154. [INFO] ------------------------------------------------------------------------
  155. [INFO]
  156. [INFO] --- maven-clean-plugin:2.5:clean (default-clean) @ appointmentschedulingui-omod ---
  157. [INFO] Deleting E:\openmrs\openmrs-module-appointmentschedulingui\omod\target
  158. [INFO]
  159. [INFO] --- maven-openmrs-plugin:1.0.1:initialize-module (init) @ appointmentschedulingui-omod ---
  160. [INFO]
  161. [INFO] --- maven-antrun-plugin:1.7:run (default) @ appointmentschedulingui-omod ---
  162. Downloading: http://mavenrepo.openmrs.org/nexus/content/repositories/public/org/apache/maven/maven-plugin-api/2.0.11/maven-plugin-api-2.0.11.pom
  163. Downloaded: http://mavenrepo.openmrs.org/nexus/content/repositories/public/org/apache/maven/maven-plugin-api/2.0.11/maven-plugin-api-2.0.11.pom (2 KB at 2.3 KB/sec)
  164. Downloading: http://mavenrepo.openmrs.org/nexus/content/repositories/public/org/apache/maven/maven/2.0.11/maven-2.0.11.pom
  165. Downloaded: http://mavenrepo.openmrs.org/nexus/content/repositories/public/org/apache/maven/maven/2.0.11/maven-2.0.11.pom (22 KB at 20.2 KB/sec)
  166. Downloading: http://mavenrepo.openmrs.org/nexus/content/repositories/public/org/apache/maven/maven-parent/12/maven-parent-12.pom
  167. Downloaded: http://mavenrepo.openmrs.org/nexus/content/repositories/public/org/apache/maven/maven-parent/12/maven-parent-12.pom (22 KB at 24.0 KB/sec)
  168. Downloading: http://mavenrepo.openmrs.org/nexus/content/repositories/public/org/apache/maven/maven-project/2.0.11/maven-project-2.0.11.pom
  169. Downloaded: http://mavenrepo.openmrs.org/nexus/content/repositories/public/org/apache/maven/maven-project/2.0.11/maven-project-2.0.11.pom (3 KB at 6.9 KB/sec)
  170. Downloading: http://mavenrepo.openmrs.org/nexus/content/repositories/public/org/apache/maven/maven-settings/2.0.11/maven-settings-2.0.11.pom
  171. Downloaded: http://mavenrepo.openmrs.org/nexus/content/repositories/public/org/apache/maven/maven-settings/2.0.11/maven-settings-2.0.11.pom (3 KB at 4.8 KB/sec)
  172. Downloading: http://mavenrepo.openmrs.org/nexus/content/repositories/public/org/apache/maven/maven-model/2.0.11/maven-model-2.0.11.pom
  173. Downloaded: http://mavenrepo.openmrs.org/nexus/content/repositories/public/org/apache/maven/maven-model/2.0.11/maven-model-2.0.11.pom (4 KB at 7.9 KB/sec)
  174. Downloading: http://mavenrepo.openmrs.org/nexus/content/repositories/public/org/apache/maven/maven-profile/2.0.11/maven-profile-2.0.11.pom
  175. Downloaded: http://mavenrepo.openmrs.org/nexus/content/repositories/public/org/apache/maven/maven-profile/2.0.11/maven-profile-2.0.11.pom (2 KB at 5.0 KB/sec)
  176. Downloading: http://mavenrepo.openmrs.org/nexus/content/repositories/public/org/apache/maven/maven-artifact-manager/2.0.11/maven-artifact-manager-2.0.11.pom
  177. Downloaded: http://mavenrepo.openmrs.org/nexus/content/repositories/public/org/apache/maven/maven-artifact-manager/2.0.11/maven-artifact-manager-2.0.11.pom (3 KB at 6.1 KB/sec)
  178. Downloading: http://mavenrepo.openmrs.org/nexus/content/repositories/public/org/apache/maven/maven-repository-metadata/2.0.11/maven-repository-metadata-2.0.11.pom
  179. Downloaded: http://mavenrepo.openmrs.org/nexus/content/repositories/public/org/apache/maven/maven-repository-metadata/2.0.11/maven-repository-metadata-2.0.11.pom (3 KB at 5.1 KB/sec)
  180. Downloading: http://mavenrepo.openmrs.org/nexus/content/repositories/public/org/apache/maven/maven-artifact/2.0.11/maven-artifact-2.0.11.pom
  181. Downloaded: http://mavenrepo.openmrs.org/nexus/content/repositories/public/org/apache/maven/maven-artifact/2.0.11/maven-artifact-2.0.11.pom (2 KB at 3.5 KB/sec)
  182. Downloading: http://mavenrepo.openmrs.org/nexus/content/repositories/public/org/apache/maven/maven-plugin-registry/2.0.11/maven-plugin-registry-2.0.11.pom
  183. Downloaded: http://mavenrepo.openmrs.org/nexus/content/repositories/public/org/apache/maven/maven-plugin-registry/2.0.11/maven-plugin-registry-2.0.11.pom (2 KB at 3.9 KB/sec)
  184. Downloading: http://mavenrepo.openmrs.org/nexus/content/repositories/public/org/apache/ant/ant/1.8.2/ant-1.8.2.pom
  185. Downloaded: http://mavenrepo.openmrs.org/nexus/content/repositories/public/org/apache/ant/ant/1.8.2/ant-1.8.2.pom (10 KB at 13.9 KB/sec)
  186. Downloading: http://mavenrepo.openmrs.org/nexus/content/repositories/public/org/apache/ant/ant-parent/1.8.2/ant-parent-1.8.2.pom
  187. Downloaded: http://mavenrepo.openmrs.org/nexus/content/repositories/public/org/apache/ant/ant-parent/1.8.2/ant-parent-1.8.2.pom (5 KB at 9.0 KB/sec)
  188. Downloading: http://mavenrepo.openmrs.org/nexus/content/repositories/public/org/apache/ant/ant-launcher/1.8.2/ant-launcher-1.8.2.pom
  189. Downloaded: http://mavenrepo.openmrs.org/nexus/content/repositories/public/org/apache/ant/ant-launcher/1.8.2/ant-launcher-1.8.2.pom (3 KB at 5.2 KB/sec)
  190. Downloading: http://mavenrepo.openmrs.org/nexus/content/repositories/public/org/apache/maven/maven-project/2.0.11/maven-project-2.0.11.jar
  191. Downloading: http://mavenrepo.openmrs.org/nexus/content/repositories/public/org/apache/maven/maven-settings/2.0.11/maven-settings-2.0.11.jar
  192. Downloading: http://mavenrepo.openmrs.org/nexus/content/repositories/public/org/apache/maven/maven-plugin-api/2.0.11/maven-plugin-api-2.0.11.jar
  193. Downloading: http://mavenrepo.openmrs.org/nexus/content/repositories/public/org/apache/maven/maven-model/2.0.11/maven-model-2.0.11.jar
  194. Downloading: http://mavenrepo.openmrs.org/nexus/content/repositories/public/org/apache/maven/maven-profile/2.0.11/maven-profile-2.0.11.jar
  195. Downloaded: http://mavenrepo.openmrs.org/nexus/content/repositories/public/org/apache/maven/maven-plugin-api/2.0.11/maven-plugin-api-2.0.11.jar (13 KB at 4.7 KB/sec)
  196. Downloading: http://mavenrepo.openmrs.org/nexus/content/repositories/public/org/apache/maven/maven-artifact-manager/2.0.11/maven-artifact-manager-2.0.11.jar
  197. Downloaded: http://mavenrepo.openmrs.org/nexus/content/repositories/public/org/apache/maven/maven-profile/2.0.11/maven-profile-2.0.11.jar (37 KB at 12.5 KB/sec)
  198. Downloading: http://mavenrepo.openmrs.org/nexus/content/repositories/public/org/apache/maven/maven-repository-metadata/2.0.11/maven-repository-metadata-2.0.11.jar
  199. Downloaded: http://mavenrepo.openmrs.org/nexus/content/repositories/public/org/apache/maven/maven-settings/2.0.11/maven-settings-2.0.11.jar (51 KB at 16.7 KB/sec)
  200. Downloading: http://mavenrepo.openmrs.org/nexus/content/repositories/public/org/apache/maven/maven-plugin-registry/2.0.11/maven-plugin-registry-2.0.11.jar
  201. Downloaded: http://mavenrepo.openmrs.org/nexus/content/repositories/public/org/apache/maven/maven-repository-metadata/2.0.11/maven-repository-metadata-2.0.11.jar (26 KB at 5.1 KB/sec)
  202. Downloading: http://mavenrepo.openmrs.org/nexus/content/repositories/public/org/apache/maven/maven-artifact/2.0.11/maven-artifact-2.0.11.jar
  203. Downloaded: http://mavenrepo.openmrs.org/nexus/content/repositories/public/org/apache/maven/maven-plugin-registry/2.0.11/maven-plugin-registry-2.0.11.jar (30 KB at 5.7 KB/sec)
  204. Downloading: http://mavenrepo.openmrs.org/nexus/content/repositories/public/org/apache/ant/ant/1.8.2/ant-1.8.2.jar
  205. Downloaded: http://mavenrepo.openmrs.org/nexus/content/repositories/public/org/apache/maven/maven-model/2.0.11/maven-model-2.0.11.jar (95 KB at 16.8 KB/sec)
  206. Downloading: http://mavenrepo.openmrs.org/nexus/content/repositories/public/org/apache/ant/ant-launcher/1.8.2/ant-launcher-1.8.2.jar
  207. Downloaded: http://mavenrepo.openmrs.org/nexus/content/repositories/public/org/apache/maven/maven-project/2.0.11/maven-project-2.0.11.jar (121 KB at 20.8 KB/sec)
  208. Downloaded: http://mavenrepo.openmrs.org/nexus/content/repositories/public/org/apache/maven/maven-artifact-manager/2.0.11/maven-artifact-manager-2.0.11.jar (58 KB at 9.5 KB/sec)
  209. Downloaded: http://mavenrepo.openmrs.org/nexus/content/repositories/public/org/apache/ant/ant-launcher/1.8.2/ant-launcher-1.8.2.jar (13 KB at 1.8 KB/sec)
  210. Downloaded: http://mavenrepo.openmrs.org/nexus/content/repositories/public/org/apache/maven/maven-artifact/2.0.11/maven-artifact-2.0.11.jar (88 KB at 11.8 KB/sec)
  211. Downloaded: http://mavenrepo.openmrs.org/nexus/content/repositories/public/org/apache/ant/ant/1.8.2/ant-1.8.2.jar (1889 KB at 42.9 KB/sec)
  212. [INFO] Executing tasks
  213.  
  214. building:
  215. [echo]
  216. [exec] npm WARN package.json mirebalais.apppointmentschedulingui@0.0.1 No README data
  217. [exec] npm WARN package.json mirebalais.apppointmentschedulingui@0.0.1 license should be a valid SPDX license expression
  218. [INFO] Executed tasks
  219. [INFO]
  220. [INFO] --- exec-maven-plugin:1.5.0:exec (default) @ appointmentschedulingui-omod ---
  221. Downloading: http://mavenrepo.openmrs.org/nexus/content/repositories/public/junit/junit/4.12/junit-4.12.pom
  222. Downloaded: http://mavenrepo.openmrs.org/nexus/content/repositories/public/junit/junit/4.12/junit-4.12.pom (24 KB at 18.4 KB/sec)
  223. Downloading: http://mavenrepo.openmrs.org/nexus/content/repositories/public/org/apache/commons/commons-exec/1.3/commons-exec-1.3.pom
  224. Downloaded: http://mavenrepo.openmrs.org/nexus/content/repositories/public/org/apache/commons/commons-exec/1.3/commons-exec-1.3.pom (11 KB at 3.0 KB/sec)
  225. Downloading: http://mavenrepo.openmrs.org/nexus/content/repositories/public/org/apache/commons/commons-parent/35/commons-parent-35.pom
  226. Downloaded: http://mavenrepo.openmrs.org/nexus/content/repositories/public/org/apache/commons/commons-parent/35/commons-parent-35.pom (57 KB at 7.9 KB/sec)
  227. Downloading: http://mavenrepo.openmrs.org/nexus/content/repositories/public/org/apache/apache/15/apache-15.pom
  228. Downloaded: http://mavenrepo.openmrs.org/nexus/content/repositories/public/org/apache/apache/15/apache-15.pom (15 KB at 5.0 KB/sec)
  229. Downloading: http://mavenrepo.openmrs.org/nexus/content/repositories/public/org/apache/maven/maven-settings/2.2.1/maven-settings-2.2.1.jar
  230. Downloading: http://mavenrepo.openmrs.org/nexus/content/repositories/public/org/apache/maven/maven-model/2.2.1/maven-model-2.2.1.jar
  231. Downloading: http://mavenrepo.openmrs.org/nexus/content/repositories/public/org/codehaus/plexus/plexus-interpolation/1.11/plexus-interpolation-1.11.jar
  232. Downloading: http://mavenrepo.openmrs.org/nexus/content/repositories/public/org/apache/maven/maven-artifact/2.2.1/maven-artifact-2.2.1.jar
  233. Downloading: http://mavenrepo.openmrs.org/nexus/content/repositories/public/org/apache/maven/maven-repository-metadata/2.2.1/maven-repository-metadata-2.2.1.jar
  234. Downloaded: http://mavenrepo.openmrs.org/nexus/content/repositories/public/org/codehaus/plexus/plexus-interpolation/1.11/plexus-interpolation-1.11.jar (50 KB at 7.5 KB/sec)
  235. Downloading: http://mavenrepo.openmrs.org/nexus/content/repositories/public/org/apache/maven/maven-core/2.2.1/maven-core-2.2.1.jar
  236. Downloaded: http://mavenrepo.openmrs.org/nexus/content/repositories/public/org/apache/maven/maven-model/2.2.1/maven-model-2.2.1.jar (86 KB at 8.9 KB/sec)
  237. Downloading: http://mavenrepo.openmrs.org/nexus/content/repositories/public/org/apache/maven/maven-plugin-parameter-documenter/2.2.1/maven-plugin-parameter-documenter-2.2.1.jar
  238. Downloaded: http://mavenrepo.openmrs.org/nexus/content/repositories/public/org/apache/maven/maven-repository-metadata/2.2.1/maven-repository-metadata-2.2.1.jar (26 KB at 2.5 KB/sec)
  239. Downloading: http://mavenrepo.openmrs.org/nexus/content/repositories/public/org/slf4j/slf4j-jdk14/1.5.6/slf4j-jdk14-1.5.6.jar
  240. Downloaded: http://mavenrepo.openmrs.org/nexus/content/repositories/public/org/apache/maven/maven-artifact/2.2.1/maven-artifact-2.2.1.jar (79 KB at 7.7 KB/sec)
  241. Downloading: http://mavenrepo.openmrs.org/nexus/content/repositories/public/org/slf4j/slf4j-api/1.5.6/slf4j-api-1.5.6.jar
  242. Downloaded: http://mavenrepo.openmrs.org/nexus/content/repositories/public/org/apache/maven/maven-settings/2.2.1/maven-settings-2.2.1.jar (48 KB at 4.5 KB/sec)
  243. Downloading: http://mavenrepo.openmrs.org/nexus/content/repositories/public/org/slf4j/jcl-over-slf4j/1.5.6/jcl-over-slf4j-1.5.6.jar
  244. Downloaded: http://mavenrepo.openmrs.org/nexus/content/repositories/public/org/slf4j/slf4j-jdk14/1.5.6/slf4j-jdk14-1.5.6.jar (9 KB at 0.8 KB/sec)
  245. Downloading: http://mavenrepo.openmrs.org/nexus/content/repositories/public/org/apache/maven/reporting/maven-reporting-api/2.2.1/maven-reporting-api-2.2.1.jar
  246. Downloaded: http://mavenrepo.openmrs.org/nexus/content/repositories/public/org/apache/maven/reporting/maven-reporting-api/2.2.1/maven-reporting-api-2.2.1.jar (10 KB at 0.8 KB/sec)
  247. Downloading: http://mavenrepo.openmrs.org/nexus/content/repositories/public/org/apache/maven/doxia/doxia-sink-api/1.1/doxia-sink-api-1.1.jar
  248. Downloaded: http://mavenrepo.openmrs.org/nexus/content/repositories/public/org/slf4j/slf4j-api/1.5.6/slf4j-api-1.5.6.jar (22 KB at 1.7 KB/sec)
  249. Downloading: http://mavenrepo.openmrs.org/nexus/content/repositories/public/org/apache/maven/doxia/doxia-logging-api/1.1/doxia-logging-api-1.1.jar
  250. Downloaded: http://mavenrepo.openmrs.org/nexus/content/repositories/public/org/slf4j/jcl-over-slf4j/1.5.6/jcl-over-slf4j-1.5.6.jar (17 KB at 1.2 KB/sec)
  251. Downloading: http://mavenrepo.openmrs.org/nexus/content/repositories/public/org/apache/maven/maven-error-diagnostics/2.2.1/maven-error-diagnostics-2.2.1.jar
  252. Downloaded: http://mavenrepo.openmrs.org/nexus/content/repositories/public/org/apache/maven/doxia/doxia-sink-api/1.1/doxia-sink-api-1.1.jar (13 KB at 0.9 KB/sec)
  253. Downloading: http://mavenrepo.openmrs.org/nexus/content/repositories/public/commons-cli/commons-cli/1.2/commons-cli-1.2.jar
  254. Downloaded: http://mavenrepo.openmrs.org/nexus/content/repositories/public/org/apache/maven/maven-plugin-parameter-documenter/2.2.1/maven-plugin-parameter-documenter-2.2.1.jar (22 KB at 1.5 KB/sec)
  255. Downloading: http://mavenrepo.openmrs.org/nexus/content/repositories/public/org/apache/maven/maven-plugin-descriptor/2.2.1/maven-plugin-descriptor-2.2.1.jar
  256. Downloaded: http://mavenrepo.openmrs.org/nexus/content/repositories/public/org/apache/maven/maven-error-diagnostics/2.2.1/maven-error-diagnostics-2.2.1.jar (13 KB at 0.8 KB/sec)
  257. Downloading: http://mavenrepo.openmrs.org/nexus/content/repositories/public/org/apache/maven/maven-monitor/2.2.1/maven-monitor-2.2.1.jar
  258. Downloaded: http://mavenrepo.openmrs.org/nexus/content/repositories/public/org/apache/maven/maven-monitor/2.2.1/maven-monitor-2.2.1.jar (11 KB at 0.6 KB/sec)
  259. Downloading: http://mavenrepo.openmrs.org/nexus/content/repositories/public/org/apache/maven/maven-plugin-api/2.2.1/maven-plugin-api-2.2.1.jar
  260. Downloaded: http://mavenrepo.openmrs.org/nexus/content/repositories/public/commons-cli/commons-cli/1.2/commons-cli-1.2.jar (41 KB at 2.2 KB/sec)
  261. Downloading: http://mavenrepo.openmrs.org/nexus/content/repositories/public/org/codehaus/plexus/plexus-utils/3.0.20/plexus-utils-3.0.20.jar
  262. Downloaded: http://mavenrepo.openmrs.org/nexus/content/repositories/public/org/apache/maven/maven-plugin-api/2.2.1/maven-plugin-api-2.2.1.jar (13 KB at 0.7 KB/sec)
  263. Downloading: http://mavenrepo.openmrs.org/nexus/content/repositories/public/org/apache/commons/commons-exec/1.3/commons-exec-1.3.jar
  264. Downloaded: http://mavenrepo.openmrs.org/nexus/content/repositories/public/org/apache/maven/doxia/doxia-logging-api/1.1/doxia-logging-api-1.1.jar (12 KB at 0.6 KB/sec)
  265. Downloaded: http://mavenrepo.openmrs.org/nexus/content/repositories/public/org/apache/maven/maven-core/2.2.1/maven-core-2.2.1.jar (174 KB at 8.0 KB/sec)
  266. Downloaded: http://mavenrepo.openmrs.org/nexus/content/repositories/public/org/apache/commons/commons-exec/1.3/commons-exec-1.3.jar (54 KB at 2.3 KB/sec)
  267. Downloaded: http://mavenrepo.openmrs.org/nexus/content/repositories/public/org/apache/maven/maven-plugin-descriptor/2.2.1/maven-plugin-descriptor-2.2.1.jar (39 KB at 1.5 KB/sec)
  268. Downloaded: http://mavenrepo.openmrs.org/nexus/content/repositories/public/org/codehaus/plexus/plexus-utils/3.0.20/plexus-utils-3.0.20.jar (238 KB at 7.4 KB/sec)
  269. [ERROR] Command execution failed.
  270. java.io.IOException: Cannot run program "C:\Users\HossamEldeen\AppData\Roaming\npm\bower" (in directory "E:\openmrs\openmrs-module-appointmentschedulingui\omod\src\main\webapp\resources\scripts"): CreateProcess error=193, %1 is not a valid Win32 application
  271. at java.lang.ProcessBuilder.start(ProcessBuilder.java:1048)
  272. at java.lang.Runtime.exec(Runtime.java:620)
  273. at org.apache.commons.exec.launcher.Java13CommandLauncher.exec(Java13CommandLauncher.java:61)
  274. at org.apache.commons.exec.DefaultExecutor.launch(DefaultExecutor.java:279)
  275. at org.apache.commons.exec.DefaultExecutor.executeInternal(DefaultExecutor.java:336)
  276. at org.apache.commons.exec.DefaultExecutor.execute(DefaultExecutor.java:166)
  277. at org.codehaus.mojo.exec.ExecMojo.executeCommandLine(ExecMojo.java:764)
  278. at org.codehaus.mojo.exec.ExecMojo.executeCommandLine(ExecMojo.java:711)
  279. at org.codehaus.mojo.exec.ExecMojo.execute(ExecMojo.java:289)
  280. at org.apache.maven.plugin.DefaultBuildPluginManager.executeMojo(DefaultBuildPluginManager.java:134)
  281. at org.apache.maven.lifecycle.internal.MojoExecutor.execute(MojoExecutor.java:207)
  282. at org.apache.maven.lifecycle.internal.MojoExecutor.execute(MojoExecutor.java:153)
  283. at org.apache.maven.lifecycle.internal.MojoExecutor.execute(MojoExecutor.java:145)
  284. at org.apache.maven.lifecycle.internal.LifecycleModuleBuilder.buildProject(LifecycleModuleBuilder.java:116)
  285. at org.apache.maven.lifecycle.internal.LifecycleModuleBuilder.buildProject(LifecycleModuleBuilder.java:80)
  286. at org.apache.maven.lifecycle.internal.builder.singlethreaded.SingleThreadedBuilder.build(SingleThreadedBuilder.java:51)
  287. at org.apache.maven.lifecycle.internal.LifecycleStarter.execute(LifecycleStarter.java:128)
  288. at org.apache.maven.DefaultMaven.doExecute(DefaultMaven.java:307)
  289. at org.apache.maven.DefaultMaven.doExecute(DefaultMaven.java:193)
  290. at org.apache.maven.DefaultMaven.execute(DefaultMaven.java:106)
  291. at org.apache.maven.cli.MavenCli.execute(MavenCli.java:863)
  292. at org.apache.maven.cli.MavenCli.doMain(MavenCli.java:288)
  293. at org.apache.maven.cli.MavenCli.main(MavenCli.java:199)
  294. at sun.reflect.NativeMethodAccessorImpl.invoke0(Native Method)
  295. at sun.reflect.NativeMethodAccessorImpl.invoke(NativeMethodAccessorImpl.java:62)
  296. at sun.reflect.DelegatingMethodAccessorImpl.invoke(DelegatingMethodAccessorImpl.java:43)
  297. at java.lang.reflect.Method.invoke(Method.java:498)
  298. at org.codehaus.plexus.classworlds.launcher.Launcher.launchEnhanced(Launcher.java:289)
  299. at org.codehaus.plexus.classworlds.launcher.Launcher.launch(Launcher.java:229)
  300. at org.codehaus.plexus.classworlds.launcher.Launcher.mainWithExitCode(Launcher.java:415)
  301. at org.codehaus.plexus.classworlds.launcher.Launcher.main(Launcher.java:356)
  302. Caused by: java.io.IOException: CreateProcess error=193, %1 is not a valid Win32 application
  303. at java.lang.ProcessImpl.create(Native Method)
  304. at java.lang.ProcessImpl.<init>(ProcessImpl.java:386)
  305. at java.lang.ProcessImpl.start(ProcessImpl.java:137)
  306. at java.lang.ProcessBuilder.start(ProcessBuilder.java:1029)
  307. ... 30 more
  308. [INFO] ------------------------------------------------------------------------
  309. [INFO] Reactor Summary:
  310. [INFO]
  311. [INFO] Appointment Scheduling UI Module ................... SUCCESS [ 13.976 s]
  312. [INFO] Appointment Scheduling UI Module API ............... SUCCESS [02:23 min]
  313. [INFO] Appointment Scheduling UI Module OMOD .............. FAILURE [02:20 min]
  314. [INFO] ------------------------------------------------------------------------
  315. [INFO] BUILD FAILURE
  316. [INFO] ------------------------------------------------------------------------
  317. [INFO] Total time: 05:03 min
  318. [INFO] Finished at: 2016-07-06T13:43:50+02:00
  319. [INFO] Final Memory: 41M/981M
  320. [INFO] ------------------------------------------------------------------------
  321. [ERROR] Failed to execute goal org.codehaus.mojo:exec-maven-plugin:1.5.0:exec (default) on project appointmentschedulingui-omod: Command execution failed. Cannot run program "C:\Users\HossamEldeen\AppData\Roaming\npm\bower" (in directory "E:\openmrs\openmrs-module-appointmentschedulingui\omod\src\main\webapp\resources\scripts"): CreateProcess error=193, %1 is not a valid Win32 application -> [Help 1]
  322. [ERROR]
  323. [ERROR] To see the full stack trace of the errors, re-run Maven with the -e switch.
  324. [ERROR] Re-run Maven using the -X switch to enable full debug logging.
  325. [ERROR]
  326. [ERROR] For more information about the errors and possible solutions, please read the following articles:
  327. [ERROR] [Help 1] http://cwiki.apache.org/confluence/display/MAVEN/MojoExecutionException
  328. [ERROR]
  329. [ERROR] After correcting the problems, you can resume the build with the command
  330. [ERROR] mvn <goals> -rf :appointmentschedulingui-omod
Advertisement
RAW Paste Data Copied
Advertisement