Advertisement
Guest User

ld64-136 failure to build, March 13

a guest
Mar 13th, 2016
81
0
Never
Not a member of Pastebin yet? Sign Up, it unlocks many cool features!
text 42.71 KB | None | 0 0
  1. version:1
  2. :debug:main Attempting ln -sf /opt/local/var/macports/build/_opt_local_var_macports_sources_rsync.macports.org_release_tarballs_ports_devel_ld64/ld64-136/work /opt/local/var/macports/sources/rsync.macports.org/release/tarballs/ports/devel/ld64/work
  3. :debug:main changing euid/egid - current euid: 0 - current egid: 0
  4. :debug:main egid changed to: 501
  5. :debug:main euid changed to: 502
  6. :debug:main Executing org.macports.main (ld64-136)
  7. :debug:main Privilege de-escalation not attempted as not running as root.
  8. :debug:archivefetch archivefetch phase started at Sun Mar 13 20:40:04 EDT 2016
  9. :debug:archivefetch Executing org.macports.archivefetch (ld64-136)
  10. :debug:archivefetch Privilege de-escalation not attempted as not running as root.
  11. :debug:fetch fetch phase started at Sun Mar 13 20:40:04 EDT 2016
  12. :notice:fetch ---> Fetching distfiles for ld64-136
  13. :debug:fetch Executing proc-pre-org.macports.fetch-fetch-0
  14. :debug:fetch Executing org.macports.fetch (ld64-136)
  15. :debug:fetch Privilege de-escalation not attempted as not running as root.
  16. :debug:checksum checksum phase started at Sun Mar 13 20:40:04 EDT 2016
  17. :notice:checksum ---> Verifying checksums for ld64-136
  18. :debug:checksum Executing org.macports.checksum (ld64-136)
  19. :info:checksum ---> Checksumming dyld-360.18.tar.gz
  20. :debug:checksum Calculated (rmd160) is aeb3144549ec276b028b979680f5056da4d63747
  21. :debug:checksum Correct (rmd160) checksum for dyld-360.18.tar.gz
  22. :debug:checksum Calculated (sha256) is a5bec8c2e3bded111aec7e447b35c110038e822f95e11e55b9a4d331fbaeff08
  23. :debug:checksum Correct (sha256) checksum for dyld-360.18.tar.gz
  24. :info:checksum ---> Checksumming ld64-136.tar.gz
  25. :debug:checksum Calculated (rmd160) is 4a2930ccdd398b63a108810e90293ab96dc154a0
  26. :debug:checksum Correct (rmd160) checksum for ld64-136.tar.gz
  27. :debug:checksum Calculated (sha256) is 99d6c4acb6d4cdf45772951dd2308222aa966763170137459a9d276674645d9e
  28. :debug:checksum Correct (sha256) checksum for ld64-136.tar.gz
  29. :debug:checksum Privilege de-escalation not attempted as not running as root.
  30. :debug:extract extract phase started at Sun Mar 13 20:40:04 EDT 2016
  31. :notice:extract ---> Extracting ld64-136
  32. :debug:extract Executing org.macports.extract (ld64-136)
  33. :info:extract ---> Extracting dyld-360.18.tar.gz
  34. :debug:extract setting option extract.args to '/opt/local/var/macports/distfiles/ld64/dyld-360.18.tar.gz'
  35. :debug:extract Environment:
  36. CC_PRINT_OPTIONS='YES'
  37. CC_PRINT_OPTIONS_FILE='/opt/local/var/macports/build/_opt_local_var_macports_sources_rsync.macports.org_release_tarballs_ports_devel_ld64/ld64-136/work/.CC_PRINT_OPTIONS'
  38. CPATH='/opt/local/include'
  39. LIBRARY_PATH='/opt/local/lib'
  40. MACOSX_DEPLOYMENT_TARGET='10.6'
  41. :debug:extract Assembled command: 'cd "/opt/local/var/macports/build/_opt_local_var_macports_sources_rsync.macports.org_release_tarballs_ports_devel_ld64/ld64-136/work" && /usr/bin/gzip -dc '/opt/local/var/macports/distfiles/ld64/dyld-360.18.tar.gz' | /usr/bin/gnutar --no-same-owner -xf -'
  42. :debug:extract Executing command line: cd "/opt/local/var/macports/build/_opt_local_var_macports_sources_rsync.macports.org_release_tarballs_ports_devel_ld64/ld64-136/work" && /usr/bin/gzip -dc '/opt/local/var/macports/distfiles/ld64/dyld-360.18.tar.gz' | /usr/bin/gnutar --no-same-owner -xf -
  43. :debug:extract euid/egid changed to: 0/0
  44. :debug:extract chowned /opt/local/var/macports/build/_opt_local_var_macports_sources_rsync.macports.org_release_tarballs_ports_devel_ld64/ld64-136/work to macports
  45. :debug:extract euid/egid changed to: 502/501
  46. :info:extract ---> Extracting ld64-136.tar.gz
  47. :debug:extract setting option extract.args to '/opt/local/var/macports/distfiles/ld64/ld64-136.tar.gz'
  48. :debug:extract Environment:
  49. CC_PRINT_OPTIONS='YES'
  50. CC_PRINT_OPTIONS_FILE='/opt/local/var/macports/build/_opt_local_var_macports_sources_rsync.macports.org_release_tarballs_ports_devel_ld64/ld64-136/work/.CC_PRINT_OPTIONS'
  51. CPATH='/opt/local/include'
  52. LIBRARY_PATH='/opt/local/lib'
  53. MACOSX_DEPLOYMENT_TARGET='10.6'
  54. :debug:extract Assembled command: 'cd "/opt/local/var/macports/build/_opt_local_var_macports_sources_rsync.macports.org_release_tarballs_ports_devel_ld64/ld64-136/work" && /usr/bin/gzip -dc '/opt/local/var/macports/distfiles/ld64/ld64-136.tar.gz' | /usr/bin/gnutar --no-same-owner -xf -'
  55. :debug:extract Executing command line: cd "/opt/local/var/macports/build/_opt_local_var_macports_sources_rsync.macports.org_release_tarballs_ports_devel_ld64/ld64-136/work" && /usr/bin/gzip -dc '/opt/local/var/macports/distfiles/ld64/ld64-136.tar.gz' | /usr/bin/gnutar --no-same-owner -xf -
  56. :debug:extract euid/egid changed to: 0/0
  57. :debug:extract chowned /opt/local/var/macports/build/_opt_local_var_macports_sources_rsync.macports.org_release_tarballs_ports_devel_ld64/ld64-136/work to macports
  58. :debug:extract euid/egid changed to: 502/501
  59. :debug:extract Executing proc-post-org.macports.extract-extract-0
  60. :debug:extract Privilege de-escalation not attempted as not running as root.
  61. :debug:patch patch phase started at Sun Mar 13 20:40:06 EDT 2016
  62. :debug:patch Executing org.macports.patch (ld64-136)
  63. :notice:patch ---> Applying patches to ld64-136
  64. :info:patch ---> Applying ld64-version.patch
  65. :debug:patch Environment:
  66. CC_PRINT_OPTIONS='YES'
  67. CC_PRINT_OPTIONS_FILE='/opt/local/var/macports/build/_opt_local_var_macports_sources_rsync.macports.org_release_tarballs_ports_devel_ld64/ld64-136/work/.CC_PRINT_OPTIONS'
  68. CPATH='/opt/local/include'
  69. LIBRARY_PATH='/opt/local/lib'
  70. MACOSX_DEPLOYMENT_TARGET='10.6'
  71. :debug:patch Assembled command: 'cd "/opt/local/var/macports/build/_opt_local_var_macports_sources_rsync.macports.org_release_tarballs_ports_devel_ld64/ld64-136/work/ld64-136" && /usr/bin/patch -p0'
  72. :debug:patch Executing command line: cd "/opt/local/var/macports/build/_opt_local_var_macports_sources_rsync.macports.org_release_tarballs_ports_devel_ld64/ld64-136/work/ld64-136" && /usr/bin/patch -p0 < '/opt/local/var/macports/sources/rsync.macports.org/release/tarballs/ports/devel/ld64/files/ld64-version.patch'
  73. :info:patch patching file src/ld/Options.cpp
  74. :info:patch Hunk #1 succeeded at 92 with fuzz 2 (offset 60 lines).
  75. :info:patch Hunk #2 succeeded at 2891 with fuzz 2 (offset 736 lines).
  76. :info:patch ---> Applying ld64-133-no-CrashReporterClient.h.patch
  77. :debug:patch Environment:
  78. CC_PRINT_OPTIONS='YES'
  79. CC_PRINT_OPTIONS_FILE='/opt/local/var/macports/build/_opt_local_var_macports_sources_rsync.macports.org_release_tarballs_ports_devel_ld64/ld64-136/work/.CC_PRINT_OPTIONS'
  80. CPATH='/opt/local/include'
  81. LIBRARY_PATH='/opt/local/lib'
  82. MACOSX_DEPLOYMENT_TARGET='10.6'
  83. :debug:patch Assembled command: 'cd "/opt/local/var/macports/build/_opt_local_var_macports_sources_rsync.macports.org_release_tarballs_ports_devel_ld64/ld64-136/work/ld64-136" && /usr/bin/patch -p0'
  84. :debug:patch Executing command line: cd "/opt/local/var/macports/build/_opt_local_var_macports_sources_rsync.macports.org_release_tarballs_ports_devel_ld64/ld64-136/work/ld64-136" && /usr/bin/patch -p0 < '/opt/local/var/macports/sources/rsync.macports.org/release/tarballs/ports/devel/ld64/files/ld64-133-no-CrashReporterClient.h.patch'
  85. :info:patch patching file src/ld/Options.cpp
  86. :info:patch Hunk #2 succeeded at 4257 (offset 10 lines).
  87. :info:patch ---> Applying ld64-134-missing-include.patch
  88. :debug:patch Environment:
  89. CC_PRINT_OPTIONS='YES'
  90. CC_PRINT_OPTIONS_FILE='/opt/local/var/macports/build/_opt_local_var_macports_sources_rsync.macports.org_release_tarballs_ports_devel_ld64/ld64-136/work/.CC_PRINT_OPTIONS'
  91. CPATH='/opt/local/include'
  92. LIBRARY_PATH='/opt/local/lib'
  93. MACOSX_DEPLOYMENT_TARGET='10.6'
  94. :debug:patch Assembled command: 'cd "/opt/local/var/macports/build/_opt_local_var_macports_sources_rsync.macports.org_release_tarballs_ports_devel_ld64/ld64-136/work/ld64-136" && /usr/bin/patch -p0'
  95. :debug:patch Executing command line: cd "/opt/local/var/macports/build/_opt_local_var_macports_sources_rsync.macports.org_release_tarballs_ports_devel_ld64/ld64-136/work/ld64-136" && /usr/bin/patch -p0 < '/opt/local/var/macports/sources/rsync.macports.org/release/tarballs/ports/devel/ld64/files/ld64-134-missing-include.patch'
  96. :info:patch patching file src/ld/parsers/lto_file.cpp
  97. :info:patch Hunk #1 succeeded at 36 with fuzz 2 (offset 1 line).
  98. :info:patch patching file src/other/rebase.cpp
  99. :info:patch ---> Applying ld64-136-i386-badAddress.patch
  100. :debug:patch Environment:
  101. CC_PRINT_OPTIONS='YES'
  102. CC_PRINT_OPTIONS_FILE='/opt/local/var/macports/build/_opt_local_var_macports_sources_rsync.macports.org_release_tarballs_ports_devel_ld64/ld64-136/work/.CC_PRINT_OPTIONS'
  103. CPATH='/opt/local/include'
  104. LIBRARY_PATH='/opt/local/lib'
  105. MACOSX_DEPLOYMENT_TARGET='10.6'
  106. :debug:patch Assembled command: 'cd "/opt/local/var/macports/build/_opt_local_var_macports_sources_rsync.macports.org_release_tarballs_ports_devel_ld64/ld64-136/work/ld64-136" && /usr/bin/patch -p0'
  107. :debug:patch Executing command line: cd "/opt/local/var/macports/build/_opt_local_var_macports_sources_rsync.macports.org_release_tarballs_ports_devel_ld64/ld64-136/work/ld64-136" && /usr/bin/patch -p0 < '/opt/local/var/macports/sources/rsync.macports.org/release/tarballs/ports/devel/ld64/files/ld64-136-i386-badAddress.patch'
  108. :info:patch patching file src/ld/LinkEdit.hpp
  109. :info:patch ---> Applying PR-13282463.patch
  110. :debug:patch Environment:
  111. CC_PRINT_OPTIONS='YES'
  112. CC_PRINT_OPTIONS_FILE='/opt/local/var/macports/build/_opt_local_var_macports_sources_rsync.macports.org_release_tarballs_ports_devel_ld64/ld64-136/work/.CC_PRINT_OPTIONS'
  113. CPATH='/opt/local/include'
  114. LIBRARY_PATH='/opt/local/lib'
  115. MACOSX_DEPLOYMENT_TARGET='10.6'
  116. :debug:patch Assembled command: 'cd "/opt/local/var/macports/build/_opt_local_var_macports_sources_rsync.macports.org_release_tarballs_ports_devel_ld64/ld64-136/work/ld64-136" && /usr/bin/patch -p0'
  117. :debug:patch Executing command line: cd "/opt/local/var/macports/build/_opt_local_var_macports_sources_rsync.macports.org_release_tarballs_ports_devel_ld64/ld64-136/work/ld64-136" && /usr/bin/patch -p0 < '/opt/local/var/macports/sources/rsync.macports.org/release/tarballs/ports/devel/ld64/files/PR-13282463.patch'
  118. :info:patch patching file src/ld/OutputFile.cpp
  119. :info:patch Hunk #1 succeeded at 3013 (offset 29 lines).
  120. :info:patch patching file src/ld/parsers/macho_relocatable_file.cpp
  121. :info:patch Hunk #1 succeeded at 2537 (offset -8 lines).
  122. :info:patch ---> Applying ld64-ppc-9610466.patch
  123. :debug:patch Environment:
  124. CC_PRINT_OPTIONS='YES'
  125. CC_PRINT_OPTIONS_FILE='/opt/local/var/macports/build/_opt_local_var_macports_sources_rsync.macports.org_release_tarballs_ports_devel_ld64/ld64-136/work/.CC_PRINT_OPTIONS'
  126. CPATH='/opt/local/include'
  127. LIBRARY_PATH='/opt/local/lib'
  128. MACOSX_DEPLOYMENT_TARGET='10.6'
  129. :debug:patch Assembled command: 'cd "/opt/local/var/macports/build/_opt_local_var_macports_sources_rsync.macports.org_release_tarballs_ports_devel_ld64/ld64-136/work/ld64-136" && /usr/bin/patch -p0'
  130. :debug:patch Executing command line: cd "/opt/local/var/macports/build/_opt_local_var_macports_sources_rsync.macports.org_release_tarballs_ports_devel_ld64/ld64-136/work/ld64-136" && /usr/bin/patch -p0 < '/opt/local/var/macports/sources/rsync.macports.org/release/tarballs/ports/devel/ld64/files/ld64-ppc-9610466.patch'
  131. :info:patch patching file src/ld/OutputFile.cpp
  132. :info:patch Hunk #1 succeeded at 873 (offset 248 lines).
  133. :debug:patch Executing proc-post-org.macports.patch-patch-0
  134. :info:patch ---> Patching Options.cpp: s|@@VERSION@@|136|g
  135. :debug:patch Executing reinplace: /usr/bin/sed s|@@VERSION@@|136|g < /opt/local/var/macports/build/_opt_local_var_macports_sources_rsync.macports.org_release_tarballs_ports_devel_ld64/ld64-136/work/ld64-136/src/ld/Options.cpp >@ file11 2>@stderr
  136. :debug:patch euid/egid changed to: 0/0
  137. :debug:patch chowned /opt/local/var/macports/build/_opt_local_var_macports_sources_rsync.macports.org_release_tarballs_ports_devel_ld64/ld64-136/work/ld64-136/src/ld/Options.cpp to macports
  138. :debug:patch euid/egid changed to: 502/501
  139. :debug:patch euid/egid changed to: 0/0
  140. :debug:patch setting attributes on /opt/local/var/macports/build/_opt_local_var_macports_sources_rsync.macports.org_release_tarballs_ports_devel_ld64/ld64-136/work/ld64-136/src/ld/Options.cpp
  141. :debug:patch euid/egid changed to: 502/501
  142. :debug:patch Privilege de-escalation not attempted as not running as root.
  143. :debug:configure configure phase started at Sun Mar 13 20:40:07 EDT 2016
  144. :notice:configure ---> Configuring ld64-136
  145. :debug:configure Using compiler 'Xcode GCC 4.2'
  146. :debug:configure Executing org.macports.configure (ld64-136)
  147. :info:configure DERIVED_SOURCES_DIR=src/ld DERIVED_FILE_DIR=src/ld src/create_configure > src/ld/configure.h
  148. :debug:configure Privilege de-escalation not attempted as not running as root.
  149. :debug:build build phase started at Sun Mar 13 20:40:07 EDT 2016
  150. :notice:build ---> Building ld64-136
  151. :debug:build Executing proc-pre-org.macports.build-build-0
  152. :debug:build Executing org.macports.build (ld64-136)
  153. :debug:build Environment:
  154. CC_PRINT_OPTIONS='YES'
  155. CC_PRINT_OPTIONS_FILE='/opt/local/var/macports/build/_opt_local_var_macports_sources_rsync.macports.org_release_tarballs_ports_devel_ld64/ld64-136/work/.CC_PRINT_OPTIONS'
  156. CPATH='/opt/local/include'
  157. LIBRARY_PATH='/opt/local/lib'
  158. MACOSX_DEPLOYMENT_TARGET='10.6'
  159. :debug:build Assembled command: 'cd "/opt/local/var/macports/build/_opt_local_var_macports_sources_rsync.macports.org_release_tarballs_ports_devel_ld64/ld64-136/work/ld64-136" && /usr/bin/make -j4 -w all CC="/usr/bin/gcc-4.2" CXX="/usr/bin/g++-4.2" OTHER_CPPFLAGS="-I/opt/local/include -I/opt/local/var/macports/build/_opt_local_var_macports_sources_rsync.macports.org_release_tarballs_ports_devel_ld64/ld64-136/work/dyld-360.18/include" OTHER_CFLAGS="-Os -arch x86_64" OTHER_CXXFLAGS="-Os -arch x86_64" OTHER_LDFLAGS="-L/opt/local/lib -Wl,-headerpad_max_install_names -arch x86_64" LLVM_CONFIG=/opt/local/bin/llvm-config-mp-3.4'
  160. :debug:build Executing command line: cd "/opt/local/var/macports/build/_opt_local_var_macports_sources_rsync.macports.org_release_tarballs_ports_devel_ld64/ld64-136/work/ld64-136" && /usr/bin/make -j4 -w all CC="/usr/bin/gcc-4.2" CXX="/usr/bin/g++-4.2" OTHER_CPPFLAGS="-I/opt/local/include -I/opt/local/var/macports/build/_opt_local_var_macports_sources_rsync.macports.org_release_tarballs_ports_devel_ld64/ld64-136/work/dyld-360.18/include" OTHER_CFLAGS="-Os -arch x86_64" OTHER_CXXFLAGS="-Os -arch x86_64" OTHER_LDFLAGS="-L/opt/local/lib -Wl,-headerpad_max_install_names -arch x86_64" LLVM_CONFIG=/opt/local/bin/llvm-config-mp-3.4
  161. :info:build make: Entering directory `/opt/local/var/macports/build/_opt_local_var_macports_sources_rsync.macports.org_release_tarballs_ports_devel_ld64/ld64-136/work/ld64-136'
  162. :info:build /usr/bin/g++-4.2 -Os -Os -arch x86_64 -I/opt/local/libexec/llvm-3.4/include -DLTO_SUPPORT -Isrc/abstraction -Isrc/ld -Isrc/ld/parsers -I/opt/local/include -I/opt/local/var/macports/build/_opt_local_var_macports_sources_rsync.macports.org_release_tarballs_ports_devel_ld64/ld64-136/work/dyld-360.18/include -c -o src/other/ObjectDump.o src/other/ObjectDump.cpp
  163. :info:build /usr/bin/gcc-4.2 -Os -Os -arch x86_64 -I/opt/local/libexec/llvm-3.4/include -DLTO_SUPPORT -Isrc/abstraction -Isrc/ld -Isrc/ld/parsers -I/opt/local/include -I/opt/local/var/macports/build/_opt_local_var_macports_sources_rsync.macports.org_release_tarballs_ports_devel_ld64/ld64-136/work/dyld-360.18/include -c -o src/ld/debugline.o src/ld/debugline.c
  164. :info:build /usr/bin/g++-4.2 -Os -Os -arch x86_64 -I/opt/local/libexec/llvm-3.4/include -DLTO_SUPPORT -Isrc/abstraction -Isrc/ld -Isrc/ld/parsers -I/opt/local/include -I/opt/local/var/macports/build/_opt_local_var_macports_sources_rsync.macports.org_release_tarballs_ports_devel_ld64/ld64-136/work/dyld-360.18/include -c -o src/ld/parsers/macho_relocatable_file.o src/ld/parsers/macho_relocatable_file.cpp
  165. :info:build /usr/bin/g++-4.2 -Os -Os -arch x86_64 -I/opt/local/libexec/llvm-3.4/include -DLTO_SUPPORT -Isrc/abstraction -Isrc/ld -Isrc/ld/parsers -I/opt/local/include -I/opt/local/var/macports/build/_opt_local_var_macports_sources_rsync.macports.org_release_tarballs_ports_devel_ld64/ld64-136/work/dyld-360.18/include -c -o src/ld/parsers/lto_file.o src/ld/parsers/lto_file.cpp
  166. :info:build /usr/bin/g++-4.2 -Os -Os -arch x86_64 -I/opt/local/libexec/llvm-3.4/include -DLTO_SUPPORT -Isrc/abstraction -Isrc/ld -Isrc/ld/parsers -I/opt/local/include -I/opt/local/var/macports/build/_opt_local_var_macports_sources_rsync.macports.org_release_tarballs_ports_devel_ld64/ld64-136/work/dyld-360.18/include -c -o src/other/dyldinfo.o src/other/dyldinfo.cpp
  167. :info:build src/ld/parsers/lto_file.cpp:36:25: error: unordered_set: No such file or directory
  168. :info:build src/ld/parsers/lto_file.cpp:37:25: error: unordered_map: No such file or directory
  169. :info:build src/other/dyldinfo.cpp:36:25: error: unordered_set: No such file or directory
  170. :info:build In file included from src/ld/parsers/macho_relocatable_file.h:29,
  171. :info:build from src/other/ObjectDump.cpp:35:
  172. :info:build src/ld/Options.h:33:25: error: unordered_set: No such file or directory
  173. :info:build src/ld/Options.h:34:25: error: unordered_map: No such file or directory
  174. :info:build In file included from src/ld/parsers/macho_relocatable_file.h:29,
  175. :info:build from src/ld/parsers/macho_relocatable_file.cpp:51:
  176. :info:build src/ld/Options.h:33:25: error: unordered_set: No such file or directory
  177. :info:build src/ld/Options.h:34:25: error: unordered_map: No such file or directory
  178. :info:build In file included from src/ld/parsers/macho_relocatable_file.h:29,
  179. :info:build from src/other/ObjectDump.cpp:35:
  180. :info:build src/ld/Options.h:345: error: ISO C++ forbids declaration of ‘unordered_map’ with no type
  181. :info:build src/ld/Options.h:345: error: typedef name may not be a nested-name-specifier
  182. :info:build src/ld/Options.h:345: error: expected ‘;’ before ‘<’ token
  183. :info:build src/ld/Options.h:346: error: ISO C++ forbids declaration of ‘unordered_set’ with no type
  184. :info:build src/ld/Options.h:346: error: typedef name may not be a nested-name-specifier
  185. :info:build src/ld/Options.h:346: error: expected ‘;’ before ‘<’ token
  186. :info:build src/ld/Options.h:358: error: ‘NameSet’ has not been declared
  187. :info:build src/ld/Options.h:358: error: ISO C++ forbids declaration of ‘iterator’ with no type
  188. :info:build src/ld/Options.h:358: error: expected ‘;’ before ‘regularBegin’
  189. :info:build src/ld/Options.h:359: error: expected `;' before ‘NameSet’
  190. :info:build src/ld/Options.h:359: error: ‘NameSet’ has not been declared
  191. :info:build src/ld/Options.h:359: error: ISO C++ forbids declaration of ‘iterator’ with no type
  192. :info:build src/ld/Options.h:359: error: expected ‘;’ before ‘regularEnd’
  193. :info:build src/ld/Options.h:360: error: expected `;' before ‘void’
  194. :info:build src/ld/Options.h:360: error: expected ‘,’ or ‘...’ before ‘&’ token
  195. :info:build src/ld/Options.h:360: error: ISO C++ forbids declaration of ‘NameSet’ with no type
  196. :info:build src/ld/Options.h:366: error: ‘NameSet’ does not name a type
  197. :info:build src/ld/Options.h:406: error: ‘NameToOrder’ has not been declared
  198. :info:build src/ld/Options.h:444: error: ‘NameSet’ does not name a type
  199. :info:build src/ld/Options.h:445: error: ‘NameToOrder’ does not name a type
  200. :info:build src/ld/Options.h:571: error: ‘NameSet’ does not name a type
  201. :info:build src/ld/Options.h:572: error: ‘NameSet’ does not name a type
  202. :info:build In file included from src/ld/parsers/macho_relocatable_file.h:29,
  203. :info:build from src/ld/parsers/lto_file.cpp:44:
  204. :info:build src/ld/Options.h:345: error: ISO C++ forbids declaration of ‘unordered_map’ with no type
  205. :info:build src/ld/Options.h:345: error: typedef name may not be a nested-name-specifier
  206. :info:build src/ld/Options.h:345: error: expected ‘;’ before ‘<’ token
  207. :info:build src/ld/Options.h:346: error: ISO C++ forbids declaration of ‘unordered_set’ with no type
  208. :info:build src/ld/Options.h:346: error: typedef name may not be a nested-name-specifier
  209. :info:build src/ld/Options.h:346: error: expected ‘;’ before ‘<’ token
  210. :info:build src/ld/Options.h:358: error: ‘NameSet’ has not been declared
  211. :info:build src/ld/Options.h:358: error: ISO C++ forbids declaration of ‘iterator’ with no type
  212. :info:build src/ld/Options.h:358: error: expected ‘;’ before ‘regularBegin’
  213. :info:build src/ld/Options.h:359: error: expected `;' before ‘NameSet’
  214. :info:build src/ld/Options.h:359: error: ‘NameSet’ has not been declared
  215. :info:build src/ld/Options.h:359: error: ISO C++ forbids declaration of ‘iterator’ with no type
  216. :info:build src/ld/Options.h:359: error: expected ‘;’ before ‘regularEnd’
  217. :info:build src/ld/Options.h:360: error: expected `;' before ‘void’
  218. :info:build src/ld/Options.h:360: error: expected ‘,’ or ‘...’ before ‘&’ token
  219. :info:build src/ld/Options.h:360: error: ISO C++ forbids declaration of ‘NameSet’ with no type
  220. :info:build src/ld/Options.h:366: error: ‘NameSet’ does not name a type
  221. :info:build src/ld/Options.h: In member function ‘bool Options::wasRemovedExport(const char*) const’:
  222. :info:build src/ld/Options.h:206: error: ‘fRemovedExports’ was not declared in this scope
  223. :info:build src/ld/Options.h: In member function ‘bool Options::allowedUndefined(const char*) const’:
  224. :info:build src/ld/Options.h:274: error: ‘fAllowedUndefined’ was not declared in this scope
  225. :info:build src/ld/Options.h: In member function ‘bool Options::someAllowedUndefines() const’:
  226. :info:build src/ld/Options.h:275: error: ‘fAllowedUndefined’ was not declared in this scope
  227. :info:build src/ld/Options.h: In member function ‘bool Options::SetWithWildcards::empty() const’:
  228. :info:build src/ld/Options.h:356: error: ‘fRegular’ was not declared in this scope
  229. :info:build src/ld/Options.h:406: error: ‘NameToOrder’ has not been declared
  230. :info:build src/ld/Options.h:444: error: ‘NameSet’ does not name a type
  231. :info:build src/ld/Options.h:445: error: ‘NameToOrder’ does not name a type
  232. :info:build src/ld/Options.h:571: error: ‘NameSet’ does not name a type
  233. :info:build src/ld/Options.h:572: error: ‘NameSet’ does not name a type
  234. :info:build src/other/ObjectDump.cpp: In member function ‘void dumper::dump()’:
  235. :info:build src/other/ObjectDump.cpp:930: error: ‘sort’ is not a member of ‘std’
  236. :info:build src/ld/Options.h: In member function ‘bool Options::wasRemovedExport(const char*) const’:
  237. :info:build src/ld/Options.h:206: error: ‘fRemovedExports’ was not declared in this scope
  238. :info:build src/ld/Options.h: In member function ‘bool Options::allowedUndefined(const char*) const’:
  239. :info:build src/ld/Options.h:274: error: ‘fAllowedUndefined’ was not declared in this scope
  240. :info:build src/ld/Options.h: In member function ‘bool Options::someAllowedUndefines() const’:
  241. :info:build src/ld/Options.h:275: error: ‘fAllowedUndefined’ was not declared in this scope
  242. :info:build src/ld/Options.h: In member function ‘bool Options::SetWithWildcards::empty() const’:
  243. :info:build src/ld/Options.h:356: error: ‘fRegular’ was not declared in this scope
  244. :info:build src/ld/parsers/lto_file.cpp: At global scope:
  245. :info:build src/ld/parsers/lto_file.cpp:217: error: ISO C++ forbids declaration of ‘unordered_set’ with no type
  246. :info:build src/ld/parsers/lto_file.cpp:217: error: typedef name may not be a nested-name-specifier
  247. :info:build src/ld/parsers/lto_file.cpp:217: error: expected ‘;’ before ‘<’ token
  248. :info:build src/ld/parsers/lto_file.cpp:218: error: ISO C++ forbids declaration of ‘unordered_map’ with no type
  249. :info:build src/ld/parsers/lto_file.cpp:218: error: typedef name may not be a nested-name-specifier
  250. :info:build src/ld/parsers/lto_file.cpp:218: error: expected ‘;’ before ‘<’ token
  251. :info:build src/ld/parsers/lto_file.cpp:223: error: ‘CStringToAtom’ has not been declared
  252. :info:build src/ld/parsers/lto_file.cpp:223: error: ‘CStringToAtom’ has not been declared
  253. :info:build src/ld/parsers/lto_file.cpp:231: error: ‘CStringToAtom’ does not name a type
  254. :info:build src/ld/parsers/lto_file.cpp:232: error: ‘CStringToAtom’ does not name a type
  255. :info:build src/ld/parsers/lto_file.cpp: In constructor ‘lto::Parser::AtomSyncer::AtomSyncer(std::vector<const char*, std::allocator<const char*> >&, std::vector<const ld::Atom*, std::allocator<const ld::Atom*> >&, int, int, const lto::OptimizeOptions&)’:
  256. :info:build src/ld/parsers/lto_file.cpp:224: error: class ‘lto::Parser::AtomSyncer’ does not have any field named ‘_llvmAtoms’
  257. :info:build src/ld/parsers/lto_file.cpp:224: error: class ‘lto::Parser::AtomSyncer’ does not have any field named ‘_deadllvmAtoms’
  258. :info:build src/ld/parsers/lto_file.cpp: In static member function ‘static bool lto::Parser::optimize(const std::vector<const ld::Atom*, std::allocator<const ld::Atom*> >&, ld::Internal&, const lto::OptimizeOptions&, ld::File::AtomHandler&, std::vector<const ld::Atom*, std::allocator<const ld::Atom*> >&, std::vector<const char*, std::allocator<const char*> >&)’:
  259. :info:build src/ld/parsers/lto_file.cpp:490: error: ‘CStringSet’ was not declared in this scope
  260. :info:build src/ld/parsers/lto_file.cpp:490: error: expected `;' before ‘nonLLVMRefs’
  261. :info:build src/ld/parsers/lto_file.cpp:491: error: ‘CStringToAtom’ was not declared in this scope
  262. :info:build src/ld/parsers/lto_file.cpp:491: error: expected `;' before ‘llvmAtoms’
  263. :info:build src/ld/parsers/lto_file.cpp:506: error: ‘nonLLVMRefs’ was not declared in this scope
  264. :info:build src/ld/parsers/lto_file.cpp:514: error: ‘nonLLVMRefs’ was not declared in this scope
  265. :info:build src/ld/parsers/lto_file.cpp:521: error: ‘llvmAtoms’ was not declared in this scope
  266. :info:build src/ld/parsers/lto_file.cpp:527: error: ‘nonLLVMRefs’ was not declared in this scope
  267. :info:build src/ld/parsers/lto_file.cpp:534: error: expected `;' before ‘deadllvmAtoms’
  268. :info:build src/ld/parsers/lto_file.cpp:541: error: ‘deadllvmAtoms’ was not declared in this scope
  269. :info:build src/ld/parsers/lto_file.cpp:550: error: ‘deadllvmAtoms’ was not declared in this scope
  270. :info:build src/ld/parsers/lto_file.cpp:559: error: ‘deadllvmAtoms’ was not declared in this scope
  271. :info:build src/ld/parsers/lto_file.cpp:565: error: ‘CStringToAtom’ is not a class or namespace
  272. :info:build src/ld/parsers/lto_file.cpp:565: error: expected `;' before ‘it’
  273. :info:build src/ld/parsers/lto_file.cpp:565: error: name lookup of ‘it’ changed for new ISO ‘for’ scoping
  274. :info:build src/ld/parsers/lto_file.cpp:474: error: using obsolete binding at ‘it’
  275. :info:build src/ld/parsers/lto_file.cpp:565: error: ‘llvmAtoms’ was not declared in this scope
  276. :info:build src/ld/parsers/lto_file.cpp:566: error: request for member ‘first’ in ‘* it. __gnu_cxx::__normal_iterator<_Iterator, _Container>::operator-> [with _Iterator = lto::File**, _Container = std::vector<lto::File*, std::allocator<lto::File*> >]()’, which is of non-class type ‘lto::File*’
  277. :info:build src/ld/parsers/lto_file.cpp:567: error: request for member ‘second’ in ‘* it. __gnu_cxx::__normal_iterator<_Iterator, _Container>::operator-> [with _Iterator = lto::File**, _Container = std::vector<lto::File*, std::allocator<lto::File*> >]()’, which is of non-class type ‘lto::File*’
  278. :info:build src/ld/parsers/lto_file.cpp:576: error: ‘nonLLVMRefs’ was not declared in this scope
  279. :info:build src/ld/parsers/lto_file.cpp:680: error: ‘CStringToAtom’ is not a class or namespace
  280. :info:build src/ld/parsers/lto_file.cpp:680: error: expected `;' before ‘it’
  281. :info:build src/ld/parsers/lto_file.cpp:680: error: ‘llvmAtoms’ was not declared in this scope
  282. :info:build src/ld/parsers/lto_file.cpp:681: error: request for member ‘first’ in ‘* it. __gnu_cxx::__normal_iterator<_Iterator, _Container>::operator-> [with _Iterator = lto::File**, _Container = std::vector<lto::File*, std::allocator<lto::File*> >]()’, which is of non-class type ‘lto::File*’
  283. :info:build src/ld/parsers/lto_file.cpp:686: error: ‘CStringToAtom’ is not a class or namespace
  284. :info:build src/ld/parsers/lto_file.cpp:686: error: expected `;' before ‘it’
  285. :info:build src/ld/parsers/lto_file.cpp:686: error: ‘deadllvmAtoms’ was not declared in this scope
  286. :info:build src/ld/parsers/lto_file.cpp:687: error: request for member ‘first’ in ‘* it. __gnu_cxx::__normal_iterator<_Iterator, _Container>::operator-> [with _Iterator = lto::File**, _Container = std::vector<lto::File*, std::allocator<lto::File*> >]()’, which is of non-class type ‘lto::File*’
  287. :info:build src/ld/parsers/lto_file.cpp:692: error: ‘llvmAtoms’ was not declared in this scope
  288. :info:build src/ld/parsers/lto_file.cpp:692: error: ‘deadllvmAtoms’ was not declared in this scope
  289. :info:build src/ld/parsers/lto_file.cpp:700: error: ‘CStringToAtom’ is not a class or namespace
  290. :info:build src/ld/parsers/lto_file.cpp:700: error: expected `;' before ‘li’
  291. :info:build src/ld/parsers/lto_file.cpp:700: error: ‘li’ was not declared in this scope
  292. :info:build src/ld/parsers/lto_file.cpp:700: error: ‘le’ was not declared in this scope
  293. :info:build src/ld/parsers/lto_file.cpp: In member function ‘virtual void lto::Parser::AtomSyncer::doAtom(const ld::Atom&)’:
  294. :info:build src/ld/parsers/lto_file.cpp:726: error: ‘CStringToAtom’ has not been declaredmake: *** [src/other/ObjectDump.o] Error 1
  295. :info:build make: *** Waiting for unfinished jobs....
  296. :info:build
  297. :info:build src/ld/parsers/lto_file.cpp:726: error: expected `;' before ‘pos’
  298. :info:build src/ld/parsers/lto_file.cpp:727: error: ‘pos’ was not declared in this scope
  299. :info:build src/ld/parsers/lto_file.cpp:727: error: ‘_llvmAtoms’ was not declared in this scope
  300. :info:build src/ld/parsers/lto_file.cpp:733: error: ‘_deadllvmAtoms’ was not declared in this scope
  301. :info:build src/ld/parsers/lto_file.cpp:775: error: ‘CStringToAtom’ has not been declared
  302. :info:build src/ld/parsers/lto_file.cpp:775: error: expected `;' before ‘pos’
  303. :info:build src/ld/parsers/lto_file.cpp:776: error: ‘pos’ was not declared in this scope
  304. :info:build src/ld/parsers/lto_file.cpp:776: error: ‘_llvmAtoms’ was not declared in this scope
  305. :info:build src/ld/parsers/lto_file.cpp:780: error: ‘_deadllvmAtoms’ was not declared in this scope
  306. :info:build make: *** [src/ld/parsers/lto_file.o] Error 1
  307. :info:build In file included from src/ld/parsers/macho_relocatable_file.h:29,
  308. :info:build from src/ld/parsers/macho_relocatable_file.cpp:51:
  309. :info:build src/ld/Options.h:345: error: ISO C++ forbids declaration of ‘unordered_map’ with no type
  310. :info:build src/ld/Options.h:345: error: typedef name may not be a nested-name-specifier
  311. :info:build src/ld/Options.h:345: error: expected ‘;’ before ‘<’ token
  312. :info:build src/ld/Options.h:346: error: ISO C++ forbids declaration of ‘unordered_set’ with no type
  313. :info:build src/ld/Options.h:346: error: typedef name may not be a nested-name-specifier
  314. :info:build src/ld/Options.h:346: error: expected ‘;’ before ‘<’ token
  315. :info:build src/ld/Options.h:358: error: ‘NameSet’ has not been declared
  316. :info:build src/ld/Options.h:358: error: ISO C++ forbids declaration of ‘iterator’ with no type
  317. :info:build src/ld/Options.h:358: error: expected ‘;’ before ‘regularBegin’
  318. :info:build src/ld/Options.h:359: error: expected `;' before ‘NameSet’
  319. :info:build src/ld/Options.h:359: error: ‘NameSet’ has not been declared
  320. :info:build src/ld/Options.h:359: error: ISO C++ forbids declaration of ‘iterator’ with no type
  321. :info:build src/ld/Options.h:359: error: expected ‘;’ before ‘regularEnd’
  322. :info:build src/ld/Options.h:360: error: expected `;' before ‘void’
  323. :info:build src/ld/Options.h:360: error: expected ‘,’ or ‘...’ before ‘&’ token
  324. :info:build src/ld/Options.h:360: error: ISO C++ forbids declaration of ‘NameSet’ with no type
  325. :info:build src/ld/Options.h:366: error: ‘NameSet’ does not name a type
  326. :info:build src/ld/Options.h:406: error: ‘NameToOrder’ has not been declared
  327. :info:build src/ld/Options.h:444: error: ‘NameSet’ does not name a type
  328. :info:build src/ld/Options.h:445: error: ‘NameToOrder’ does not name a type
  329. :info:build src/ld/Options.h:571: error: ‘NameSet’ does not name a type
  330. :info:build src/ld/Options.h:572: error: ‘NameSet’ does not name a type
  331. :info:build src/ld/Options.h: In member function ‘bool Options::wasRemovedExport(const char*) const’:
  332. :info:build src/ld/Options.h:206: error: ‘fRemovedExports’ was not declared in this scope
  333. :info:build src/ld/Options.h: In member function ‘bool Options::allowedUndefined(const char*) const’:
  334. :info:build src/ld/Options.h:274: error: ‘fAllowedUndefined’ was not declared in this scope
  335. :info:build src/ld/Options.h: In member function ‘bool Options::someAllowedUndefines() const’:
  336. :info:build src/ld/Options.h:275: error: ‘fAllowedUndefined’ was not declared in this scope
  337. :info:build src/ld/Options.h: In member function ‘bool Options::SetWithWildcards::empty() const’:
  338. :info:build src/ld/Options.h:356: error: ‘fRegular’ was not declared in this scope
  339. :info:build src/abstraction/MachOFileAbstraction.hpp: In static member function ‘static uint32_t macho_compact_unwind_entry<P>::personalityFieldOffset() [with P = Pointer64<LittleEndian>]’:
  340. :info:build src/ld/parsers/macho_relocatable_file.cpp:4233: instantiated from ‘void mach_o::relocatable::CUSection<A>::parse(mach_o::relocatable::Parser<A>&, uint32_t, mach_o::relocatable::CUSection<A>::Info*) [with A = x86_64]’
  341. :info:build src/ld/parsers/macho_relocatable_file.cpp:1497: instantiated from ‘ld::relocatable::File* mach_o::relocatable::Parser<A>::parse(const mach_o::relocatable::ParserOptions&) [with A = x86_64]’
  342. :info:build src/ld/parsers/macho_relocatable_file.cpp:869: instantiated from ‘static ld::relocatable::File* mach_o::relocatable::Parser<A>::parse(const uint8_t*, uint64_t, const char*, time_t, ld::File::Ordinal, const mach_o::relocatable::ParserOptions&) [with A = x86_64]’
  343. :info:build src/ld/parsers/macho_relocatable_file.cpp:6295: instantiated from here
  344. :info:build src/abstraction/MachOFileAbstraction.hpp:1394: warning: invalid access to non-static data member ‘macho_compact_unwind_entry<Pointer64<LittleEndian> >::_personality’ of NULL object
  345. :info:build src/abstraction/MachOFileAbstraction.hpp:1394: warning: (perhaps the ‘offsetof’ macro was used incorrectly)
  346. :info:build src/abstraction/MachOFileAbstraction.hpp: In static member function ‘static uint32_t macho_compact_unwind_entry<P>::lsdaFieldOffset() [with P = Pointer64<LittleEndian>]’:
  347. :info:build src/ld/parsers/macho_relocatable_file.cpp:4237: instantiated from ‘void mach_o::relocatable::CUSection<A>::parse(mach_o::relocatable::Parser<A>&, uint32_t, mach_o::relocatable::CUSection<A>::Info*) [with A = x86_64]’
  348. :info:build src/ld/parsers/macho_relocatable_file.cpp:1497: instantiated from ‘ld::relocatable::File* mach_o::relocatable::Parser<A>::parse(const mach_o::relocatable::ParserOptions&) [with A = x86_64]’
  349. :info:build src/ld/parsers/macho_relocatable_file.cpp:869: instantiated from ‘static ld::relocatable::File* mach_o::relocatable::Parser<A>::parse(const uint8_t*, uint64_t, const char*, time_t, ld::File::Ordinal, const mach_o::relocatable::ParserOptions&) [with A = x86_64]’
  350. :info:build src/ld/parsers/macho_relocatable_file.cpp:6295: instantiated from here
  351. :info:build src/abstraction/MachOFileAbstraction.hpp:1395: warning: invalid access to non-static data member ‘macho_compact_unwind_entry<Pointer64<LittleEndian> >::_lsda’ of NULL object
  352. :info:build src/abstraction/MachOFileAbstraction.hpp:1395: warning: (perhaps the ‘offsetof’ macro was used incorrectly)
  353. :info:build src/abstraction/MachOFileAbstraction.hpp: In static member function ‘static uint32_t macho_compact_unwind_entry<P>::codeStartFieldOffset() [with P = Pointer64<LittleEndian>]’:
  354. :info:build src/ld/parsers/macho_relocatable_file.cpp:4245: instantiated from ‘void mach_o::relocatable::CUSection<A>::parse(mach_o::relocatable::Parser<A>&, uint32_t, mach_o::relocatable::CUSection<A>::Info*) [with A = x86_64]’
  355. :info:build src/ld/parsers/macho_relocatable_file.cpp:1497: instantiated from ‘ld::relocatable::File* mach_o::relocatable::Parser<A>::parse(const mach_o::relocatable::ParserOptions&) [with A = x86_64]’
  356. :info:build src/ld/parsers/macho_relocatable_file.cpp:869: instantiated from ‘static ld::relocatable::File* mach_o::relocatable::Parser<A>::parse(const uint8_t*, uint64_t, const char*, time_t, ld::File::Ordinal, const mach_o::relocatable::ParserOptions&) [with A = x86_64]’
  357. :info:build src/ld/parsers/macho_relocatable_file.cpp:6295: instantiated from here
  358. :info:build src/abstraction/MachOFileAbstraction.hpp:1393: warning: invalid access to non-static data member ‘macho_compact_unwind_entry<Pointer64<LittleEndian> >::_codeStart’ of NULL object
  359. :info:build src/abstraction/MachOFileAbstraction.hpp:1393: warning: (perhaps the ‘offsetof’ macro was used incorrectly)
  360. :info:build src/abstraction/MachOFileAbstraction.hpp: In static member function ‘static uint32_t macho_compact_unwind_entry<P>::personalityFieldOffset() [with P = Pointer32<LittleEndian>]’:
  361. :info:build src/ld/parsers/macho_relocatable_file.cpp:4233: instantiated from ‘void mach_o::relocatable::CUSection<A>::parse(mach_o::relocatable::Parser<A>&, uint32_t, mach_o::relocatable::CUSection<A>::Info*) [with A = x86]’
  362. :info:build src/ld/parsers/macho_relocatable_file.cpp:1497: instantiated from ‘ld::relocatable::File* mach_o::relocatable::Parser<A>::parse(const mach_o::relocatable::ParserOptions&) [with A = x86]’
  363. :info:build src/ld/parsers/macho_relocatable_file.cpp:869: instantiated from ‘static ld::relocatable::File* mach_o::relocatable::Parser<A>::parse(const uint8_t*, uint64_t, const char*, time_t, ld::File::Ordinal, const mach_o::relocatable::ParserOptions&) [with A = x86]’
  364. :info:build src/ld/parsers/macho_relocatable_file.cpp:6301: instantiated from here
  365. :info:build src/abstraction/MachOFileAbstraction.hpp:1394: warning: invalid access to non-static data member ‘macho_compact_unwind_entry<Pointer32<LittleEndian> >::_personality’ of NULL object
  366. :info:build src/abstraction/MachOFileAbstraction.hpp:1394: warning: (perhaps the ‘offsetof’ macro was used incorrectly)
  367. :info:build src/abstraction/MachOFileAbstraction.hpp: In static member function ‘static uint32_t macho_compact_unwind_entry<P>::lsdaFieldOffset() [with P = Pointer32<LittleEndian>]’:
  368. :info:build src/ld/parsers/macho_relocatable_file.cpp:4237: instantiated from ‘void mach_o::relocatable::CUSection<A>::parse(mach_o::relocatable::Parser<A>&, uint32_t, mach_o::relocatable::CUSection<A>::Info*) [with A = x86]’
  369. :info:build src/ld/parsers/macho_relocatable_file.cpp:1497: instantiated from ‘ld::relocatable::File* mach_o::relocatable::Parser<A>::parse(const mach_o::relocatable::ParserOptions&) [with A = x86]’
  370. :info:build src/ld/parsers/macho_relocatable_file.cpp:869: instantiated from ‘static ld::relocatable::File* mach_o::relocatable::Parser<A>::parse(const uint8_t*, uint64_t, const char*, time_t, ld::File::Ordinal, const mach_o::relocatable::ParserOptions&) [with A = x86]’
  371. :info:build src/ld/parsers/macho_relocatable_file.cpp:6301: instantiated from here
  372. :info:build src/abstraction/MachOFileAbstraction.hpp:1395: warning: invalid access to non-static data member ‘macho_compact_unwind_entry<Pointer32<LittleEndian> >::_lsda’ of NULL object
  373. :info:build src/abstraction/MachOFileAbstraction.hpp:1395: warning: (perhaps the ‘offsetof’ macro was used incorrectly)
  374. :info:build src/abstraction/MachOFileAbstraction.hpp: In static member function ‘static uint32_t macho_compact_unwind_entry<P>::codeStartFieldOffset() [with P = Pointer32<LittleEndian>]’:
  375. :info:build src/ld/parsers/macho_relocatable_file.cpp:4245: instantiated from ‘void mach_o::relocatable::CUSection<A>::parse(mach_o::relocatable::Parser<A>&, uint32_t, mach_o::relocatable::CUSection<A>::Info*) [with A = x86]’
  376. :info:build src/ld/parsers/macho_relocatable_file.cpp:1497: instantiated from ‘ld::relocatable::File* mach_o::relocatable::Parser<A>::parse(const mach_o::relocatable::ParserOptions&) [with A = x86]’
  377. :info:build src/ld/parsers/macho_relocatable_file.cpp:869: instantiated from ‘static ld::relocatable::File* mach_o::relocatable::Parser<A>::parse(const uint8_t*, uint64_t, const char*, time_t, ld::File::Ordinal, const mach_o::relocatable::ParserOptions&) [with A = x86]’
  378. :info:build src/ld/parsers/macho_relocatable_file.cpp:6301: instantiated from here
  379. :info:build src/abstraction/MachOFileAbstraction.hpp:1393: warning: invalid access to non-static data member ‘macho_compact_unwind_entry<Pointer32<LittleEndian> >::_codeStart’ of NULL object
  380. :info:build src/abstraction/MachOFileAbstraction.hpp:1393: warning: (perhaps the ‘offsetof’ macro was used incorrectly)
  381. :info:build make: *** [src/ld/parsers/macho_relocatable_file.o] Error 1
  382. :info:build make: *** [src/other/dyldinfo.o] Error 1
  383. :info:build make: Leaving directory `/opt/local/var/macports/build/_opt_local_var_macports_sources_rsync.macports.org_release_tarballs_ports_devel_ld64/ld64-136/work/ld64-136'
  384. :info:build Command failed: cd "/opt/local/var/macports/build/_opt_local_var_macports_sources_rsync.macports.org_release_tarballs_ports_devel_ld64/ld64-136/work/ld64-136" && /usr/bin/make -j4 -w all CC="/usr/bin/gcc-4.2" CXX="/usr/bin/g++-4.2" OTHER_CPPFLAGS="-I/opt/local/include -I/opt/local/var/macports/build/_opt_local_var_macports_sources_rsync.macports.org_release_tarballs_ports_devel_ld64/ld64-136/work/dyld-360.18/include" OTHER_CFLAGS="-Os -arch x86_64" OTHER_CXXFLAGS="-Os -arch x86_64" OTHER_LDFLAGS="-L/opt/local/lib -Wl,-headerpad_max_install_names -arch x86_64" LLVM_CONFIG=/opt/local/bin/llvm-config-mp-3.4
  385. :info:build Exit code: 2
  386. :error:build org.macports.build for port ld64-136 returned: command execution failed
  387. :debug:build Error code: CHILDSTATUS 70228 2
  388. :debug:build Backtrace: command execution failed
  389. while executing
  390. "system -nice 0 $fullcmdstring"
  391. ("eval" body line 1)
  392. invoked from within
  393. "eval system $notty $nice \$fullcmdstring"
  394. invoked from within
  395. "command_exec build"
  396. (procedure "portbuild::build_main" line 8)
  397. invoked from within
  398. "portbuild::build_main org.macports.build"
  399. ("eval" body line 1)
  400. invoked from within
  401. "eval $procedure $targetname"
  402. :info:build Warning: targets not executed for ld64-136: org.macports.activate org.macports.build org.macports.destroot org.macports.install
  403. :error:build Failed to install ld64-136
  404. :debug:build Registry error: libcxxabi not registered as installed & active.
  405. invoked from within
  406. "registry_active $subport"
  407. invoked from within
  408. "$workername eval registry_active \$subport"
  409. :notice:build Please see the log file for port ld64-136 for details:
  410. /opt/local/var/macports/logs/_opt_local_var_macports_sources_rsync.macports.org_release_tarballs_ports_devel_ld64/ld64-136/main.log
Advertisement
Add Comment
Please, Sign In to add comment
Advertisement