SHARE
TWEET

Untitled

a guest Mar 25th, 2019 58 Never
Not a member of Pastebin yet? Sign Up, it unlocks many cool features!
  1. 12:00 $ ./gradlew dependencyCheckAnalyze
  2. :dependencyCheckAnalyze
  3. Verifying dependencies for project jenkins-sdl-dependency-check
  4. Checking for updates and analyzing dependencies for vulnerabilities
  5. Error reading NVD JSON data: /tmp/dctemp002953ae-1a2b-4d3d-982c-186676d302ce/cve2003_4210462702096525647.json.gz
  6. Error reading NVD JSON data: /tmp/dctemp002953ae-1a2b-4d3d-982c-186676d302ce/cve2004_4955491918097073582.json.gz
  7. Error reading NVD JSON data: /tmp/dctemp002953ae-1a2b-4d3d-982c-186676d302ce/cve2005_2437025964754214807.json.gz
  8. Error reading NVD JSON data: /tmp/dctemp002953ae-1a2b-4d3d-982c-186676d302ce/cve2007_2858744390975194895.json.gz
  9. Error reading NVD JSON data: /tmp/dctemp002953ae-1a2b-4d3d-982c-186676d302ce/cve2002_2878128098593932361.json.gz
  10. Error reading NVD JSON data: /tmp/dctemp002953ae-1a2b-4d3d-982c-186676d302ce/cve2010_7952689546445376363.json.gz
  11. Error reading NVD JSON data: /tmp/dctemp002953ae-1a2b-4d3d-982c-186676d302ce/cve2009_4362200433356443335.json.gz
  12. Error reading NVD JSON data: /tmp/dctemp002953ae-1a2b-4d3d-982c-186676d302ce/cve2006_8568096301894703306.json.gz
  13. Error reading NVD JSON data: /tmp/dctemp002953ae-1a2b-4d3d-982c-186676d302ce/cve2012_769975620109281326.json.gz
  14. Error reading NVD JSON data: /tmp/dctemp002953ae-1a2b-4d3d-982c-186676d302ce/cve2008_3088468186676120977.json.gz
  15. Error reading NVD JSON data: /tmp/dctemp002953ae-1a2b-4d3d-982c-186676d302ce/cve2013_7561106713162411276.json.gz
  16. Error reading NVD JSON data: /tmp/dctemp002953ae-1a2b-4d3d-982c-186676d302ce/cve2014_8086959628137432163.json.gz
  17. Error reading NVD JSON data: /tmp/dctemp002953ae-1a2b-4d3d-982c-186676d302ce/cve2015_6714499306665942592.json.gz
  18. Error reading NVD JSON data: /tmp/dctemp002953ae-1a2b-4d3d-982c-186676d302ce/cve2011_4069540499239244763.json.gz
  19. Error reading NVD JSON data: /tmp/dctemp002953ae-1a2b-4d3d-982c-186676d302ce/cve2016_5757561027099174327.json.gz
  20. Error reading NVD JSON data: /tmp/dctemp002953ae-1a2b-4d3d-982c-186676d302ce/cve2019_4510631737801640976.json.gz
  21. Error reading NVD JSON data: /tmp/dctemp002953ae-1a2b-4d3d-982c-186676d302ce/cve2017_281479973888579575.json.gz
  22. Error reading NVD JSON data: /tmp/dctemp002953ae-1a2b-4d3d-982c-186676d302ce/cve2018_7481112819003891199.json.gz
  23. Unable to update Cached Web DataSource, using local data instead. Results may not include recent vulnerabilities.
  24. Unable to continue dependency-check analysis.
  25. :dependencyCheckAnalyze FAILED
  26.  
  27. FAILURE: Build failed with an exception.
  28.  
  29. * What went wrong:
  30. Execution failed for task ':dependencyCheckAnalyze'.
  31. > Analysis failed.
  32.  
  33. * Try:
  34. Run with --stacktrace option to get the stack trace. Run with --info or --debug option to get more log output.
  35.  
  36. BUILD FAILED
  37.  
  38. Total time: 1.172 secs
RAW Paste Data
We use cookies for various purposes including analytics. By continuing to use Pastebin, you agree to our use of cookies as described in the Cookies Policy. OK, I Understand
Not a member of Pastebin yet?
Sign Up, it unlocks many cool features!
 
Top