Advertisement
Guest User

Untitled

a guest
Oct 31st, 2016
133
Never
Not a member of Pastebin yet? Sign Up, it unlocks many cool features!
Bash 16.91 KB | None
  1. pi@raspberrypi:~/Code/openFrameworks/addons/ofxSoundObjects/example-audioOutput $ make
  2. HOST_OS=Linux
  3. checking pkg-config libraries:   cairo zlib gstreamer-app-1.0 gstreamer-1.0 gstreamer-video-1.0 gstreamer-base-1.0 libud
  4. ev freetype2 fontconfig sndfile openal openssl gtk+-3.0 libmpg123
  5. Compiling OF library for Release
  6. make[1]: Entering directory '/home/pi/Code/openFrameworks/libs/openFrameworksCompiled/project'
  7. HOST_OS=Linux
  8. checking pkg-config libraries:   cairo zlib gstreamer-app-1.0 gstreamer-1.0 gstreamer-video-1.0 gstreamer-base-1.0 libud
  9. ev freetype2 fontconfig sndfile openal openssl gtk+-3.0 libmpg123
  10. HOST_OS=Linux
  11. checking pkg-config libraries:   cairo zlib gstreamer-app-1.0 gstreamer-1.0 gstreamer-video-1.0 gstreamer-base-1.0 libud
  12. ev freetype2 fontconfig sndfile openal openssl gtk+-3.0 libmpg123
  13. HOST_OS=Linux
  14. checking pkg-config libraries:   cairo zlib gstreamer-app-1.0 gstreamer-1.0 gstreamer-video-1.0 gstreamer-base-1.0 libud
  15. ev freetype2 fontconfig sndfile openal openssl gtk+-3.0 libmpg123
  16. Done!
  17. make[1]: Leaving directory '/home/pi/Code/openFrameworks/libs/openFrameworksCompiled/project'
  18.  
  19.  
  20. Compiling example-audioOutput for Release
  21. make[1]: Entering directory '/home/pi/Code/openFrameworks/addons/ofxSoundObjects/example-audioOutput'
  22. HOST_OS=Linux
  23. checking pkg-config libraries:   cairo zlib gstreamer-app-1.0 gstreamer-1.0 gstreamer-video-1.0 gstreamer-base-1.0 libud
  24. ev freetype2 fontconfig sndfile openal openssl gtk+-3.0 libmpg123
  25. Compiling /home/pi/Code/openFrameworks/addons/ofxSoundObjects/src/ofxSoundFile.cpp
  26. g++ -c -O3 -DNDEBUG -Wall -std=c++14 -DGCC_HAS_REGEX -march=armv6 -mfpu=vfp -mfloat-abi=hard -fPIC -ftree-vectorize -Wno
  27. -psabi -pipe -DOF_USING_GTK -DOF_USING_GTK -DOF_USING_MPG123 -DTARGET_RASPBERRY_PI -DSTANDALONE -DPIC -D_REENTRANT -D_LA
  28. RGEFILE64_SOURCE -D_FILE_OFFSET_BITS=64 -D_FORTIFY_SOURCE -D__STDC_CONSTANT_MACROS -D__STDC_LIMIT_MACROS -DTARGET_POSIX
  29. -DHAVE_LIBOPENMAX=2 -DOMX -DOMX_SKIP64BIT -DUSE_EXTERNAL_OMX -DHAVE_LIBBCM_HOST -DUSE_EXTERNAL_LIBBCM_HOST -DUSE_VCHIQ_A
  30. RM  -I/opt/vc/include -I/opt/vc/include/IL -I/opt/vc/include/interface/vcos/pthreads -I/opt/vc/include/interface/vmcs_ho
  31. st/linux -pthread -I/usr/include/gstreamer-1.0 -I/usr/include/AL -I/usr/include/gtk-3.0 -I/usr/include/at-spi2-atk/2.0 -
  32. I/usr/include/at-spi-2.0 -I/usr/include/dbus-1.0 -I/usr/lib/arm-linux-gnueabihf/dbus-1.0/include -I/usr/include/gtk-3.0
  33. -I/usr/include/gio-unix-2.0/ -I/usr/include/cairo -I/usr/include/pango-1.0 -I/usr/include/harfbuzz -I/usr/include/pango-
  34. 1.0 -I/usr/include/atk-1.0 -I/usr/include/cairo -I/usr/include/pixman-1 -I/usr/include/freetype2 -I/usr/include/libpng12
  35.  -I/usr/include/gdk-pixbuf-2.0 -I/usr/include/libpng12 -I/usr/include/glib-2.0 -I/usr/lib/arm-linux-gnueabihf/glib-2.0/i
  36. nclude -I/home/pi/Code/openFrameworks/libs/fmodex/include -I/home/pi/Code/openFrameworks/libs/glfw/include -I/home/pi/Co
  37. de/openFrameworks/libs/glfw/include/GLFW -I/home/pi/Code/openFrameworks/libs/kiss/include -I/home/pi/Code/openFrameworks
  38. /libs/poco/include -I/home/pi/Code/openFrameworks/libs/tess2/include -I/home/pi/Code/openFrameworks/libs/utf8cpp/include
  39.  -I/home/pi/Code/openFrameworks/libs/utf8cpp/include/utf8 -I/home/pi/Code/openFrameworks/libs/openFrameworks -I/home/pi/
  40. Code/openFrameworks/libs/openFrameworks/video -I/home/pi/Code/openFrameworks/libs/openFrameworks/communication -I/home/p
  41. i/Code/openFrameworks/libs/openFrameworks/app -I/home/pi/Code/openFrameworks/libs/openFrameworks/3d -I/home/pi/Code/open
  42. Frameworks/libs/openFrameworks/math -I/home/pi/Code/openFrameworks/libs/openFrameworks/graphics -I/home/pi/Code/openFram
  43. eworks/libs/openFrameworks/types -I/home/pi/Code/openFrameworks/libs/openFrameworks/sound -I/home/pi/Code/openFrameworks
  44. /libs/openFrameworks/events -I/home/pi/Code/openFrameworks/libs/openFrameworks/gl -I/home/pi/Code/openFrameworks/libs/op
  45. enFrameworks/utils -I/home/pi/Code/openFrameworks/addons/ofxSoundObjects/src -I/home/pi/Code/openFrameworks/addons/ofxSo
  46. undObjects/src/SoundObjects -I/home/pi/Code/openFrameworks/addons/ofxSoundObjects/libs -I/home/pi/Code/openFrameworks/ad
  47. dons/ofxSoundObjects/libs/libaudiodecoder -I/home/pi/Code/openFrameworks/addons/ofxSoundObjects/libs/libaudiodecoder/src
  48.  -I/home/pi/Code/openFrameworks/addons/ofxSoundObjects/libs/libaudiodecoder/include -I/home/pi/Code/openFrameworks/addon
  49. s/ofxSoundObjects/libs/libaudiodecoder/include -I/home/pi/Code/openFrameworks/addons/ofxSoundObjects/libs/libaudiodecode
  50. r/include/audiodecoder.h -I/home/pi/Code/openFrameworks/addons/ofxSoundObjects/libs/libaudiodecoder/include/audiodecoder
  51. base.h -MMD -MP -MF /home/pi/Code/openFrameworks/addons/obj/linuxarmv6l/Release/ofxSoundObjects/src/ofxSoundFile.d -MT /
  52. home/pi/Code/openFrameworks/addons/obj/linuxarmv6l/Release/ofxSoundObjects/src/ofxSoundFile.o -o /home/pi/Code/openFrame
  53. works/addons/obj/linuxarmv6l/Release/ofxSoundObjects/src/ofxSoundFile.o -c /home/pi/Code/openFrameworks/addons/ofxSoundO
  54. bjects/src/ofxSoundFile.cpp
  55. cc1plus: warning: /home/pi/Code/openFrameworks/addons/ofxSoundObjects/libs/libaudiodecoder/include/audiodecoder.h: not a
  56.  directory
  57. cc1plus: warning: /home/pi/Code/openFrameworks/addons/ofxSoundObjects/libs/libaudiodecoder/include/audiodecoderbase.h: n
  58. ot a directory
  59. In file included from /home/pi/Code/openFrameworks/addons/ofxSoundObjects/src/ofxSoundFile.cpp:8:0:
  60. /home/pi/Code/openFrameworks/addons/ofxSoundObjects/src/ofxSoundFile.h:90:2: error: â?~mpg123_handleâ?T does not name a
  61. type
  62.   mpg123_handle * mp3File;
  63.   ^
  64. /home/pi/Code/openFrameworks/addons/ofxSoundObjects/src/ofxSoundFile.cpp: In constructor â?~ofxSoundFile::ofxSoundFile()
  65. â?T:
  66. /home/pi/Code/openFrameworks/addons/ofxSoundObjects/src/ofxSoundFile.cpp:54:2: error: â?~mp3Fileâ?T was not declared in
  67. this scope
  68.   mp3File = NULL;
  69.   ^
  70. /home/pi/Code/openFrameworks/addons/ofxSoundObjects/src/ofxSoundFile.cpp:56:15: error: â?~mpg123_initâ?T was not declare
  71. d in this scope
  72.    mpg123_init();
  73.                ^
  74. /home/pi/Code/openFrameworks/addons/ofxSoundObjects/src/ofxSoundFile.cpp: In member function â?~bool ofxSoundFile::save(
  75. std::string, const ofSoundBuffer&)â?T:
  76. /home/pi/Code/openFrameworks/addons/ofxSoundObjects/src/ofxSoundFile.cpp:148:11: warning: comparison between signed and
  77. unsigned integer expressions [-Wsign-compare]
  78.   while(pos<buff.size()) {
  79.            ^
  80. /home/pi/Code/openFrameworks/addons/ofxSoundObjects/src/ofxSoundFile.cpp: In member function â?~bool ofxSoundFile::mpg12
  81. 3Open(std::string)â?T:
  82. /home/pi/Code/openFrameworks/addons/ofxSoundObjects/src/ofxSoundFile.cpp:179:2: error: â?~mp3Fileâ?T was not declared in
  83.  this scope
  84.   mp3File = mpg123_new(NULL,&err);
  85.   ^
  86. /home/pi/Code/openFrameworks/addons/ofxSoundObjects/src/ofxSoundFile.cpp:179:32: error: â?~mpg123_newâ?T was not declare
  87. d in this scope
  88.   mp3File = mpg123_new(NULL,&err);
  89.                                 ^
  90. /home/pi/Code/openFrameworks/addons/ofxSoundObjects/src/ofxSoundFile.cpp:181:24: error: â?~MPG123_ADD_FLAGSâ?T was not d
  91. eclared in this scope
  92.   mpg123_param(mp3File, MPG123_ADD_FLAGS, MPG123_FORCE_FLOAT, 0.);
  93.                         ^
  94. /home/pi/Code/openFrameworks/addons/ofxSoundObjects/src/ofxSoundFile.cpp:181:42: error: â?~MPG123_FORCE_FLOATâ?T was not
  95.  declared in this scope
  96.   mpg123_param(mp3File, MPG123_ADD_FLAGS, MPG123_FORCE_FLOAT, 0.);
  97.                                           ^
  98. /home/pi/Code/openFrameworks/addons/ofxSoundObjects/src/ofxSoundFile.cpp:181:64: error: â?~mpg123_paramâ?T was not decla
  99. red in this scope
  100.   mpg123_param(mp3File, MPG123_ADD_FLAGS, MPG123_FORCE_FLOAT, 0.);
  101.                                                                 ^
  102. /home/pi/Code/openFrameworks/addons/ofxSoundObjects/src/ofxSoundFile.cpp:183:37: error: â?~mpg123_openâ?T was not declar
  103. ed in this scope
  104.   if(mpg123_open(mp3File,path.c_str())!=MPG123_OK){
  105.                                      ^
  106. /home/pi/Code/openFrameworks/addons/ofxSoundObjects/src/ofxSoundFile.cpp:183:40: error: â?~MPG123_OKâ?T was not declared
  107.  in this scope
  108.   if(mpg123_open(mp3File,path.c_str())!=MPG123_OK){
  109.                                         ^
  110. /home/pi/Code/openFrameworks/addons/ofxSoundObjects/src/ofxSoundFile.cpp:190:52: error: â?~mpg123_getformatâ?T was not d
  111. eclared in this scope
  112.   mpg123_getformat(mp3File,&rate,&channels,&encoding);
  113.                                                     ^
  114. /home/pi/Code/openFrameworks/addons/ofxSoundObjects/src/ofxSoundFile.cpp:191:15: error: â?~MPG123_ENC_SIGNED_16â?T was n
  115. ot declared in this scope
  116.   if(encoding!=MPG123_ENC_SIGNED_16 && encoding != MPG123_ENC_FLOAT_32){
  117.                ^
  118. /home/pi/Code/openFrameworks/addons/ofxSoundObjects/src/ofxSoundFile.cpp:191:51: error: â?~MPG123_ENC_FLOAT_32â?T was no
  119. t declared in this scope
  120.   if(encoding!=MPG123_ENC_SIGNED_16 && encoding != MPG123_ENC_FLOAT_32){
  121.                                                    ^
  122. /home/pi/Code/openFrameworks/addons/ofxSoundObjects/src/ofxSoundFile.cpp:196:28: error: â?~mpg123_format_noneâ?T was not
  123.  declared in this scope
  124.   mpg123_format_none(mp3File);
  125.                             ^
  126. /home/pi/Code/openFrameworks/addons/ofxSoundObjects/src/ofxSoundFile.cpp:197:49: error: â?~mpg123_formatâ?T was not decl
  127. ared in this scope
  128.   mpg123_format(mp3File, rate, channels, encoding);
  129.                                                  ^
  130. /home/pi/Code/openFrameworks/addons/ofxSoundObjects/src/ofxSoundFile.cpp:202:32: error: â?~mpg123_seekâ?T was not declar
  131. ed in this scope
  132.   mpg123_seek(mp3File,0,SEEK_END);
  133.                                 ^
  134. /home/pi/Code/openFrameworks/addons/ofxSoundObjects/src/ofxSoundFile.cpp:203:31: error: â?~mpg123_tellâ?T was not declar
  135. ed in this scope
  136.   samples = mpg123_tell(mp3File);
  137.                                ^
  138. /home/pi/Code/openFrameworks/addons/ofxSoundObjects/src/ofxSoundFile.cpp:206:5: error: â?~bitDepthâ?T was not declared i
  139. n this scope
  140.      bitDepth = 16; //TODO:get real bitdepth;.
  141.      ^
  142. /home/pi/Code/openFrameworks/addons/ofxSoundObjects/src/ofxSoundFile.cpp: In member function â?~bool ofxSoundFile::sfOpe
  143. n(std::string)â?T:
  144. /home/pi/Code/openFrameworks/addons/ofxSoundObjects/src/ofxSoundFile.cpp:237:5: error: â?~bitDepthâ?T was not declared i
  145. n this scope
  146.      bitDepth = 16; //fix
  147.      ^
  148. /home/pi/Code/openFrameworks/addons/ofxSoundObjects/src/ofxSoundFile.cpp: In member function â?~void ofxSoundFile::close
  149. ()â?T:
  150. /home/pi/Code/openFrameworks/addons/ofxSoundObjects/src/ofxSoundFile.cpp:256:5: error: â?~mp3Fileâ?T was not declared in
  151.  this scope
  152.   if(mp3File){
  153.      ^
  154. /home/pi/Code/openFrameworks/addons/ofxSoundObjects/src/ofxSoundFile.cpp:257:23: error: â?~mpg123_closeâ?T was not decla
  155. red in this scope
  156.    mpg123_close(mp3File);
  157.                        ^
  158. /home/pi/Code/openFrameworks/addons/ofxSoundObjects/src/ofxSoundFile.cpp:258:24: error: â?~mpg123_deleteâ?T was not decl
  159. ared in this scope
  160.    mpg123_delete(mp3File);
  161.                         ^
  162. /home/pi/Code/openFrameworks/addons/ofxSoundObjects/src/ofxSoundFile.cpp: In member function â?~bool ofxSoundFile::readT
  163. o(ofSoundBuffer&, unsigned int)â?T:
  164. /home/pi/Code/openFrameworks/addons/ofxSoundObjects/src/ofxSoundFile.cpp:326:10: error: â?~mp3Fileâ?T was not declared i
  165. n this scope
  166.   else if(mp3File){
  167.           ^
  168. /home/pi/Code/openFrameworks/addons/ofxSoundObjects/src/ofxSoundFile.cpp: In member function â?~bool ofxSoundFile::seekT
  169. o(unsigned int)â?T:
  170. /home/pi/Code/openFrameworks/addons/ofxSoundObjects/src/ofxSoundFile.cpp:351:10: error: â?~mp3Fileâ?T was not declared i
  171. n this scope
  172.   else if(mp3File) mpg123_seek(mp3File,sample,SEEK_SET);
  173.           ^
  174. /home/pi/Code/openFrameworks/addons/ofxSoundObjects/src/ofxSoundFile.cpp:351:54: error: â?~mpg123_seekâ?T was not declar
  175. ed in this scope
  176.   else if(mp3File) mpg123_seek(mp3File,sample,SEEK_SET);
  177.                                                       ^
  178. /home/pi/Code/openFrameworks/addons/ofxSoundObjects/src/ofxSoundFile.cpp: In member function â?~bool ofxSoundFile::mpg12
  179. 3ReadFile(ofSoundBuffer&)â?T:
  180. /home/pi/Code/openFrameworks/addons/ofxSoundObjects/src/ofxSoundFile.cpp:387:39: error: â?~mp3Fileâ?T was not declared i
  181. n this scope
  182.   size_t block_size = mpg123_outblock( mp3File );
  183.                                        ^
  184. /home/pi/Code/openFrameworks/addons/ofxSoundObjects/src/ofxSoundFile.cpp:387:47: error: â?~mpg123_outblockâ?T was not de
  185. clared in this scope
  186.   size_t block_size = mpg123_outblock( mp3File );
  187.                                                ^
  188. /home/pi/Code/openFrameworks/addons/ofxSoundObjects/src/ofxSoundFile.cpp:392:98: error: â?~mpg123_readâ?T was not declar
  189. ed in this scope
  190.     err = mpg123_read(mp3File,(unsigned char*)&buffer[buffer.size()-block_size],block_size*4,&done);
  191.                                                                                                   ^
  192. /home/pi/Code/openFrameworks/addons/ofxSoundObjects/src/ofxSoundFile.cpp:394:15: error: â?~MPG123_OKâ?T was not declared
  193.  in this scope
  194.    }while(err==MPG123_OK);
  195.                ^
  196. /home/pi/Code/openFrameworks/addons/ofxSoundObjects/src/ofxSoundFile.cpp:396:13: error: â?~MPG123_DONEâ?T was not declar
  197. ed in this scope
  198.    if(err != MPG123_DONE){
  199.              ^
  200. /home/pi/Code/openFrameworks/addons/ofxSoundObjects/src/ofxSoundFile.cpp:397:80: error: â?~MPG123_ERRâ?T was not declare
  201. d in this scope
  202.     ofLogError() <<  "Warning: Decoding ended prematurely because: " << (err == MPG123_ERR ? mpg123_strerror(mp3File) :
  203. mpg123_plain_strerror(err));
  204.                                                                                 ^
  205. /home/pi/Code/openFrameworks/addons/ofxSoundObjects/src/ofxSoundFile.cpp:397:116: error: â?~mpg123_strerrorâ?T was not d
  206. eclared in this scope
  207.     ofLogError() <<  "Warning: Decoding ended prematurely because: " << (err == MPG123_ERR ? mpg123_strerror(mp3File) :
  208. mpg123_plain_strerror(err));
  209.                                                                                                                     ^
  210. /home/pi/Code/openFrameworks/addons/ofxSoundObjects/src/ofxSoundFile.cpp:397:145: error: â?~mpg123_plain_strerrorâ?T was
  211.  not declared in this scope
  212.     ofLogError() <<  "Warning: Decoding ended prematurely because: " << (err == MPG123_ERR ? mpg123_strerror(mp3File) :
  213. mpg123_plain_strerror(err));
  214.  
  215.                          ^
  216. /home/pi/Code/openFrameworks/addons/ofxSoundObjects/src/ofxSoundFile.cpp:402:89: error: â?~mpg123_readâ?T was not declar
  217. ed in this scope
  218.    err = mpg123_read(mp3File,(unsigned char*)&buffer[0],buffer.size()*sizeof(float),&done);
  219.                                                                                          ^
  220. /home/pi/Code/openFrameworks/addons/ofxSoundObjects/src/ofxSoundFile.cpp:403:13: error: â?~MPG123_OKâ?T was not declared
  221.  in this scope
  222.    if(err != MPG123_OK){
  223.              ^
  224. /home/pi/Code/openFrameworks/addons/ofxSoundObjects/src/ofxSoundFile.cpp:404:64: error: â?~MPG123_ERRâ?T was not declare
  225. d in this scope
  226.     ofLogError() <<  "Warning: Error decoding mp3: " << (err == MPG123_ERR ? mpg123_strerror(mp3File) : mpg123_plain_str
  227. error(err));
  228.                                                                 ^
  229. /home/pi/Code/openFrameworks/addons/ofxSoundObjects/src/ofxSoundFile.cpp:404:100: error: â?~mpg123_strerrorâ?T was not d
  230. eclared in this scope
  231.     ofLogError() <<  "Warning: Error decoding mp3: " << (err == MPG123_ERR ? mpg123_strerror(mp3File) : mpg123_plain_str
  232. error(err));
  233.                                                                                                     ^
  234. /home/pi/Code/openFrameworks/addons/ofxSoundObjects/src/ofxSoundFile.cpp:404:129: error: â?~mpg123_plain_strerrorâ?T was
  235.  not declared in this scope
  236.     ofLogError() <<  "Warning: Error decoding mp3: " << (err == MPG123_ERR ? mpg123_strerror(mp3File) : mpg123_plain_str
  237. error(err));
  238.  
  239.          ^
  240. /home/pi/Code/openFrameworks/addons/ofxSoundObjects/src/ofxSoundFile.cpp: In member function â?~bool ofxSoundFile::mpg12
  241. 3Open(std::string)â?T:
  242. /home/pi/Code/openFrameworks/addons/ofxSoundObjects/src/ofxSoundFile.cpp:207:1: warning: control reaches end of non-void
  243.  function [-Wreturn-type]
  244.  }
  245.  ^
  246. /home/pi/Code/openFrameworks/addons/ofxSoundObjects/src/ofxSoundFile.cpp: In member function â?~bool ofxSoundFile::sfOpe
  247. n(std::string)â?T:
  248. /home/pi/Code/openFrameworks/addons/ofxSoundObjects/src/ofxSoundFile.cpp:238:1: warning: control reaches end of non-void
  249.  function [-Wreturn-type]
  250.  }
  251.  ^
  252. /home/pi/Code/openFrameworks/libs/openFrameworksCompiled/project/makefileCommon/compile.project.mk:336: recipe for targe
  253. t '/home/pi/Code/openFrameworks/addons/obj/linuxarmv6l/Release/ofxSoundObjects/src/ofxSoundFile.o' failed
  254. make[1]: *** [/home/pi/Code/openFrameworks/addons/obj/linuxarmv6l/Release/ofxSoundObjects/src/ofxSoundFile.o] Error 1
  255. make[1]: Leaving directory '/home/pi/Code/openFrameworks/addons/ofxSoundObjects/example-audioOutput'
  256. /home/pi/Code/openFrameworks/libs/openFrameworksCompiled/project/makefileCommon/compile.project.mk:125: recipe for targe
  257. t 'Release' failed
  258. make: *** [Release] Error 2
  259. pi@raspberrypi:~/Code/openFrameworks/addons/ofxSoundObjects/example-audioOutput $
Advertisement
RAW Paste Data Copied
Advertisement