daily pastebin goal
0%
SHARE
TWEET

mvn clean install -X

a guest Jun 19th, 2016 62 Never
Not a member of Pastebin yet? Sign Up, it unlocks many cool features!
  1. Apache Maven 3.3.9 (bb52d8502b132ec0a5a3f4c09453c07478323dc5; 2015-11-10T16:41:47+00:00)
  2. Maven home: /usr/local/Cellar/maven/3.3.9/libexec
  3. Java version: 1.8.0_91, vendor: Oracle Corporation
  4. Java home: /Library/Java/JavaVirtualMachines/jdk1.8.0_91.jdk/Contents/Home/jre
  5. Default locale: en_US, platform encoding: UTF-8
  6. OS name: "mac os x", version: "10.11.4", arch: "x86_64", family: "mac"
  7. [DEBUG] Created new class realm maven.api
  8. [DEBUG] Importing foreign packages into class realm maven.api
  9. [DEBUG]   Imported: javax.enterprise.inject.* < plexus.core
  10. [DEBUG]   Imported: javax.enterprise.util.* < plexus.core
  11. [DEBUG]   Imported: javax.inject.* < plexus.core
  12. [DEBUG]   Imported: org.apache.maven.* < plexus.core
  13. [DEBUG]   Imported: org.apache.maven.artifact < plexus.core
  14. [DEBUG]   Imported: org.apache.maven.classrealm < plexus.core
  15. [DEBUG]   Imported: org.apache.maven.cli < plexus.core
  16. [DEBUG]   Imported: org.apache.maven.configuration < plexus.core
  17. [DEBUG]   Imported: org.apache.maven.exception < plexus.core
  18. [DEBUG]   Imported: org.apache.maven.execution < plexus.core
  19. [DEBUG]   Imported: org.apache.maven.execution.scope < plexus.core
  20. [DEBUG]   Imported: org.apache.maven.lifecycle < plexus.core
  21. [DEBUG]   Imported: org.apache.maven.model < plexus.core
  22. [DEBUG]   Imported: org.apache.maven.monitor < plexus.core
  23. [DEBUG]   Imported: org.apache.maven.plugin < plexus.core
  24. [DEBUG]   Imported: org.apache.maven.profiles < plexus.core
  25. [DEBUG]   Imported: org.apache.maven.project < plexus.core
  26. [DEBUG]   Imported: org.apache.maven.reporting < plexus.core
  27. [DEBUG]   Imported: org.apache.maven.repository < plexus.core
  28. [DEBUG]   Imported: org.apache.maven.rtinfo < plexus.core
  29. [DEBUG]   Imported: org.apache.maven.settings < plexus.core
  30. [DEBUG]   Imported: org.apache.maven.toolchain < plexus.core
  31. [DEBUG]   Imported: org.apache.maven.usability < plexus.core
  32. [DEBUG]   Imported: org.apache.maven.wagon.* < plexus.core
  33. [DEBUG]   Imported: org.apache.maven.wagon.authentication < plexus.core
  34. [DEBUG]   Imported: org.apache.maven.wagon.authorization < plexus.core
  35. [DEBUG]   Imported: org.apache.maven.wagon.events < plexus.core
  36. [DEBUG]   Imported: org.apache.maven.wagon.observers < plexus.core
  37. [DEBUG]   Imported: org.apache.maven.wagon.proxy < plexus.core
  38. [DEBUG]   Imported: org.apache.maven.wagon.repository < plexus.core
  39. [DEBUG]   Imported: org.apache.maven.wagon.resource < plexus.core
  40. [DEBUG]   Imported: org.codehaus.classworlds < plexus.core
  41. [DEBUG]   Imported: org.codehaus.plexus.* < plexus.core
  42. [DEBUG]   Imported: org.codehaus.plexus.classworlds < plexus.core
  43. [DEBUG]   Imported: org.codehaus.plexus.component < plexus.core
  44. [DEBUG]   Imported: org.codehaus.plexus.configuration < plexus.core
  45. [DEBUG]   Imported: org.codehaus.plexus.container < plexus.core
  46. [DEBUG]   Imported: org.codehaus.plexus.context < plexus.core
  47. [DEBUG]   Imported: org.codehaus.plexus.lifecycle < plexus.core
  48. [DEBUG]   Imported: org.codehaus.plexus.logging < plexus.core
  49. [DEBUG]   Imported: org.codehaus.plexus.personality < plexus.core
  50. [DEBUG]   Imported: org.codehaus.plexus.util.xml.Xpp3Dom < plexus.core
  51. [DEBUG]   Imported: org.codehaus.plexus.util.xml.pull.XmlPullParser < plexus.core
  52. [DEBUG]   Imported: org.codehaus.plexus.util.xml.pull.XmlPullParserException < plexus.core
  53. [DEBUG]   Imported: org.codehaus.plexus.util.xml.pull.XmlSerializer < plexus.core
  54. [DEBUG]   Imported: org.eclipse.aether.* < plexus.core
  55. [DEBUG]   Imported: org.eclipse.aether.artifact < plexus.core
  56. [DEBUG]   Imported: org.eclipse.aether.collection < plexus.core
  57. [DEBUG]   Imported: org.eclipse.aether.deployment < plexus.core
  58. [DEBUG]   Imported: org.eclipse.aether.graph < plexus.core
  59. [DEBUG]   Imported: org.eclipse.aether.impl < plexus.core
  60. [DEBUG]   Imported: org.eclipse.aether.installation < plexus.core
  61. [DEBUG]   Imported: org.eclipse.aether.internal.impl < plexus.core
  62. [DEBUG]   Imported: org.eclipse.aether.metadata < plexus.core
  63. [DEBUG]   Imported: org.eclipse.aether.repository < plexus.core
  64. [DEBUG]   Imported: org.eclipse.aether.resolution < plexus.core
  65. [DEBUG]   Imported: org.eclipse.aether.spi < plexus.core
  66. [DEBUG]   Imported: org.eclipse.aether.transfer < plexus.core
  67. [DEBUG]   Imported: org.eclipse.aether.version < plexus.core
  68. [DEBUG]   Imported: org.slf4j.* < plexus.core
  69. [DEBUG]   Imported: org.slf4j.helpers.* < plexus.core
  70. [DEBUG]   Imported: org.slf4j.spi.* < plexus.core
  71. [DEBUG] Populating class realm maven.api
  72. [INFO] Error stacktraces are turned on.
  73. [DEBUG] Reading global settings from /usr/local/Cellar/maven/3.3.9/libexec/conf/settings.xml
  74. [DEBUG] Reading user settings from /Users/George/.m2/settings.xml
  75. [DEBUG] Reading global toolchains from /usr/local/Cellar/maven/3.3.9/libexec/conf/toolchains.xml
  76. [DEBUG] Reading user toolchains from /Users/George/.m2/toolchains.xml
  77. [DEBUG] Using local repository at /Users/George/.m2/repository
  78. [DEBUG] Using manager EnhancedLocalRepositoryManager with priority 10.0 for /Users/George/.m2/repository
  79. [INFO] Scanning for projects...
  80. [DEBUG] Extension realms for project io.github.theonlygusti:WizardServer:jar:0.0.1-SNAPSHOT: (none)
  81. [DEBUG] Looking up lifecyle mappings for packaging jar from ClassRealm[plexus.core, parent: null]
  82. [WARNING]
  83. [WARNING] Some problems were encountered while building the effective model for io.github.theonlygusti:WizardServer:jar:0.0.1-SNAPSHOT
  84. [WARNING] 'build.plugins.plugin.version' for org.apache.maven.plugins:maven-compiler-plugin is missing. @ line 8, column 15
  85. [WARNING]
  86. [WARNING] It is highly recommended to fix these problems because they threaten the stability of your build.
  87. [WARNING]
  88. [WARNING] For this reason, future Maven versions might no longer support building such malformed projects.
  89. [WARNING]
  90. [DEBUG] === REACTOR BUILD PLAN ================================================
  91. [DEBUG] Project: io.github.theonlygusti:WizardServer:jar:0.0.1-SNAPSHOT
  92. [DEBUG] Tasks:   [clean, install]
  93. [DEBUG] Style:   Regular
  94. [DEBUG] =======================================================================
  95. [INFO]                                                                        
  96. [INFO] ------------------------------------------------------------------------
  97. [INFO] Building WizardServer 0.0.1-SNAPSHOT
  98. [INFO] ------------------------------------------------------------------------
  99. [DEBUG] Lifecycle default -> [validate, initialize, generate-sources, process-sources, generate-resources, process-resources, compile, process-classes, generate-test-sources, process-test-sources, generate-test-resources, process-test-resources, test-compile, process-test-classes, test, prepare-package, package, pre-integration-test, integration-test, post-integration-test, verify, install, deploy]
  100. [DEBUG] Lifecycle clean -> [pre-clean, clean, post-clean]
  101. [DEBUG] Lifecycle site -> [pre-site, site, post-site, site-deploy]
  102. [DEBUG] Lifecycle default -> [validate, initialize, generate-sources, process-sources, generate-resources, process-resources, compile, process-classes, generate-test-sources, process-test-sources, generate-test-resources, process-test-resources, test-compile, process-test-classes, test, prepare-package, package, pre-integration-test, integration-test, post-integration-test, verify, install, deploy]
  103. [DEBUG] Lifecycle clean -> [pre-clean, clean, post-clean]
  104. [DEBUG] Lifecycle site -> [pre-site, site, post-site, site-deploy]
  105. [DEBUG] Lifecycle default -> [validate, initialize, generate-sources, process-sources, generate-resources, process-resources, compile, process-classes, generate-test-sources, process-test-sources, generate-test-resources, process-test-resources, test-compile, process-test-classes, test, prepare-package, package, pre-integration-test, integration-test, post-integration-test, verify, install, deploy]
  106. [DEBUG] Lifecycle clean -> [pre-clean, clean, post-clean]
  107. [DEBUG] Lifecycle site -> [pre-site, site, post-site, site-deploy]
  108. [DEBUG] Lifecycle default -> [validate, initialize, generate-sources, process-sources, generate-resources, process-resources, compile, process-classes, generate-test-sources, process-test-sources, generate-test-resources, process-test-resources, test-compile, process-test-classes, test, prepare-package, package, pre-integration-test, integration-test, post-integration-test, verify, install, deploy]
  109. [DEBUG] Lifecycle clean -> [pre-clean, clean, post-clean]
  110. [DEBUG] Lifecycle site -> [pre-site, site, post-site, site-deploy]
  111. [DEBUG] Lifecycle default -> [validate, initialize, generate-sources, process-sources, generate-resources, process-resources, compile, process-classes, generate-test-sources, process-test-sources, generate-test-resources, process-test-resources, test-compile, process-test-classes, test, prepare-package, package, pre-integration-test, integration-test, post-integration-test, verify, install, deploy]
  112. [DEBUG] Lifecycle clean -> [pre-clean, clean, post-clean]
  113. [DEBUG] Lifecycle site -> [pre-site, site, post-site, site-deploy]
  114. [DEBUG] Lifecycle default -> [validate, initialize, generate-sources, process-sources, generate-resources, process-resources, compile, process-classes, generate-test-sources, process-test-sources, generate-test-resources, process-test-resources, test-compile, process-test-classes, test, prepare-package, package, pre-integration-test, integration-test, post-integration-test, verify, install, deploy]
  115. [DEBUG] Lifecycle clean -> [pre-clean, clean, post-clean]
  116. [DEBUG] Lifecycle site -> [pre-site, site, post-site, site-deploy]
  117. [DEBUG] Lifecycle default -> [validate, initialize, generate-sources, process-sources, generate-resources, process-resources, compile, process-classes, generate-test-sources, process-test-sources, generate-test-resources, process-test-resources, test-compile, process-test-classes, test, prepare-package, package, pre-integration-test, integration-test, post-integration-test, verify, install, deploy]
  118. [DEBUG] Lifecycle clean -> [pre-clean, clean, post-clean]
  119. [DEBUG] Lifecycle site -> [pre-site, site, post-site, site-deploy]
  120. [DEBUG] Lifecycle default -> [validate, initialize, generate-sources, process-sources, generate-resources, process-resources, compile, process-classes, generate-test-sources, process-test-sources, generate-test-resources, process-test-resources, test-compile, process-test-classes, test, prepare-package, package, pre-integration-test, integration-test, post-integration-test, verify, install, deploy]
  121. [DEBUG] Lifecycle clean -> [pre-clean, clean, post-clean]
  122. [DEBUG] Lifecycle site -> [pre-site, site, post-site, site-deploy]
  123. [DEBUG] Lifecycle default -> [validate, initialize, generate-sources, process-sources, generate-resources, process-resources, compile, process-classes, generate-test-sources, process-test-sources, generate-test-resources, process-test-resources, test-compile, process-test-classes, test, prepare-package, package, pre-integration-test, integration-test, post-integration-test, verify, install, deploy]
  124. [DEBUG] Lifecycle clean -> [pre-clean, clean, post-clean]
  125. [DEBUG] Lifecycle site -> [pre-site, site, post-site, site-deploy]
  126. [DEBUG] Lifecycle default -> [validate, initialize, generate-sources, process-sources, generate-resources, process-resources, compile, process-classes, generate-test-sources, process-test-sources, generate-test-resources, process-test-resources, test-compile, process-test-classes, test, prepare-package, package, pre-integration-test, integration-test, post-integration-test, verify, install, deploy]
  127. [DEBUG] Lifecycle clean -> [pre-clean, clean, post-clean]
  128. [DEBUG] Lifecycle site -> [pre-site, site, post-site, site-deploy]
  129. [DEBUG] === PROJECT BUILD PLAN ================================================
  130. [DEBUG] Project:       io.github.theonlygusti:WizardServer:0.0.1-SNAPSHOT
  131. [DEBUG] Dependencies (collect): []
  132. [DEBUG] Dependencies (resolve): [compile, runtime, test]
  133. [DEBUG] Repositories (dependencies): [bukkit-repo (http://repo.bukkit.org/content/groups/public/, default, releases+snapshots), central (https://repo.maven.apache.org/maven2, default, releases)]
  134. [DEBUG] Repositories (plugins)     : [central (https://repo.maven.apache.org/maven2, default, releases)]
  135. [DEBUG] -----------------------------------------------------------------------
  136. [DEBUG] Goal:          org.apache.maven.plugins:maven-clean-plugin:2.5:clean (default-clean)
  137. [DEBUG] Style:         Regular
  138. [DEBUG] Configuration: <?xml version="1.0" encoding="UTF-8"?>
  139. <configuration>
  140.   <directory default-value="${project.build.directory}"/>
  141.   <excludeDefaultDirectories default-value="false">${clean.excludeDefaultDirectories}</excludeDefaultDirectories>
  142.   <failOnError default-value="true">${maven.clean.failOnError}</failOnError>
  143.   <followSymLinks default-value="false">${clean.followSymLinks}</followSymLinks>
  144.   <outputDirectory default-value="${project.build.outputDirectory}"/>
  145.   <reportDirectory default-value="${project.reporting.outputDirectory}"/>
  146.   <retryOnError default-value="true">${maven.clean.retryOnError}</retryOnError>
  147.   <skip default-value="false">${clean.skip}</skip>
  148.   <testOutputDirectory default-value="${project.build.testOutputDirectory}"/>
  149.   <verbose>${clean.verbose}</verbose>
  150. </configuration>
  151. [DEBUG] -----------------------------------------------------------------------
  152. [DEBUG] Goal:          org.apache.maven.plugins:maven-resources-plugin:2.6:resources (default-resources)
  153. [DEBUG] Style:         Regular
  154. [DEBUG] Configuration: <?xml version="1.0" encoding="UTF-8"?>
  155. <configuration>
  156.   <buildFilters default-value="${project.build.filters}"/>
  157.   <encoding default-value="${project.build.sourceEncoding}">${encoding}</encoding>
  158.   <escapeString>${maven.resources.escapeString}</escapeString>
  159.   <escapeWindowsPaths default-value="true">${maven.resources.escapeWindowsPaths}</escapeWindowsPaths>
  160.   <includeEmptyDirs default-value="false">${maven.resources.includeEmptyDirs}</includeEmptyDirs>
  161.   <outputDirectory default-value="${project.build.outputDirectory}"/>
  162.   <overwrite default-value="false">${maven.resources.overwrite}</overwrite>
  163.   <project default-value="${project}"/>
  164.   <resources default-value="${project.resources}"/>
  165.   <session default-value="${session}"/>
  166.   <supportMultiLineFiltering default-value="false">${maven.resources.supportMultiLineFiltering}</supportMultiLineFiltering>
  167.   <useBuildFilters default-value="true"/>
  168.   <useDefaultDelimiters default-value="true"/>
  169. </configuration>
  170. [DEBUG] -----------------------------------------------------------------------
  171. [DEBUG] Goal:          org.apache.maven.plugins:maven-compiler-plugin:3.1:compile (default-compile)
  172. [DEBUG] Style:         Regular
  173. [DEBUG] Configuration: <?xml version="1.0" encoding="UTF-8"?>
  174. <configuration>
  175.   <basedir default-value="${basedir}"/>
  176.   <buildDirectory default-value="${project.build.directory}"/>
  177.   <classpathElements default-value="${project.compileClasspathElements}"/>
  178.   <compileSourceRoots default-value="${project.compileSourceRoots}"/>
  179.   <compilerId default-value="javac">${maven.compiler.compilerId}</compilerId>
  180.   <compilerReuseStrategy default-value="${reuseCreated}">${maven.compiler.compilerReuseStrategy}</compilerReuseStrategy>
  181.   <compilerVersion>${maven.compiler.compilerVersion}</compilerVersion>
  182.   <debug default-value="true">${maven.compiler.debug}</debug>
  183.   <debuglevel>${maven.compiler.debuglevel}</debuglevel>
  184.   <encoding default-value="${project.build.sourceEncoding}">${encoding}</encoding>
  185.   <executable>${maven.compiler.executable}</executable>
  186.   <failOnError default-value="true">${maven.compiler.failOnError}</failOnError>
  187.   <forceJavacCompilerUse default-value="false">${maven.compiler.forceJavacCompilerUse}</forceJavacCompilerUse>
  188.   <fork default-value="false">${maven.compiler.fork}</fork>
  189.   <generatedSourcesDirectory default-value="${project.build.directory}/generated-sources/annotations"/>
  190.   <maxmem>${maven.compiler.maxmem}</maxmem>
  191.   <meminitial>${maven.compiler.meminitial}</meminitial>
  192.   <mojoExecution>${mojoExecution}</mojoExecution>
  193.   <optimize default-value="false">${maven.compiler.optimize}</optimize>
  194.   <outputDirectory default-value="${project.build.outputDirectory}"/>
  195.   <projectArtifact default-value="${project.artifact}"/>
  196.   <showDeprecation default-value="false">${maven.compiler.showDeprecation}</showDeprecation>
  197.   <showWarnings default-value="false">${maven.compiler.showWarnings}</showWarnings>
  198.   <skipMain>${maven.main.skip}</skipMain>
  199.   <skipMultiThreadWarning default-value="false">${maven.compiler.skipMultiThreadWarning}</skipMultiThreadWarning>
  200.   <source default-value="1.5">1.8</source>
  201.   <staleMillis default-value="0">${lastModGranularityMs}</staleMillis>
  202.   <target default-value="1.5">${maven.compiler.target}</target>
  203.   <useIncrementalCompilation default-value="true">${maven.compiler.useIncrementalCompilation}</useIncrementalCompilation>
  204.   <verbose default-value="false">${maven.compiler.verbose}</verbose>
  205.   <mavenSession default-value="${session}"/>
  206.   <session default-value="${session}"/>
  207. </configuration>
  208. [DEBUG] -----------------------------------------------------------------------
  209. [DEBUG] Goal:          org.apache.maven.plugins:maven-resources-plugin:2.6:testResources (default-testResources)
  210. [DEBUG] Style:         Regular
  211. [DEBUG] Configuration: <?xml version="1.0" encoding="UTF-8"?>
  212. <configuration>
  213.   <buildFilters default-value="${project.build.filters}"/>
  214.   <encoding default-value="${project.build.sourceEncoding}">${encoding}</encoding>
  215.   <escapeString>${maven.resources.escapeString}</escapeString>
  216.   <escapeWindowsPaths default-value="true">${maven.resources.escapeWindowsPaths}</escapeWindowsPaths>
  217.   <includeEmptyDirs default-value="false">${maven.resources.includeEmptyDirs}</includeEmptyDirs>
  218.   <outputDirectory default-value="${project.build.testOutputDirectory}"/>
  219.   <overwrite default-value="false">${maven.resources.overwrite}</overwrite>
  220.   <project default-value="${project}"/>
  221.   <resources default-value="${project.testResources}"/>
  222.   <session default-value="${session}"/>
  223.   <skip>${maven.test.skip}</skip>
  224.   <supportMultiLineFiltering default-value="false">${maven.resources.supportMultiLineFiltering}</supportMultiLineFiltering>
  225.   <useBuildFilters default-value="true"/>
  226.   <useDefaultDelimiters default-value="true"/>
  227. </configuration>
  228. [DEBUG] -----------------------------------------------------------------------
  229. [DEBUG] Goal:          org.apache.maven.plugins:maven-compiler-plugin:3.1:testCompile (default-testCompile)
  230. [DEBUG] Style:         Regular
  231. [DEBUG] Configuration: <?xml version="1.0" encoding="UTF-8"?>
  232. <configuration>
  233.   <basedir default-value="${basedir}"/>
  234.   <buildDirectory default-value="${project.build.directory}"/>
  235.   <classpathElements default-value="${project.testClasspathElements}"/>
  236.   <compileSourceRoots default-value="${project.testCompileSourceRoots}"/>
  237.   <compilerId default-value="javac">${maven.compiler.compilerId}</compilerId>
  238.   <compilerReuseStrategy default-value="${reuseCreated}">${maven.compiler.compilerReuseStrategy}</compilerReuseStrategy>
  239.   <compilerVersion>${maven.compiler.compilerVersion}</compilerVersion>
  240.   <debug default-value="true">${maven.compiler.debug}</debug>
  241.   <debuglevel>${maven.compiler.debuglevel}</debuglevel>
  242.   <encoding default-value="${project.build.sourceEncoding}">${encoding}</encoding>
  243.   <executable>${maven.compiler.executable}</executable>
  244.   <failOnError default-value="true">${maven.compiler.failOnError}</failOnError>
  245.   <forceJavacCompilerUse default-value="false">${maven.compiler.forceJavacCompilerUse}</forceJavacCompilerUse>
  246.   <fork default-value="false">${maven.compiler.fork}</fork>
  247.   <generatedTestSourcesDirectory default-value="${project.build.directory}/generated-test-sources/test-annotations"/>
  248.   <maxmem>${maven.compiler.maxmem}</maxmem>
  249.   <meminitial>${maven.compiler.meminitial}</meminitial>
  250.   <mojoExecution>${mojoExecution}</mojoExecution>
  251.   <optimize default-value="false">${maven.compiler.optimize}</optimize>
  252.   <outputDirectory default-value="${project.build.testOutputDirectory}"/>
  253.   <showDeprecation default-value="false">${maven.compiler.showDeprecation}</showDeprecation>
  254.   <showWarnings default-value="false">${maven.compiler.showWarnings}</showWarnings>
  255.   <skip>${maven.test.skip}</skip>
  256.   <skipMultiThreadWarning default-value="false">${maven.compiler.skipMultiThreadWarning}</skipMultiThreadWarning>
  257.   <source default-value="1.5">1.8</source>
  258.   <staleMillis default-value="0">${lastModGranularityMs}</staleMillis>
  259.   <target default-value="1.5">${maven.compiler.target}</target>
  260.   <testSource>${maven.compiler.testSource}</testSource>
  261.   <testTarget>${maven.compiler.testTarget}</testTarget>
  262.   <useIncrementalCompilation default-value="true">${maven.compiler.useIncrementalCompilation}</useIncrementalCompilation>
  263.   <verbose default-value="false">${maven.compiler.verbose}</verbose>
  264.   <mavenSession default-value="${session}"/>
  265.   <session default-value="${session}"/>
  266. </configuration>
  267. [DEBUG] -----------------------------------------------------------------------
  268. [DEBUG] Goal:          org.apache.maven.plugins:maven-surefire-plugin:2.12.4:test (default-test)
  269. [DEBUG] Style:         Regular
  270. [DEBUG] Configuration: <?xml version="1.0" encoding="UTF-8"?>
  271. <configuration>
  272.   <argLine>${argLine}</argLine>
  273.   <basedir default-value="${basedir}"/>
  274.   <childDelegation default-value="false">${childDelegation}</childDelegation>
  275.   <classesDirectory default-value="${project.build.outputDirectory}"/>
  276.   <debugForkedProcess>${maven.surefire.debug}</debugForkedProcess>
  277.   <disableXmlReport default-value="false">${disableXmlReport}</disableXmlReport>
  278.   <enableAssertions default-value="true">${enableAssertions}</enableAssertions>
  279.   <excludedGroups>${excludedGroups}</excludedGroups>
  280.   <failIfNoSpecifiedTests>${surefire.failIfNoSpecifiedTests}</failIfNoSpecifiedTests>
  281.   <failIfNoTests>${failIfNoTests}</failIfNoTests>
  282.   <forkMode default-value="once">${forkMode}</forkMode>
  283.   <forkedProcessTimeoutInSeconds>${surefire.timeout}</forkedProcessTimeoutInSeconds>
  284.   <groups>${groups}</groups>
  285.   <junitArtifactName default-value="junit:junit">${junitArtifactName}</junitArtifactName>
  286.   <jvm>${jvm}</jvm>
  287.   <localRepository default-value="${localRepository}"/>
  288.   <objectFactory>${objectFactory}</objectFactory>
  289.   <parallel>${parallel}</parallel>
  290.   <parallelMavenExecution default-value="${session.parallel}"/>
  291.   <perCoreThreadCount default-value="true">${perCoreThreadCount}</perCoreThreadCount>
  292.   <pluginArtifactMap>${plugin.artifactMap}</pluginArtifactMap>
  293.   <pluginDescriptor default-value="${plugin}"/>
  294.   <printSummary default-value="true">${surefire.printSummary}</printSummary>
  295.   <projectArtifactMap>${project.artifactMap}</projectArtifactMap>
  296.   <redirectTestOutputToFile default-value="false">${maven.test.redirectTestOutputToFile}</redirectTestOutputToFile>
  297.   <remoteRepositories default-value="${project.pluginArtifactRepositories}"/>
  298.   <reportFormat default-value="brief">${surefire.reportFormat}</reportFormat>
  299.   <reportNameSuffix default-value="">${surefire.reportNameSuffix}</reportNameSuffix>
  300.   <reportsDirectory default-value="${project.build.directory}/surefire-reports"/>
  301.   <runOrder default-value="filesystem"/>
  302.   <skip default-value="false">${maven.test.skip}</skip>
  303.   <skipExec>${maven.test.skip.exec}</skipExec>
  304.   <skipTests default-value="false">${skipTests}</skipTests>
  305.   <test>${test}</test>
  306.   <testClassesDirectory default-value="${project.build.testOutputDirectory}"/>
  307.   <testFailureIgnore default-value="false">${maven.test.failure.ignore}</testFailureIgnore>
  308.   <testNGArtifactName default-value="org.testng:testng">${testNGArtifactName}</testNGArtifactName>
  309.   <testSourceDirectory default-value="${project.build.testSourceDirectory}"/>
  310.   <threadCount>${threadCount}</threadCount>
  311.   <trimStackTrace default-value="true">${trimStackTrace}</trimStackTrace>
  312.   <useFile default-value="true">${surefire.useFile}</useFile>
  313.   <useManifestOnlyJar default-value="true">${surefire.useManifestOnlyJar}</useManifestOnlyJar>
  314.   <useSystemClassLoader default-value="true">${surefire.useSystemClassLoader}</useSystemClassLoader>
  315.   <useUnlimitedThreads default-value="false">${useUnlimitedThreads}</useUnlimitedThreads>
  316.   <workingDirectory>${basedir}</workingDirectory>
  317.   <project default-value="${project}"/>
  318.   <session default-value="${session}"/>
  319. </configuration>
  320. [DEBUG] -----------------------------------------------------------------------
  321. [DEBUG] Goal:          org.apache.maven.plugins:maven-jar-plugin:2.4:jar (default-jar)
  322. [DEBUG] Style:         Regular
  323. [DEBUG] Configuration: <?xml version="1.0" encoding="UTF-8"?>
  324. <configuration>
  325.   <classesDirectory default-value="${project.build.outputDirectory}"/>
  326.   <defaultManifestFile default-value="${project.build.outputDirectory}/META-INF/MANIFEST.MF"/>
  327.   <finalName default-value="${project.build.finalName}">${jar.finalName}</finalName>
  328.   <forceCreation default-value="false">${jar.forceCreation}</forceCreation>
  329.   <outputDirectory default-value="${project.build.directory}"/>
  330.   <project default-value="${project}"/>
  331.   <session default-value="${session}"/>
  332.   <skipIfEmpty default-value="false">${jar.skipIfEmpty}</skipIfEmpty>
  333.   <useDefaultManifestFile default-value="false">${jar.useDefaultManifestFile}</useDefaultManifestFile>
  334. </configuration>
  335. [DEBUG] -----------------------------------------------------------------------
  336. [DEBUG] Goal:          org.apache.maven.plugins:maven-install-plugin:2.4:install (default-install)
  337. [DEBUG] Style:         Regular
  338. [DEBUG] Configuration: <?xml version="1.0" encoding="UTF-8"?>
  339. <configuration>
  340.   <artifact default-value="${project.artifact}"/>
  341.   <attachedArtifacts default-value="${project.attachedArtifacts}"/>
  342.   <createChecksum default-value="false">${createChecksum}</createChecksum>
  343.   <localRepository>${localRepository}</localRepository>
  344.   <packaging default-value="${project.packaging}"/>
  345.   <pomFile default-value="${project.file}"/>
  346.   <skip default-value="false">${maven.install.skip}</skip>
  347.   <updateReleaseInfo default-value="false">${updateReleaseInfo}</updateReleaseInfo>
  348. </configuration>
  349. [DEBUG] =======================================================================
  350. [DEBUG] Dependency collection stats: {ConflictMarker.analyzeTime=1, ConflictMarker.markTime=0, ConflictMarker.nodeCount=2, ConflictIdSorter.graphTime=0, ConflictIdSorter.topsortTime=1, ConflictIdSorter.conflictIdCount=1, ConflictIdSorter.conflictIdCycleCount=0, ConflictResolver.totalTime=2, ConflictResolver.conflictItemCount=1, DefaultDependencyCollector.collectTime=6, DefaultDependencyCollector.transformTime=5}
  351. [DEBUG] io.github.theonlygusti:WizardServer:jar:0.0.1-SNAPSHOT
  352. [DEBUG]    org.bukkit:bukkit:jar:1.7.9-R0.2:provided
  353. [INFO]
  354. [INFO] --- maven-clean-plugin:2.5:clean (default-clean) @ WizardServer ---
  355. [DEBUG] Dependency collection stats: {ConflictMarker.analyzeTime=0, ConflictMarker.markTime=0, ConflictMarker.nodeCount=3, ConflictIdSorter.graphTime=0, ConflictIdSorter.topsortTime=0, ConflictIdSorter.conflictIdCount=3, ConflictIdSorter.conflictIdCycleCount=0, ConflictResolver.totalTime=0, ConflictResolver.conflictItemCount=3, DefaultDependencyCollector.collectTime=14, DefaultDependencyCollector.transformTime=0}
  356. [DEBUG] org.apache.maven.plugins:maven-clean-plugin:jar:2.5:
  357. [DEBUG]    org.apache.maven:maven-plugin-api:jar:2.0.6:compile
  358. [DEBUG]    org.codehaus.plexus:plexus-utils:jar:3.0:compile
  359. [DEBUG] Created new class realm plugin>org.apache.maven.plugins:maven-clean-plugin:2.5
  360. [DEBUG] Importing foreign packages into class realm plugin>org.apache.maven.plugins:maven-clean-plugin:2.5
  361. [DEBUG]   Imported:  < maven.api
  362. [DEBUG] Populating class realm plugin>org.apache.maven.plugins:maven-clean-plugin:2.5
  363. [DEBUG]   Included: org.apache.maven.plugins:maven-clean-plugin:jar:2.5
  364. [DEBUG]   Included: org.codehaus.plexus:plexus-utils:jar:3.0
  365. [DEBUG] Configuring mojo org.apache.maven.plugins:maven-clean-plugin:2.5:clean from plugin realm ClassRealm[plugin>org.apache.maven.plugins:maven-clean-plugin:2.5, parent: sun.misc.Launcher$AppClassLoader@55f96302]
  366. [DEBUG] Configuring mojo 'org.apache.maven.plugins:maven-clean-plugin:2.5:clean' with basic configurator -->
  367. [DEBUG]   (f) directory = /Users/George/Documents/Projects/MMORPG/dev/plugins/WizardServer/target
  368. [DEBUG]   (f) excludeDefaultDirectories = false
  369. [DEBUG]   (f) failOnError = true
  370. [DEBUG]   (f) followSymLinks = false
  371. [DEBUG]   (f) outputDirectory = /Users/George/Documents/Projects/MMORPG/dev/plugins/WizardServer/target/classes
  372. [DEBUG]   (f) reportDirectory = /Users/George/Documents/Projects/MMORPG/dev/plugins/WizardServer/target/site
  373. [DEBUG]   (f) retryOnError = true
  374. [DEBUG]   (f) skip = false
  375. [DEBUG]   (f) testOutputDirectory = /Users/George/Documents/Projects/MMORPG/dev/plugins/WizardServer/target/test-classes
  376. [DEBUG] -- end configuration --
  377. [INFO] Deleting /Users/George/Documents/Projects/MMORPG/dev/plugins/WizardServer/target
  378. [INFO] Deleting file /Users/George/Documents/Projects/MMORPG/dev/plugins/WizardServer/target/maven-status/maven-compiler-plugin/compile/default-compile/inputFiles.lst
  379. [INFO] Deleting file /Users/George/Documents/Projects/MMORPG/dev/plugins/WizardServer/target/maven-status/maven-compiler-plugin/compile/default-compile/createdFiles.lst
  380. [INFO] Deleting directory /Users/George/Documents/Projects/MMORPG/dev/plugins/WizardServer/target/maven-status/maven-compiler-plugin/compile/default-compile
  381. [INFO] Deleting directory /Users/George/Documents/Projects/MMORPG/dev/plugins/WizardServer/target/maven-status/maven-compiler-plugin/compile
  382. [INFO] Deleting directory /Users/George/Documents/Projects/MMORPG/dev/plugins/WizardServer/target/maven-status/maven-compiler-plugin
  383. [INFO] Deleting directory /Users/George/Documents/Projects/MMORPG/dev/plugins/WizardServer/target/maven-status
  384. [INFO] Deleting directory /Users/George/Documents/Projects/MMORPG/dev/plugins/WizardServer/target/generated-sources/annotations
  385. [INFO] Deleting directory /Users/George/Documents/Projects/MMORPG/dev/plugins/WizardServer/target/generated-sources
  386. [INFO] Deleting file /Users/George/Documents/Projects/MMORPG/dev/plugins/WizardServer/target/classes/plugin.yml
  387. [INFO] Deleting directory /Users/George/Documents/Projects/MMORPG/dev/plugins/WizardServer/target/classes
  388. [INFO] Deleting directory /Users/George/Documents/Projects/MMORPG/dev/plugins/WizardServer/target
  389. [DEBUG] Skipping non-existing directory /Users/George/Documents/Projects/MMORPG/dev/plugins/WizardServer/target/classes
  390. [DEBUG] Skipping non-existing directory /Users/George/Documents/Projects/MMORPG/dev/plugins/WizardServer/target/test-classes
  391. [DEBUG] Skipping non-existing directory /Users/George/Documents/Projects/MMORPG/dev/plugins/WizardServer/target/site
  392. [INFO]
  393. [INFO] --- maven-resources-plugin:2.6:resources (default-resources) @ WizardServer ---
  394. [DEBUG] Dependency collection stats: {ConflictMarker.analyzeTime=0, ConflictMarker.markTime=1, ConflictMarker.nodeCount=77, ConflictIdSorter.graphTime=0, ConflictIdSorter.topsortTime=0, ConflictIdSorter.conflictIdCount=26, ConflictIdSorter.conflictIdCycleCount=0, ConflictResolver.totalTime=2, ConflictResolver.conflictItemCount=74, DefaultDependencyCollector.collectTime=76, DefaultDependencyCollector.transformTime=3}
  395. [DEBUG] org.apache.maven.plugins:maven-resources-plugin:jar:2.6:
  396. [DEBUG]    org.apache.maven:maven-plugin-api:jar:2.0.6:compile
  397. [DEBUG]    org.apache.maven:maven-project:jar:2.0.6:compile
  398. [DEBUG]       org.apache.maven:maven-profile:jar:2.0.6:compile
  399. [DEBUG]       org.apache.maven:maven-artifact-manager:jar:2.0.6:compile
  400. [DEBUG]       org.apache.maven:maven-plugin-registry:jar:2.0.6:compile
  401. [DEBUG]    org.apache.maven:maven-core:jar:2.0.6:compile
  402. [DEBUG]       org.apache.maven:maven-plugin-parameter-documenter:jar:2.0.6:compile
  403. [DEBUG]       org.apache.maven.reporting:maven-reporting-api:jar:2.0.6:compile
  404. [DEBUG]          org.apache.maven.doxia:doxia-sink-api:jar:1.0-alpha-7:compile
  405. [DEBUG]       org.apache.maven:maven-repository-metadata:jar:2.0.6:compile
  406. [DEBUG]       org.apache.maven:maven-error-diagnostics:jar:2.0.6:compile
  407. [DEBUG]       commons-cli:commons-cli:jar:1.0:compile
  408. [DEBUG]       org.apache.maven:maven-plugin-descriptor:jar:2.0.6:compile
  409. [DEBUG]       org.codehaus.plexus:plexus-interactivity-api:jar:1.0-alpha-4:compile
  410. [DEBUG]       classworlds:classworlds:jar:1.1:compile
  411. [DEBUG]    org.apache.maven:maven-artifact:jar:2.0.6:compile
  412. [DEBUG]    org.apache.maven:maven-settings:jar:2.0.6:compile
  413. [DEBUG]    org.apache.maven:maven-model:jar:2.0.6:compile
  414. [DEBUG]    org.apache.maven:maven-monitor:jar:2.0.6:compile
  415. [DEBUG]    org.codehaus.plexus:plexus-container-default:jar:1.0-alpha-9-stable-1:compile
  416. [DEBUG]       junit:junit:jar:3.8.1:compile
  417. [DEBUG]    org.codehaus.plexus:plexus-utils:jar:2.0.5:compile
  418. [DEBUG]    org.apache.maven.shared:maven-filtering:jar:1.1:compile
  419. [DEBUG]       org.sonatype.plexus:plexus-build-api:jar:0.0.4:compile
  420. [DEBUG]    org.codehaus.plexus:plexus-interpolation:jar:1.13:compile
  421. [DEBUG] Created new class realm plugin>org.apache.maven.plugins:maven-resources-plugin:2.6
  422. [DEBUG] Importing foreign packages into class realm plugin>org.apache.maven.plugins:maven-resources-plugin:2.6
  423. [DEBUG]   Imported:  < maven.api
  424. [DEBUG] Populating class realm plugin>org.apache.maven.plugins:maven-resources-plugin:2.6
  425. [DEBUG]   Included: org.apache.maven.plugins:maven-resources-plugin:jar:2.6
  426. [DEBUG]   Included: org.apache.maven.reporting:maven-reporting-api:jar:2.0.6
  427. [DEBUG]   Included: org.apache.maven.doxia:doxia-sink-api:jar:1.0-alpha-7
  428. [DEBUG]   Included: commons-cli:commons-cli:jar:1.0
  429. [DEBUG]   Included: org.codehaus.plexus:plexus-interactivity-api:jar:1.0-alpha-4
  430. [DEBUG]   Included: junit:junit:jar:3.8.1
  431. [DEBUG]   Included: org.codehaus.plexus:plexus-utils:jar:2.0.5
  432. [DEBUG]   Included: org.apache.maven.shared:maven-filtering:jar:1.1
  433. [DEBUG]   Included: org.sonatype.plexus:plexus-build-api:jar:0.0.4
  434. [DEBUG]   Included: org.codehaus.plexus:plexus-interpolation:jar:1.13
  435. [DEBUG] Configuring mojo org.apache.maven.plugins:maven-resources-plugin:2.6:resources from plugin realm ClassRealm[plugin>org.apache.maven.plugins:maven-resources-plugin:2.6, parent: sun.misc.Launcher$AppClassLoader@55f96302]
  436. [DEBUG] Configuring mojo 'org.apache.maven.plugins:maven-resources-plugin:2.6:resources' with basic configurator -->
  437. [DEBUG]   (f) buildFilters = []
  438. [DEBUG]   (f) escapeWindowsPaths = true
  439. [DEBUG]   (s) includeEmptyDirs = false
  440. [DEBUG]   (s) outputDirectory = /Users/George/Documents/Projects/MMORPG/dev/plugins/WizardServer/target/classes
  441. [DEBUG]   (s) overwrite = false
  442. [DEBUG]   (f) project = MavenProject: io.github.theonlygusti:WizardServer:0.0.1-SNAPSHOT @ /Users/George/Documents/Projects/MMORPG/dev/plugins/WizardServer/pom.xml
  443. [DEBUG]   (s) resources = [Resource {targetPath: null, filtering: false, FileSet {directory: /Users/George/Documents/Projects/MMORPG/dev/plugins/WizardServer/src/main/resources, PatternSet [includes: {}, excludes: {}]}}]
  444. [DEBUG]   (f) session = org.apache.maven.execution.MavenSession@7f69d591
  445. [DEBUG]   (f) supportMultiLineFiltering = false
  446. [DEBUG]   (f) useBuildFilters = true
  447. [DEBUG]   (s) useDefaultDelimiters = true
  448. [DEBUG] -- end configuration --
  449. [DEBUG] properties used {java.vendor=Oracle Corporation, sun.java.launcher=SUN_STANDARD, env.XPC_SERVICE_NAME=0, sun.management.compiler=HotSpot 64-Bit Tiered Compilers, os.name=Mac OS X, sun.boot.class.path=/Library/Java/JavaVirtualMachines/jdk1.8.0_91.jdk/Contents/Home/jre/lib/resources.jar:/Library/Java/JavaVirtualMachines/jdk1.8.0_91.jdk/Contents/Home/jre/lib/rt.jar:/Library/Java/JavaVirtualMachines/jdk1.8.0_91.jdk/Contents/Home/jre/lib/sunrsasign.jar:/Library/Java/JavaVirtualMachines/jdk1.8.0_91.jdk/Contents/Home/jre/lib/jsse.jar:/Library/Java/JavaVirtualMachines/jdk1.8.0_91.jdk/Contents/Home/jre/lib/jce.jar:/Library/Java/JavaVirtualMachines/jdk1.8.0_91.jdk/Contents/Home/jre/lib/charsets.jar:/Library/Java/JavaVirtualMachines/jdk1.8.0_91.jdk/Contents/Home/jre/lib/jfr.jar:/Library/Java/JavaVirtualMachines/jdk1.8.0_91.jdk/Contents/Home/jre/classes, env.TMPDIR=/var/folders/06/86nmfyvd3x9g2xzgts5xsfgc0000gn/T/, env.PWD=/Users/George/Documents/Projects/MMORPG/dev/plugins/WizardServer, user.country.format=GB, env.LANG=en_GB.UTF-8, java.vm.specification.vendor=Oracle Corporation, java.runtime.version=1.8.0_91-b14, env.Apple_PubSub_Socket_Render=/private/tmp/com.apple.launchd.5v63EUyeL5/Render, env.DISPLAY=/private/tmp/com.apple.launchd.IErj67O2Sa/org.macosforge.xquartz:0, user.name=George, maven.build.version=Apache Maven 3.3.9 (bb52d8502b132ec0a5a3f4c09453c07478323dc5; 2015-11-10T16:41:47+00:00), env.USER=George, env.SHELL=/bin/bash, env.__CF_USER_TEXT_ENCODING=0x1F5:0x0:0x0, env.PATH=/Library/Frameworks/Python.framework/Versions/2.7/bin:/Library/Frameworks/Python.framework/Versions/3.4/bin:/usr/local/bin:/usr/bin:/bin:/usr/sbin:/sbin:/opt/X11/bin:/usr/local/git/bin, user.language=en, sun.boot.library.path=/Library/Java/JavaVirtualMachines/jdk1.8.0_91.jdk/Contents/Home/jre/lib, classworlds.conf=/usr/local/Cellar/maven/3.3.9/libexec/bin/m2.conf, env.XPC_FLAGS=0x0, java.version=1.8.0_91, user.timezone=Europe/London, sun.arch.data.model=64, env.JAVA_MAIN_CLASS_44068=org.codehaus.plexus.classworlds.launcher.Launcher, http.nonProxyHosts=local|*.local|169.254/16|*.169.254/16, java.endorsed.dirs=/Library/Java/JavaVirtualMachines/jdk1.8.0_91.jdk/Contents/Home/jre/lib/endorsed, sun.cpu.isalist=, sun.jnu.encoding=UTF-8, file.encoding.pkg=sun.io, env.SHLVL=1, file.separator=/, java.specification.name=Java Platform API Specification, java.class.version=52.0, org.slf4j.simpleLogger.defaultLogLevel=debug, user.country=US, java.home=/Library/Java/JavaVirtualMachines/jdk1.8.0_91.jdk/Contents/Home/jre, java.vm.info=mixed mode, env.LOGNAME=George, os.version=10.11.4, env.TERM_PROGRAM_VERSION=361.1, path.separator=:, java.vm.version=25.91-b14, env.JAVA_HOME=/Library/Java/JavaVirtualMachines/jdk1.8.0_91.jdk/Contents/Home, java.awt.printerjob=sun.lwawt.macosx.CPrinterJob, env.TERM=xterm-256color, sun.io.unicode.encoding=UnicodeBig, awt.toolkit=sun.lwawt.macosx.LWCToolkit, socksNonProxyHosts=local|*.local|169.254/16|*.169.254/16, ftp.nonProxyHosts=local|*.local|169.254/16|*.169.254/16, user.home=/Users/George, env.OLDPWD=/Users/George/Documents/Projects/MMORPG/dev/plugins/WizardServer, java.specification.vendor=Oracle Corporation, env.TERM_PROGRAM=Apple_Terminal, java.library.path=/Users/George/Library/Java/Extensions:/Library/Java/Extensions:/Network/Library/Java/Extensions:/System/Library/Java/Extensions:/usr/lib/java:., java.vendor.url=http://java.oracle.com/, env.MAVEN_CMD_LINE_ARGS= clean install -X, java.vm.vendor=Oracle Corporation, gopherProxySet=false, maven.home=/usr/local/Cellar/maven/3.3.9/libexec, java.runtime.name=Java(TM) SE Runtime Environment, sun.java.command=org.codehaus.plexus.classworlds.launcher.Launcher clean install -X, java.class.path=/usr/local/Cellar/maven/3.3.9/libexec/boot/plexus-classworlds-2.5.2.jar, env.TERM_SESSION_ID=B7038F45-DA64-4D4C-AEC3-7F7BAAC93CF4, maven.version=3.3.9, java.vm.specification.name=Java Virtual Machine Specification, java.vm.specification.version=1.8, sun.cpu.endian=little, sun.os.patch.level=unknown, env.HOME=/Users/George, java.io.tmpdir=/var/folders/06/86nmfyvd3x9g2xzgts5xsfgc0000gn/T/, java.vendor.url.bug=http://bugreport.sun.com/bugreport/, maven.multiModuleProjectDirectory=/Users/George/Documents/Projects/MMORPG/dev/plugins/WizardServer, env.SSH_AUTH_SOCK=/private/tmp/com.apple.launchd.qpMndlXq0c/Listeners, os.arch=x86_64, java.awt.graphicsenv=sun.awt.CGraphicsEnvironment, java.ext.dirs=/Users/George/Library/Java/Extensions:/Library/Java/JavaVirtualMachines/jdk1.8.0_91.jdk/Contents/Home/jre/lib/ext:/Library/Java/Extensions:/Network/Library/Java/Extensions:/System/Library/Java/Extensions:/usr/lib/java, user.dir=/Users/George/Documents/Projects/MMORPG/dev/plugins/WizardServer, line.separator=
  450. , java.vm.name=Java HotSpot(TM) 64-Bit Server VM, file.encoding=UTF-8, java.specification.version=1.8, env.MAVEN_PROJECTBASEDIR=/Users/George/Documents/Projects/MMORPG/dev/plugins/WizardServer}
  451. [WARNING] Using platform encoding (UTF-8 actually) to copy filtered resources, i.e. build is platform dependent!
  452. [DEBUG] resource with targetPath null
  453. directory /Users/George/Documents/Projects/MMORPG/dev/plugins/WizardServer/src/main/resources
  454. excludes []
  455. includes []
  456. [DEBUG] ignoreDelta true
  457. [INFO] Copying 1 resource
  458. [DEBUG] file plugin.yml has a filtered file extension
  459. [DEBUG] copy /Users/George/Documents/Projects/MMORPG/dev/plugins/WizardServer/src/main/resources/plugin.yml to /Users/George/Documents/Projects/MMORPG/dev/plugins/WizardServer/target/classes/plugin.yml
  460. [DEBUG] no use filter components
  461. [INFO]
  462. [INFO] --- maven-compiler-plugin:3.1:compile (default-compile) @ WizardServer ---
  463. [DEBUG] Dependency collection stats: {ConflictMarker.analyzeTime=0, ConflictMarker.markTime=0, ConflictMarker.nodeCount=160, ConflictIdSorter.graphTime=1, ConflictIdSorter.topsortTime=0, ConflictIdSorter.conflictIdCount=43, ConflictIdSorter.conflictIdCycleCount=0, ConflictResolver.totalTime=1, ConflictResolver.conflictItemCount=63, DefaultDependencyCollector.collectTime=129, DefaultDependencyCollector.transformTime=2}
  464. [DEBUG] org.apache.maven.plugins:maven-compiler-plugin:jar:3.1:
  465. [DEBUG]    org.apache.maven:maven-plugin-api:jar:2.0.9:compile
  466. [DEBUG]    org.apache.maven:maven-artifact:jar:2.0.9:compile
  467. [DEBUG]       org.codehaus.plexus:plexus-utils:jar:1.5.1:compile
  468. [DEBUG]    org.apache.maven:maven-core:jar:2.0.9:compile
  469. [DEBUG]       org.apache.maven:maven-settings:jar:2.0.9:compile
  470. [DEBUG]       org.apache.maven:maven-plugin-parameter-documenter:jar:2.0.9:compile
  471. [DEBUG]       org.apache.maven:maven-profile:jar:2.0.9:compile
  472. [DEBUG]       org.apache.maven:maven-model:jar:2.0.9:compile
  473. [DEBUG]       org.apache.maven:maven-repository-metadata:jar:2.0.9:compile
  474. [DEBUG]       org.apache.maven:maven-error-diagnostics:jar:2.0.9:compile
  475. [DEBUG]       org.apache.maven:maven-project:jar:2.0.9:compile
  476. [DEBUG]          org.apache.maven:maven-plugin-registry:jar:2.0.9:compile
  477. [DEBUG]       org.apache.maven:maven-plugin-descriptor:jar:2.0.9:compile
  478. [DEBUG]       org.apache.maven:maven-artifact-manager:jar:2.0.9:compile
  479. [DEBUG]       org.apache.maven:maven-monitor:jar:2.0.9:compile
  480. [DEBUG]    org.apache.maven:maven-toolchain:jar:1.0:compile
  481. [DEBUG]    org.apache.maven.shared:maven-shared-utils:jar:0.1:compile
  482. [DEBUG]       com.google.code.findbugs:jsr305:jar:2.0.1:compile
  483. [DEBUG]    org.apache.maven.shared:maven-shared-incremental:jar:1.1:compile
  484. [DEBUG]       org.codehaus.plexus:plexus-component-annotations:jar:1.5.5:compile
  485. [DEBUG]    org.codehaus.plexus:plexus-compiler-api:jar:2.2:compile
  486. [DEBUG]    org.codehaus.plexus:plexus-compiler-manager:jar:2.2:compile
  487. [DEBUG]    org.codehaus.plexus:plexus-compiler-javac:jar:2.2:runtime
  488. [DEBUG]    org.codehaus.plexus:plexus-container-default:jar:1.5.5:compile
  489. [DEBUG]       org.codehaus.plexus:plexus-classworlds:jar:2.2.2:compile
  490. [DEBUG]       org.apache.xbean:xbean-reflect:jar:3.4:compile
  491. [DEBUG]          log4j:log4j:jar:1.2.12:compile
  492. [DEBUG]          commons-logging:commons-logging-api:jar:1.1:compile
  493. [DEBUG]       com.google.collections:google-collections:jar:1.0:compile
  494. [DEBUG]       junit:junit:jar:3.8.2:compile
  495. [DEBUG] Created new class realm plugin>org.apache.maven.plugins:maven-compiler-plugin:3.1
  496. [DEBUG] Importing foreign packages into class realm plugin>org.apache.maven.plugins:maven-compiler-plugin:3.1
  497. [DEBUG]   Imported:  < maven.api
  498. [DEBUG] Populating class realm plugin>org.apache.maven.plugins:maven-compiler-plugin:3.1
  499. [DEBUG]   Included: org.apache.maven.plugins:maven-compiler-plugin:jar:3.1
  500. [DEBUG]   Included: org.codehaus.plexus:plexus-utils:jar:1.5.1
  501. [DEBUG]   Included: org.apache.maven.shared:maven-shared-utils:jar:0.1
  502. [DEBUG]   Included: com.google.code.findbugs:jsr305:jar:2.0.1
  503. [DEBUG]   Included: org.apache.maven.shared:maven-shared-incremental:jar:1.1
  504. [DEBUG]   Included: org.codehaus.plexus:plexus-component-annotations:jar:1.5.5
  505. [DEBUG]   Included: org.codehaus.plexus:plexus-compiler-api:jar:2.2
  506. [DEBUG]   Included: org.codehaus.plexus:plexus-compiler-manager:jar:2.2
  507. [DEBUG]   Included: org.codehaus.plexus:plexus-compiler-javac:jar:2.2
  508. [DEBUG]   Included: org.apache.xbean:xbean-reflect:jar:3.4
  509. [DEBUG]   Included: log4j:log4j:jar:1.2.12
  510. [DEBUG]   Included: commons-logging:commons-logging-api:jar:1.1
  511. [DEBUG]   Included: com.google.collections:google-collections:jar:1.0
  512. [DEBUG]   Included: junit:junit:jar:3.8.2
  513. [DEBUG] Configuring mojo org.apache.maven.plugins:maven-compiler-plugin:3.1:compile from plugin realm ClassRealm[plugin>org.apache.maven.plugins:maven-compiler-plugin:3.1, parent: sun.misc.Launcher$AppClassLoader@55f96302]
  514. [DEBUG] Configuring mojo 'org.apache.maven.plugins:maven-compiler-plugin:3.1:compile' with basic configurator -->
  515. [DEBUG]   (f) basedir = /Users/George/Documents/Projects/MMORPG/dev/plugins/WizardServer
  516. [DEBUG]   (f) buildDirectory = /Users/George/Documents/Projects/MMORPG/dev/plugins/WizardServer/target
  517. [DEBUG]   (f) classpathElements = [/Users/George/Documents/Projects/MMORPG/dev/plugins/WizardServer/target/classes, /Users/George/.m2/repository/org/bukkit/bukkit/1.7.9-R0.2/bukkit-1.7.9-R0.2.jar]
  518. [DEBUG]   (f) compileSourceRoots = [/Users/George/Documents/Projects/MMORPG/dev/plugins/WizardServer/src/main/java]
  519. [DEBUG]   (f) compilerId = javac
  520. [DEBUG]   (f) debug = true
  521. [DEBUG]   (f) failOnError = true
  522. [DEBUG]   (f) forceJavacCompilerUse = false
  523. [DEBUG]   (f) fork = false
  524. [DEBUG]   (f) generatedSourcesDirectory = /Users/George/Documents/Projects/MMORPG/dev/plugins/WizardServer/target/generated-sources/annotations
  525. [DEBUG]   (f) mojoExecution = org.apache.maven.plugins:maven-compiler-plugin:3.1:compile {execution: default-compile}
  526. [DEBUG]   (f) optimize = false
  527. [DEBUG]   (f) outputDirectory = /Users/George/Documents/Projects/MMORPG/dev/plugins/WizardServer/target/classes
  528. [DEBUG]   (f) projectArtifact = io.github.theonlygusti:WizardServer:jar:0.0.1-SNAPSHOT
  529. [DEBUG]   (f) showDeprecation = false
  530. [DEBUG]   (f) showWarnings = false
  531. [DEBUG]   (f) skipMultiThreadWarning = false
  532. [DEBUG]   (f) source = 1.8
  533. [DEBUG]   (f) staleMillis = 0
  534. [DEBUG]   (f) target = 1.5
  535. [DEBUG]   (f) useIncrementalCompilation = true
  536. [DEBUG]   (f) verbose = false
  537. [DEBUG]   (f) mavenSession = org.apache.maven.execution.MavenSession@7f69d591
  538. [DEBUG]   (f) session = org.apache.maven.execution.MavenSession@7f69d591
  539. [DEBUG] -- end configuration --
  540. [DEBUG] Using compiler 'javac'.
  541. [DEBUG] Source directories: [/Users/George/Documents/Projects/MMORPG/dev/plugins/WizardServer/src/main/java]
  542. [DEBUG] Classpath: [/Users/George/Documents/Projects/MMORPG/dev/plugins/WizardServer/target/classes
  543.  /Users/George/.m2/repository/org/bukkit/bukkit/1.7.9-R0.2/bukkit-1.7.9-R0.2.jar]
  544. [DEBUG] Output directory: /Users/George/Documents/Projects/MMORPG/dev/plugins/WizardServer/target/classes
  545. [DEBUG] CompilerReuseStrategy: reuseCreated
  546. [DEBUG] useIncrementalCompilation enabled
  547. [DEBUG] Stale source detected: /Users/George/Documents/Projects/MMORPG/dev/plugins/WizardServer/src/main/java/io/github/theonlygusti/wizardserver/WizardServer.java
  548. [INFO] Changes detected - recompiling the module!
  549. [DEBUG] Classpath:
  550. [DEBUG]  /Users/George/Documents/Projects/MMORPG/dev/plugins/WizardServer/target/classes
  551. [DEBUG]  /Users/George/.m2/repository/org/bukkit/bukkit/1.7.9-R0.2/bukkit-1.7.9-R0.2.jar
  552. [DEBUG] Source roots:
  553. [DEBUG]  /Users/George/Documents/Projects/MMORPG/dev/plugins/WizardServer/src/main/java
  554. [DEBUG] Command line options:
  555. [DEBUG] -d /Users/George/Documents/Projects/MMORPG/dev/plugins/WizardServer/target/classes -classpath /Users/George/Documents/Projects/MMORPG/dev/plugins/WizardServer/target/classes:/Users/George/.m2/repository/org/bukkit/bukkit/1.7.9-R0.2/bukkit-1.7.9-R0.2.jar: -sourcepath /Users/George/Documents/Projects/MMORPG/dev/plugins/WizardServer/src/main/java: -s /Users/George/Documents/Projects/MMORPG/dev/plugins/WizardServer/target/generated-sources/annotations -g -nowarn -target 1.5 -source 1.8
  556. [WARNING] File encoding has not been set, using platform encoding UTF-8, i.e. build is platform dependent!
  557. [DEBUG] incrementalBuildHelper#beforeRebuildExecution
  558. [INFO] Compiling 1 source file to /Users/George/Documents/Projects/MMORPG/dev/plugins/WizardServer/target/classes
  559. javacTask: source release 1.8 requires target release 1.8
  560. [DEBUG] incrementalBuildHelper#afterRebuildExecution
  561. [INFO] -------------------------------------------------------------
  562. [ERROR] COMPILATION ERROR :
  563. [INFO] -------------------------------------------------------------
  564. [ERROR] An unknown compilation problem occurred
  565. [INFO] 1 error
  566. [INFO] -------------------------------------------------------------
  567. [INFO] ------------------------------------------------------------------------
  568. [INFO] BUILD FAILURE
  569. [INFO] ------------------------------------------------------------------------
  570. [INFO] Total time: 0.638 s
  571. [INFO] Finished at: 2016-06-19T18:58:01+01:00
  572. [INFO] Final Memory: 9M/309M
  573. [INFO] ------------------------------------------------------------------------
  574. [ERROR] Failed to execute goal org.apache.maven.plugins:maven-compiler-plugin:3.1:compile (default-compile) on project WizardServer: Compilation failure
  575. [ERROR] An unknown compilation problem occurred
  576. [ERROR] -> [Help 1]
  577. org.apache.maven.lifecycle.LifecycleExecutionException: Failed to execute goal org.apache.maven.plugins:maven-compiler-plugin:3.1:compile (default-compile) on project WizardServer: Compilation failure
  578. An unknown compilation problem occurred
  579.  
  580.     at org.apache.maven.lifecycle.internal.MojoExecutor.execute(MojoExecutor.java:212)
  581.     at org.apache.maven.lifecycle.internal.MojoExecutor.execute(MojoExecutor.java:153)
  582.     at org.apache.maven.lifecycle.internal.MojoExecutor.execute(MojoExecutor.java:145)
  583.     at org.apache.maven.lifecycle.internal.LifecycleModuleBuilder.buildProject(LifecycleModuleBuilder.java:116)
  584.     at org.apache.maven.lifecycle.internal.LifecycleModuleBuilder.buildProject(LifecycleModuleBuilder.java:80)
  585.     at org.apache.maven.lifecycle.internal.builder.singlethreaded.SingleThreadedBuilder.build(SingleThreadedBuilder.java:51)
  586.     at org.apache.maven.lifecycle.internal.LifecycleStarter.execute(LifecycleStarter.java:128)
  587.     at org.apache.maven.DefaultMaven.doExecute(DefaultMaven.java:307)
  588.     at org.apache.maven.DefaultMaven.doExecute(DefaultMaven.java:193)
  589.     at org.apache.maven.DefaultMaven.execute(DefaultMaven.java:106)
  590.     at org.apache.maven.cli.MavenCli.execute(MavenCli.java:863)
  591.     at org.apache.maven.cli.MavenCli.doMain(MavenCli.java:288)
  592.     at org.apache.maven.cli.MavenCli.main(MavenCli.java:199)
  593.     at sun.reflect.NativeMethodAccessorImpl.invoke0(Native Method)
  594.     at sun.reflect.NativeMethodAccessorImpl.invoke(NativeMethodAccessorImpl.java:62)
  595.     at sun.reflect.DelegatingMethodAccessorImpl.invoke(DelegatingMethodAccessorImpl.java:43)
  596.     at java.lang.reflect.Method.invoke(Method.java:498)
  597.     at org.codehaus.plexus.classworlds.launcher.Launcher.launchEnhanced(Launcher.java:289)
  598.     at org.codehaus.plexus.classworlds.launcher.Launcher.launch(Launcher.java:229)
  599.     at org.codehaus.plexus.classworlds.launcher.Launcher.mainWithExitCode(Launcher.java:415)
  600.     at org.codehaus.plexus.classworlds.launcher.Launcher.main(Launcher.java:356)
  601. Caused by: org.apache.maven.plugin.compiler.CompilationFailureException: Compilation failure
  602. An unknown compilation problem occurred
  603.  
  604.     at org.apache.maven.plugin.compiler.AbstractCompilerMojo.execute(AbstractCompilerMojo.java:858)
  605.     at org.apache.maven.plugin.compiler.CompilerMojo.execute(CompilerMojo.java:129)
  606.     at org.apache.maven.plugin.DefaultBuildPluginManager.executeMojo(DefaultBuildPluginManager.java:134)
  607.     at org.apache.maven.lifecycle.internal.MojoExecutor.execute(MojoExecutor.java:207)
  608.     ... 20 more
  609. [ERROR]
  610. [ERROR]
  611. [ERROR] For more information about the errors and possible solutions, please read the following articles:
  612. [ERROR] [Help 1] http://cwiki.apache.org/confluence/display/MAVEN/MojoFailureException
RAW Paste Data
Top