Guest User

Untitled

a guest
Jun 5th, 2013
58
Never
Not a member of Pastebin yet? Sign Up, it unlocks many cool features!
  1. Making install in gl
  2. make install-recursive
  3. Making install in tests
  4. make install-recursive
  5. Making install in .
  6. make[6]: Nothing to be done for `install-exec-am'.
  7. make[6]: Nothing to be done for `install-data-am'.
  8. make[4]: Nothing to be done for `install-exec-am'.
  9. make[4]: Nothing to be done for `install-data-am'.
  10. Making install in lib
  11. Making install in includes
  12. make[3]: Nothing to be done for `install-exec-am'.
  13. ../../build-aux/install-sh -c -d '/usr/local/include'
  14. ../../build-aux/install-sh -c -d '/usr/local/include/gnutls'
  15. /usr/bin/install -c -m 644 gnutls/x509.h gnutls/pkcs12.h gnutls/compat.h gnutls/openpgp.h gnutls/crypto.h gnutls/pkcs11.h gnutls/abstract.h gnutls/dtls.h gnutls/ocsp.h gnutls/tpm.h gnutls/xssl.h gnutls/gnutlsxx.h '/usr/local/include/gnutls'
  16. ../../build-aux/install-sh -c -d '/usr/local/include'
  17. ../../build-aux/install-sh -c -d '/usr/local/include/gnutls'
  18. /usr/bin/install -c -m 644 gnutls/gnutls.h '/usr/local/include/gnutls'
  19. Making install in x509
  20. make[3]: Nothing to be done for `install-exec-am'.
  21. make[3]: Nothing to be done for `install-data-am'.
  22. Making install in accelerated
  23. Making install in x86
  24. make[4]: Nothing to be done for `install-exec-am'.
  25. make[4]: Nothing to be done for `install-data-am'.
  26. make[4]: Nothing to be done for `install-exec-am'.
  27. make[4]: Nothing to be done for `install-data-am'.
  28. Making install in auth
  29. make[3]: Nothing to be done for `install-exec-am'.
  30. make[3]: Nothing to be done for `install-data-am'.
  31. Making install in ext
  32. make[3]: Nothing to be done for `install-exec-am'.
  33. make[3]: Nothing to be done for `install-data-am'.
  34. Making install in algorithms
  35. make[3]: Nothing to be done for `install-exec-am'.
  36. make[3]: Nothing to be done for `install-data-am'.
  37. Making install in extras
  38. make[3]: Nothing to be done for `install-exec-am'.
  39. make[3]: Nothing to be done for `install-data-am'.
  40. Making install in minitasn1
  41. make[3]: Nothing to be done for `install-exec-am'.
  42. make[3]: Nothing to be done for `install-data-am'.
  43. Making install in opencdk
  44. make[3]: Nothing to be done for `install-exec-am'.
  45. make[3]: Nothing to be done for `install-data-am'.
  46. Making install in openpgp
  47. make[3]: Nothing to be done for `install-exec-am'.
  48. make[3]: Nothing to be done for `install-data-am'.
  49. Making install in nettle
  50. make[3]: Nothing to be done for `install-exec-am'.
  51. make[3]: Nothing to be done for `install-data-am'.
  52. ../build-aux/install-sh -c -d '/usr/local/lib'
  53. /bin/sh ../libtool --mode=install /usr/bin/install -c libgnutls.la libgnutlsxx.la libgnutls-xssl.la '/usr/local/lib'
  54. libtool: install: /usr/bin/install -c .libs/libgnutls.28.dylib /usr/local/lib/libgnutls.28.dylib
  55. libtool: install: (cd /usr/local/lib && { ln -s -f libgnutls.28.dylib libgnutls.dylib || { rm -f libgnutls.dylib && ln -s libgnutls.28.dylib libgnutls.dylib; }; })
  56. libtool: install: /usr/bin/install -c .libs/libgnutls.lai /usr/local/lib/libgnutls.la
  57. libtool: install: /usr/bin/install -c .libs/libgnutlsxx.28.dylib /usr/local/lib/libgnutlsxx.28.dylib
  58. libtool: install: (cd /usr/local/lib && { ln -s -f libgnutlsxx.28.dylib libgnutlsxx.dylib || { rm -f libgnutlsxx.dylib && ln -s libgnutlsxx.28.dylib libgnutlsxx.dylib; }; })
  59. libtool: install: /usr/bin/install -c .libs/libgnutlsxx.lai /usr/local/lib/libgnutlsxx.la
  60. libtool: install: /usr/bin/install -c .libs/libgnutls-xssl.0.dylib /usr/local/lib/libgnutls-xssl.0.dylib
  61. libtool: install: (cd /usr/local/lib && { ln -s -f libgnutls-xssl.0.dylib libgnutls-xssl.dylib || { rm -f libgnutls-xssl.dylib && ln -s libgnutls-xssl.0.dylib libgnutls-xssl.dylib; }; })
  62. libtool: install: /usr/bin/install -c .libs/libgnutls-xssl.lai /usr/local/lib/libgnutls-xssl.la
  63. libtool: install: /usr/bin/install -c .libs/libgnutls.a /usr/local/lib/libgnutls.a
  64. libtool: install: chmod 644 /usr/local/lib/libgnutls.a
  65. libtool: install: ranlib /usr/local/lib/libgnutls.a
  66. ranlib: file: /usr/local/lib/libgnutls.a(argp-fs-xinl.o) has no symbols
  67. ranlib: file: /usr/local/lib/libgnutls.a(argp-xinl.o) has no symbols
  68. ranlib: file: /usr/local/lib/libgnutls.a(fd-hook.o) has no symbols
  69. ranlib: file: /usr/local/lib/libgnutls.a(math.o) has no symbols
  70. ranlib: file: /usr/local/lib/libgnutls.a(sys_socket.o) has no symbols
  71. ranlib: file: /usr/local/lib/libgnutls.a(u64.o) has no symbols
  72. ranlib: file: /usr/local/lib/libgnutls.a(u8-uctomb.o) has no symbols
  73. ranlib: file: /usr/local/lib/libgnutls.a(unistd.o) has no symbols
  74. ranlib: file: /usr/local/lib/libgnutls.a(xsize.o) has no symbols
  75. ranlib: file: /usr/local/lib/libgnutls.a(cryptodev-gcm.o) has no symbols
  76. libtool: install: /usr/bin/install -c .libs/libgnutlsxx.a /usr/local/lib/libgnutlsxx.a
  77. libtool: install: chmod 644 /usr/local/lib/libgnutlsxx.a
  78. libtool: install: ranlib /usr/local/lib/libgnutlsxx.a
  79. libtool: install: /usr/bin/install -c .libs/libgnutls-xssl.a /usr/local/lib/libgnutls-xssl.a
  80. libtool: install: chmod 644 /usr/local/lib/libgnutls-xssl.a
  81. libtool: install: ranlib /usr/local/lib/libgnutls-xssl.a
  82. ranlib: file: /usr/local/lib/libgnutls-xssl.a(argp-fs-xinl.o) has no symbols
  83. ranlib: file: /usr/local/lib/libgnutls-xssl.a(argp-xinl.o) has no symbols
  84. ranlib: file: /usr/local/lib/libgnutls-xssl.a(fd-hook.o) has no symbols
  85. ranlib: file: /usr/local/lib/libgnutls-xssl.a(math.o) has no symbols
  86. ranlib: file: /usr/local/lib/libgnutls-xssl.a(sys_socket.o) has no symbols
  87. ranlib: file: /usr/local/lib/libgnutls-xssl.a(u64.o) has no symbols
  88. ranlib: file: /usr/local/lib/libgnutls-xssl.a(u8-uctomb.o) has no symbols
  89. ranlib: file: /usr/local/lib/libgnutls-xssl.a(unistd.o) has no symbols
  90. ranlib: file: /usr/local/lib/libgnutls-xssl.a(xsize.o) has no symbols
  91. ../build-aux/install-sh -c -d '/usr/local/lib/pkgconfig'
  92. /usr/bin/install -c -m 644 gnutls.pc '/usr/local/lib/pkgconfig'
  93. Making install in extra
  94. Making install in includes
  95. make[3]: Nothing to be done for `install-exec-am'.
  96. ../../build-aux/install-sh -c -d '/usr/local/include'
  97. ../../build-aux/install-sh -c -d '/usr/local/include/gnutls'
  98. /usr/bin/install -c -m 644 gnutls/openssl.h '/usr/local/include/gnutls'
  99. ../build-aux/install-sh -c -d '/usr/local/lib'
  100. /bin/sh ../libtool --mode=install /usr/bin/install -c libgnutls-openssl.la '/usr/local/lib'
  101. libtool: install: /usr/bin/install -c .libs/libgnutls-openssl.27.dylib /usr/local/lib/libgnutls-openssl.27.dylib
  102. libtool: install: (cd /usr/local/lib && { ln -s -f libgnutls-openssl.27.dylib libgnutls-openssl.dylib || { rm -f libgnutls-openssl.dylib && ln -s libgnutls-openssl.27.dylib libgnutls-openssl.dylib; }; })
  103. libtool: install: /usr/bin/install -c .libs/libgnutls-openssl.lai /usr/local/lib/libgnutls-openssl.la
  104. libtool: install: /usr/bin/install -c .libs/libgnutls-openssl.a /usr/local/lib/libgnutls-openssl.a
  105. libtool: install: chmod 644 /usr/local/lib/libgnutls-openssl.a
  106. libtool: install: ranlib /usr/local/lib/libgnutls-openssl.a
  107. ranlib: file: /usr/local/lib/libgnutls-openssl.a(argp-fs-xinl.o) has no symbols
  108. ranlib: file: /usr/local/lib/libgnutls-openssl.a(argp-xinl.o) has no symbols
  109. ranlib: file: /usr/local/lib/libgnutls-openssl.a(fd-hook.o) has no symbols
  110. ranlib: file: /usr/local/lib/libgnutls-openssl.a(math.o) has no symbols
  111. ranlib: file: /usr/local/lib/libgnutls-openssl.a(sys_socket.o) has no symbols
  112. ranlib: file: /usr/local/lib/libgnutls-openssl.a(u64.o) has no symbols
  113. ranlib: file: /usr/local/lib/libgnutls-openssl.a(u8-uctomb.o) has no symbols
  114. ranlib: file: /usr/local/lib/libgnutls-openssl.a(unistd.o) has no symbols
  115. ranlib: file: /usr/local/lib/libgnutls-openssl.a(xsize.o) has no symbols
  116. make[3]: Nothing to be done for `install-data-am'.
  117. Making install in po
  118. if test "gnutls" = "gettext-tools"; then \
  119. ../build-aux/install-sh -c -d /usr/local/share/gettext/po; \
  120. for file in Makefile.in.in remove-potcdate.sin quot.sed boldquot.sed en@quot.header en@boldquot.header insert-header.sin Rules-quot Makevars.template; do \
  121. /usr/bin/install -c -m 644 ./$file \
  122. /usr/local/share/gettext/po/$file; \
  123. done; \
  124. for file in Makevars; do \
  125. rm -f /usr/local/share/gettext/po/$file; \
  126. done; \
  127. else \
  128. : ; \
  129. fi
  130. Making install in src
  131. make install-recursive
  132. Making install in libopts
  133. make[4]: Nothing to be done for `install-exec-am'.
  134. make[4]: Nothing to be done for `install-data-am'.
  135. ../build-aux/install-sh -c -d '/usr/local/bin'
  136. /bin/sh ../libtool --mode=install /usr/bin/install -c psktool gnutls-cli-debug certtool srptool ocsptool gnutls-serv gnutls-cli danetool '/usr/local/bin'
  137. libtool: install: /usr/bin/install -c .libs/psktool /usr/local/bin/psktool
  138. libtool: install: /usr/bin/install -c .libs/gnutls-cli-debug /usr/local/bin/gnutls-cli-debug
  139. libtool: install: /usr/bin/install -c .libs/certtool /usr/local/bin/certtool
  140. libtool: install: /usr/bin/install -c .libs/srptool /usr/local/bin/srptool
  141. libtool: install: /usr/bin/install -c .libs/ocsptool /usr/local/bin/ocsptool
  142. libtool: install: /usr/bin/install -c .libs/gnutls-serv /usr/local/bin/gnutls-serv
  143. libtool: install: /usr/bin/install -c .libs/gnutls-cli /usr/local/bin/gnutls-cli
  144. libtool: install: /usr/bin/install -c .libs/danetool /usr/local/bin/danetool
  145. make[4]: Nothing to be done for `install-data-am'.
  146. Making install in doc
  147. make install-recursive
  148. Making install in examples
  149. make[4]: Nothing to be done for `install-exec-am'.
  150. make[4]: Nothing to be done for `install-data-am'.
  151. Making install in cyclo
  152. make[4]: Nothing to be done for `install-exec-am'.
  153. make[4]: Nothing to be done for `install-data-am'.
  154. Making install in scripts
  155. make[4]: Nothing to be done for `install-exec-am'.
  156. make[4]: Nothing to be done for `install-data-am'.
  157. Making install in manpages
  158. sed 's/@subheading \(.*\)/@*\n@var{\1}\n@*/' ../../src/cli-args.def > "../../src/cli-args.def".tmp && \
  159. autogen -DMAN_SECTION=1 -Tagman-cmd.tpl "../../src/cli-args.def".tmp && \
  160. rm -f "../../src/cli-args.def".tmp
  161. /bin/sh: autogen: command not found
  162. make[3]: [gnutls-cli.1] Error 127 (ignored)
  163. sed 's/@subheading \(.*\)/@*\n@var{\1}\n@*/' ../../src/cli-debug-args.def > "../../src/cli-debug-args.def".tmp && \
  164. autogen -DMAN_SECTION=1 -Tagman-cmd.tpl "../../src/cli-debug-args.def".tmp && \
  165. rm -f "../../src/cli-debug-args.def".tmp
  166. /bin/sh: autogen: command not found
  167. make[3]: [gnutls-cli-debug.1] Error 127 (ignored)
  168. sed 's/@subheading \(.*\)/@*\n@var{\1}\n@*/' ../../src/serv-args.def > "../../src/serv-args.def".tmp && \
  169. autogen -DMAN_SECTION=1 -Tagman-cmd.tpl "../../src/serv-args.def".tmp && \
  170. rm -f "../../src/serv-args.def".tmp
  171. /bin/sh: autogen: command not found
  172. make[3]: [gnutls-serv.1] Error 127 (ignored)
  173. sed 's/@subheading \(.*\)/@*\n@var{\1}\n@*/' ../../src/certtool-args.def > "../../src/certtool-args.def".tmp && \
  174. autogen -DMAN_SECTION=1 -Tagman-cmd.tpl "../../src/certtool-args.def".tmp && \
  175. rm -f "../../src/certtool-args.def".tmp
  176. /bin/sh: autogen: command not found
  177. make[3]: [certtool.1] Error 127 (ignored)
  178. sed 's/@subheading \(.*\)/@*\n@var{\1}\n@*/' ../../src/psk-args.def > "../../src/psk-args.def".tmp && \
  179. autogen -DMAN_SECTION=1 -Tagman-cmd.tpl "../../src/psk-args.def".tmp && \
  180. rm -f "../../src/psk-args.def".tmp
  181. /bin/sh: autogen: command not found
  182. make[3]: [psktool.1] Error 127 (ignored)
  183. sed 's/@subheading \(.*\)/@*\n@var{\1}\n@*/' ../../src/p11tool-args.def > "../../src/p11tool-args.def".tmp && \
  184. autogen -DMAN_SECTION=1 -Tagman-cmd.tpl "../../src/p11tool-args.def".tmp && \
  185. rm -f "../../src/p11tool-args.def".tmp
  186. /bin/sh: autogen: command not found
  187. make[3]: [p11tool.1] Error 127 (ignored)
  188. sed 's/@subheading \(.*\)/@*\n@var{\1}\n@*/' ../../src/ocsptool-args.def > "../../src/ocsptool-args.def".tmp && \
  189. autogen -DMAN_SECTION=1 -Tagman-cmd.tpl "../../src/ocsptool-args.def".tmp && \
  190. rm -f "../../src/ocsptool-args.def".tmp
  191. /bin/sh: autogen: command not found
  192. make[3]: [ocsptool.1] Error 127 (ignored)
  193. sed 's/@subheading \(.*\)/@*\n@var{\1}\n@*/' ../../src/srptool-args.def > "../../src/srptool-args.def".tmp && \
  194. autogen -DMAN_SECTION=1 -Tagman-cmd.tpl "../../src/srptool-args.def".tmp && \
  195. rm -f "../../src/srptool-args.def".tmp
  196. /bin/sh: autogen: command not found
  197. make[3]: [srptool.1] Error 127 (ignored)
  198. make[4]: Nothing to be done for `install-exec-am'.
  199. sed 's/@subheading \(.*\)/@*\n@var{\1}\n@*/' ../../src/cli-args.def > "../../src/cli-args.def".tmp && \
  200. autogen -DMAN_SECTION=1 -Tagman-cmd.tpl "../../src/cli-args.def".tmp && \
  201. rm -f "../../src/cli-args.def".tmp
  202. /bin/sh: autogen: command not found
  203. make[4]: [gnutls-cli.1] Error 127 (ignored)
  204. sed 's/@subheading \(.*\)/@*\n@var{\1}\n@*/' ../../src/cli-debug-args.def > "../../src/cli-debug-args.def".tmp && \
  205. autogen -DMAN_SECTION=1 -Tagman-cmd.tpl "../../src/cli-debug-args.def".tmp && \
  206. rm -f "../../src/cli-debug-args.def".tmp
  207. /bin/sh: autogen: command not found
  208. make[4]: [gnutls-cli-debug.1] Error 127 (ignored)
  209. sed 's/@subheading \(.*\)/@*\n@var{\1}\n@*/' ../../src/serv-args.def > "../../src/serv-args.def".tmp && \
  210. autogen -DMAN_SECTION=1 -Tagman-cmd.tpl "../../src/serv-args.def".tmp && \
  211. rm -f "../../src/serv-args.def".tmp
  212. /bin/sh: autogen: command not found
  213. make[4]: [gnutls-serv.1] Error 127 (ignored)
  214. sed 's/@subheading \(.*\)/@*\n@var{\1}\n@*/' ../../src/certtool-args.def > "../../src/certtool-args.def".tmp && \
  215. autogen -DMAN_SECTION=1 -Tagman-cmd.tpl "../../src/certtool-args.def".tmp && \
  216. rm -f "../../src/certtool-args.def".tmp
  217. /bin/sh: autogen: command not found
  218. make[4]: [certtool.1] Error 127 (ignored)
  219. sed 's/@subheading \(.*\)/@*\n@var{\1}\n@*/' ../../src/psk-args.def > "../../src/psk-args.def".tmp && \
  220. autogen -DMAN_SECTION=1 -Tagman-cmd.tpl "../../src/psk-args.def".tmp && \
  221. rm -f "../../src/psk-args.def".tmp
  222. /bin/sh: autogen: command not found
  223. make[4]: [psktool.1] Error 127 (ignored)
  224. sed 's/@subheading \(.*\)/@*\n@var{\1}\n@*/' ../../src/p11tool-args.def > "../../src/p11tool-args.def".tmp && \
  225. autogen -DMAN_SECTION=1 -Tagman-cmd.tpl "../../src/p11tool-args.def".tmp && \
  226. rm -f "../../src/p11tool-args.def".tmp
  227. /bin/sh: autogen: command not found
  228. make[4]: [p11tool.1] Error 127 (ignored)
  229. sed 's/@subheading \(.*\)/@*\n@var{\1}\n@*/' ../../src/ocsptool-args.def > "../../src/ocsptool-args.def".tmp && \
  230. autogen -DMAN_SECTION=1 -Tagman-cmd.tpl "../../src/ocsptool-args.def".tmp && \
  231. rm -f "../../src/ocsptool-args.def".tmp
  232. /bin/sh: autogen: command not found
  233. make[4]: [ocsptool.1] Error 127 (ignored)
  234. sed 's/@subheading \(.*\)/@*\n@var{\1}\n@*/' ../../src/srptool-args.def > "../../src/srptool-args.def".tmp && \
  235. autogen -DMAN_SECTION=1 -Tagman-cmd.tpl "../../src/srptool-args.def".tmp && \
  236. rm -f "../../src/srptool-args.def".tmp
  237. /bin/sh: autogen: command not found
  238. make[4]: [srptool.1] Error 127 (ignored)
  239. ../../build-aux/install-sh -c -d '/usr/local/share/man/man1'
  240. /usr/bin/install -c -m 644 ./gnutls-cli.1 ./gnutls-cli-debug.1 ./gnutls-serv.1 ./certtool.1 ./psktool.1 ./p11tool.1 ./ocsptool.1 tpmtool.1 ./srptool.1 '/usr/local/share/man/man1'
  241. install: ./gnutls-cli.1: No such file or directory
  242. make[4]: *** [install-man1] Error 71
  243. make[3]: *** [install-am] Error 2
  244. make[2]: *** [install-recursive] Error 1
  245. make[1]: *** [install] Error 2
  246. make: *** [install-recursive] Error 1
RAW Paste Data