Guest User

Untitled

a guest
Feb 19th, 2014
101
Never
Not a member of Pastebin yet? Sign Up, it unlocks many cool features!
  1. This file contains any messages produced by compilers while
  2. running configure, to aid debugging if configure makes a mistake.
  3.  
  4. It was created by cairo configure 1.12.16, which was
  5. generated by GNU Autoconf 2.69.  Invocation command line was
  6.  
  7.   $ ./configure --prefix=/usr --sysconfdir=/etc --localstatedir=/var --disable-static --enable-tee --enable-gl --enable-egl --enable-svg --enable-ps --enable-pdf --enable-gobject
  8.  
  9. ## --------- ##
  10. ## Platform. ##
  11. ## --------- ##
  12.  
  13. hostname = chakra-pc
  14. uname -m = x86_64
  15. uname -r = 3.12.11-1-ck
  16. uname -s = Linux
  17. uname -v = #1 SMP PREEMPT Mon Feb 17 03:56:16 UTC 2014
  18.  
  19. /usr/bin/uname -p = unknown
  20. /bin/uname -X     = unknown
  21.  
  22. /bin/arch              = unknown
  23. /usr/bin/arch -k       = unknown
  24. /usr/convex/getsysinfo = unknown
  25. /usr/bin/hostinfo      = unknown
  26. /bin/machine           = unknown
  27. /usr/bin/oslevel       = unknown
  28. /bin/universe          = unknown
  29.  
  30. PATH: /usr/local/bin
  31. PATH: /usr/bin
  32. PATH: /bin
  33. PATH: /usr/local/sbin
  34. PATH: /usr/sbin
  35. PATH: /sbin
  36. PATH: /usr/bin/core_perl
  37.  
  38.  
  39. ## ----------- ##
  40. ## Core tests. ##
  41. ## ----------- ##
  42.  
  43. configure:3208: checking for gcc
  44. configure:3224: found /usr/bin/gcc
  45. configure:3235: result: gcc
  46. configure:3464: checking for C compiler version
  47. configure:3473: gcc --version >&5
  48. gcc (GCC) 4.8.1 20130725 (prerelease)
  49. Copyright (C) 2013 Free Software Foundation, Inc.
  50. This is free software; see the source for copying conditions.  There is NO
  51. warranty; not even for MERCHANTABILITY or FITNESS FOR A PARTICULAR PURPOSE.
  52.  
  53. configure:3484: $? = 0
  54. configure:3473: gcc -v >&5
  55. Using built-in specs.
  56. COLLECT_GCC=gcc
  57. COLLECT_LTO_WRAPPER=/usr/lib/gcc/x86_64-unknown-linux-gnu/4.8.1/lto-wrapper
  58. Target: x86_64-unknown-linux-gnu
  59. Configured with: /chakra/lib32-testing/gcc-multilib/src/gcc-4.8-20130725/configure --prefix=/usr --libdir=/usr/lib --libexecdir=/usr/lib --mandir=/usr/share/man --infodir=/usr/share/info --with-bugurl=https://www.chakralinux.org/bugs --enable-languages=c,c++,ada,fortran,go,lto,objc,obj-c++ --enable-shared --enable-threads=posix --with-system-zlib --enable-__cxa_atexit --disable-libunwind-exceptions --enable-clocale=gnu --disable-libstdcxx-pch --enable-gnu-unique-object --enable-linker-build-id --enable-cloog-backend=isl --disable-cloog-version-check --enable-lto --enable-gold --enable-ld=default --enable-plugin --with-plugin-ld=ld.gold --with-linker-hash-style=gnu --disable-install-libiberty --enable-multilib --disable-libssp --disable-werror --enable-checking=release
  60. Thread model: posix
  61. gcc version 4.8.1 20130725 (prerelease) (GCC)
  62. configure:3484: $? = 0
  63. configure:3473: gcc -V >&5
  64. gcc: error: unrecognized command line option '-V'
  65. gcc: fatal error: no input files
  66. compilation terminated.
  67. configure:3484: $? = 1
  68. configure:3473: gcc -qversion >&5
  69. gcc: error: unrecognized command line option '-qversion'
  70. gcc: fatal error: no input files
  71. compilation terminated.
  72. configure:3484: $? = 1
  73. configure:3504: checking whether the C compiler works
  74. configure:3526: gcc -march=x86-64 -mtune=generic -O2 -pipe -fstack-protector --param=ssp-buffer-size=4 -D_FORTIFY_SOURCE=2 -Wl,-O1,--sort-common,--as-needed,-z,relro conftest.c  >&5
  75. configure:3530: $? = 0
  76. configure:3578: result: yes
  77. configure:3581: checking for C compiler default output file name
  78. configure:3583: result: a.out
  79. configure:3589: checking for suffix of executables
  80. configure:3596: gcc -o conftest -march=x86-64 -mtune=generic -O2 -pipe -fstack-protector --param=ssp-buffer-size=4 -D_FORTIFY_SOURCE=2 -Wl,-O1,--sort-common,--as-needed,-z,relro conftest.c  >&5
  81. configure:3600: $? = 0
  82. configure:3622: result:
  83. configure:3644: checking whether we are cross compiling
  84. configure:3652: gcc -o conftest -march=x86-64 -mtune=generic -O2 -pipe -fstack-protector --param=ssp-buffer-size=4 -D_FORTIFY_SOURCE=2 -Wl,-O1,--sort-common,--as-needed,-z,relro conftest.c  >&5
  85. configure:3656: $? = 0
  86. configure:3663: ./conftest
  87. configure:3667: $? = 0
  88. configure:3682: result: no
  89. configure:3687: checking for suffix of object files
  90. configure:3709: gcc -c -march=x86-64 -mtune=generic -O2 -pipe -fstack-protector --param=ssp-buffer-size=4 -D_FORTIFY_SOURCE=2 conftest.c >&5
  91. configure:3713: $? = 0
  92. configure:3734: result: o
  93. configure:3738: checking whether we are using the GNU C compiler
  94. configure:3757: gcc -c -march=x86-64 -mtune=generic -O2 -pipe -fstack-protector --param=ssp-buffer-size=4 -D_FORTIFY_SOURCE=2 conftest.c >&5
  95. configure:3757: $? = 0
  96. configure:3766: result: yes
  97. configure:3775: checking whether gcc accepts -g
  98. configure:3795: gcc -c -g -D_FORTIFY_SOURCE=2 conftest.c >&5
  99. configure:3795: $? = 0
  100. configure:3836: result: yes
  101. configure:3853: checking for gcc option to accept ISO C89
  102. configure:3916: gcc  -c -march=x86-64 -mtune=generic -O2 -pipe -fstack-protector --param=ssp-buffer-size=4 -D_FORTIFY_SOURCE=2 conftest.c >&5
  103. configure:3916: $? = 0
  104. configure:3929: result: none needed
  105. configure:3955: checking how to run the C preprocessor
  106. configure:3986: gcc -E -D_FORTIFY_SOURCE=2 conftest.c
  107. In file included from /usr/include/limits.h:25:0,
  108.                  from /usr/lib/gcc/x86_64-unknown-linux-gnu/4.8.1/include-fixed/limits.h:168,
  109.                  from /usr/lib/gcc/x86_64-unknown-linux-gnu/4.8.1/include-fixed/syslimits.h:7,
  110.                  from /usr/lib/gcc/x86_64-unknown-linux-gnu/4.8.1/include-fixed/limits.h:34,
  111.                  from conftest.c:10:
  112. /usr/include/features.h:327:4: warning: #warning _FORTIFY_SOURCE requires compiling with optimization (-O) [-Wcpp]
  113.  #  warning _FORTIFY_SOURCE requires compiling with optimization (-O)
  114.     ^
  115. configure:3986: $? = 0
  116. configure:4000: gcc -E -D_FORTIFY_SOURCE=2 conftest.c
  117. conftest.c:9:28: fatal error: ac_nonexistent.h: No such file or directory
  118.  #include <ac_nonexistent.h>
  119.                             ^
  120. compilation terminated.
  121. configure:4000: $? = 1
  122. configure: failed program was:
  123. | /* confdefs.h */
  124. | #define PACKAGE_NAME "cairo"
  125. | #define PACKAGE_TARNAME "cairo"
  126. | #define PACKAGE_VERSION "1.12.16"
  127. | #define PACKAGE_STRING "cairo 1.12.16"
  128. | #define PACKAGE_BUGREPORT "http://bugs.freedesktop.org/enter_bug.cgi?product=cairo"
  129. | #define PACKAGE_URL "http://cairographics.org/"
  130. | /* end confdefs.h.  */
  131. | #include <ac_nonexistent.h>
  132. configure:4025: result: gcc -E
  133. configure:4045: gcc -E -D_FORTIFY_SOURCE=2 conftest.c
  134. In file included from /usr/include/limits.h:25:0,
  135.                  from /usr/lib/gcc/x86_64-unknown-linux-gnu/4.8.1/include-fixed/limits.h:168,
  136.                  from /usr/lib/gcc/x86_64-unknown-linux-gnu/4.8.1/include-fixed/syslimits.h:7,
  137.                  from /usr/lib/gcc/x86_64-unknown-linux-gnu/4.8.1/include-fixed/limits.h:34,
  138.                  from conftest.c:10:
  139. /usr/include/features.h:327:4: warning: #warning _FORTIFY_SOURCE requires compiling with optimization (-O) [-Wcpp]
  140.  #  warning _FORTIFY_SOURCE requires compiling with optimization (-O)
  141.     ^
  142. configure:4045: $? = 0
  143. configure:4059: gcc -E -D_FORTIFY_SOURCE=2 conftest.c
  144. conftest.c:9:28: fatal error: ac_nonexistent.h: No such file or directory
  145.  #include <ac_nonexistent.h>
  146.                             ^
  147. compilation terminated.
  148. configure:4059: $? = 1
  149. configure: failed program was:
  150. | /* confdefs.h */
  151. | #define PACKAGE_NAME "cairo"
  152. | #define PACKAGE_TARNAME "cairo"
  153. | #define PACKAGE_VERSION "1.12.16"
  154. | #define PACKAGE_STRING "cairo 1.12.16"
  155. | #define PACKAGE_BUGREPORT "http://bugs.freedesktop.org/enter_bug.cgi?product=cairo"
  156. | #define PACKAGE_URL "http://cairographics.org/"
  157. | /* end confdefs.h.  */
  158. | #include <ac_nonexistent.h>
  159. configure:4088: checking for grep that handles long lines and -e
  160. configure:4146: result: /usr/bin/grep
  161. configure:4151: checking for egrep
  162. configure:4213: result: /usr/bin/grep -E
  163. configure:4218: checking for ANSI C header files
  164. configure:4238: gcc -c -march=x86-64 -mtune=generic -O2 -pipe -fstack-protector --param=ssp-buffer-size=4 -D_FORTIFY_SOURCE=2 conftest.c >&5
  165. configure:4238: $? = 0
  166. In file included from /usr/include/string.h:25:0,
  167.                  from conftest.c:9:
  168. /usr/include/features.h:327:4: warning: #warning _FORTIFY_SOURCE requires compiling with optimization (-O) [-Wcpp]
  169.  #  warning _FORTIFY_SOURCE requires compiling with optimization (-O)
  170.     ^
  171. In file included from /usr/include/stdlib.h:24:0,
  172.                  from conftest.c:9:
  173. /usr/include/features.h:327:4: warning: #warning _FORTIFY_SOURCE requires compiling with optimization (-O) [-Wcpp]
  174.  #  warning _FORTIFY_SOURCE requires compiling with optimization (-O)
  175.     ^
  176. configure:4311: gcc -o conftest -march=x86-64 -mtune=generic -O2 -pipe -fstack-protector --param=ssp-buffer-size=4 -D_FORTIFY_SOURCE=2 -Wl,-O1,--sort-common,--as-needed,-z,relro conftest.c  >&5
  177. configure:4311: $? = 0
  178. configure:4311: ./conftest
  179. configure:4311: $? = 0
  180. configure:4322: result: yes
  181. configure:4335: checking for sys/types.h
  182. configure:4335: gcc -c -march=x86-64 -mtune=generic -O2 -pipe -fstack-protector --param=ssp-buffer-size=4 -D_FORTIFY_SOURCE=2 conftest.c >&5
  183. configure:4335: $? = 0
  184. configure:4335: result: yes
  185. configure:4335: checking for sys/stat.h
  186. configure:4335: gcc -c -march=x86-64 -mtune=generic -O2 -pipe -fstack-protector --param=ssp-buffer-size=4 -D_FORTIFY_SOURCE=2 conftest.c >&5
  187. configure:4335: $? = 0
  188. configure:4335: result: yes
  189. configure:4335: checking for stdlib.h
  190. configure:4335: gcc -c -march=x86-64 -mtune=generic -O2 -pipe -fstack-protector --param=ssp-buffer-size=4 -D_FORTIFY_SOURCE=2 conftest.c >&5
  191. configure:4335: $? = 0
  192. configure:4335: result: yes
  193. configure:4335: checking for string.h
  194. configure:4335: gcc -c -march=x86-64 -mtune=generic -O2 -pipe -fstack-protector --param=ssp-buffer-size=4 -D_FORTIFY_SOURCE=2 conftest.c >&5
  195. configure:4335: $? = 0
  196. configure:4335: result: yes
  197. configure:4335: checking for memory.h
  198. configure:4335: gcc -c -march=x86-64 -mtune=generic -O2 -pipe -fstack-protector --param=ssp-buffer-size=4 -D_FORTIFY_SOURCE=2 conftest.c >&5
  199. configure:4335: $? = 0
  200. configure:4335: result: yes
  201. configure:4335: checking for strings.h
  202. configure:4335: gcc -c -march=x86-64 -mtune=generic -O2 -pipe -fstack-protector --param=ssp-buffer-size=4 -D_FORTIFY_SOURCE=2 conftest.c >&5
  203. configure:4335: $? = 0
  204. configure:4335: result: yes
  205. configure:4335: checking for inttypes.h
  206. configure:4335: gcc -c -march=x86-64 -mtune=generic -O2 -pipe -fstack-protector --param=ssp-buffer-size=4 -D_FORTIFY_SOURCE=2 conftest.c >&5
  207. configure:4335: $? = 0
  208. configure:4335: result: yes
  209. configure:4335: checking for stdint.h
  210. configure:4335: gcc -c -march=x86-64 -mtune=generic -O2 -pipe -fstack-protector --param=ssp-buffer-size=4 -D_FORTIFY_SOURCE=2 conftest.c >&5
  211. configure:4335: $? = 0
  212. configure:4335: result: yes
  213. configure:4335: checking for unistd.h
  214. configure:4335: gcc -c -march=x86-64 -mtune=generic -O2 -pipe -fstack-protector --param=ssp-buffer-size=4 -D_FORTIFY_SOURCE=2 conftest.c >&5
  215. configure:4335: $? = 0
  216. configure:4335: result: yes
  217. configure:4348: checking minix/config.h usability
  218. configure:4348: gcc -c -march=x86-64 -mtune=generic -O2 -pipe -fstack-protector --param=ssp-buffer-size=4 -D_FORTIFY_SOURCE=2 conftest.c >&5
  219. conftest.c:52:26: fatal error: minix/config.h: No such file or directory
  220.  #include <minix/config.h>
  221.                           ^
  222. compilation terminated.
  223. configure:4348: $? = 1
  224. configure: failed program was:
  225. | /* confdefs.h */
  226. | #define PACKAGE_NAME "cairo"
  227. | #define PACKAGE_TARNAME "cairo"
  228. | #define PACKAGE_VERSION "1.12.16"
  229. | #define PACKAGE_STRING "cairo 1.12.16"
  230. | #define PACKAGE_BUGREPORT "http://bugs.freedesktop.org/enter_bug.cgi?product=cairo"
  231. | #define PACKAGE_URL "http://cairographics.org/"
  232. | #define STDC_HEADERS 1
  233. | #define HAVE_SYS_TYPES_H 1
  234. | #define HAVE_SYS_STAT_H 1
  235. | #define HAVE_STDLIB_H 1
  236. | #define HAVE_STRING_H 1
  237. | #define HAVE_MEMORY_H 1
  238. | #define HAVE_STRINGS_H 1
  239. | #define HAVE_INTTYPES_H 1
  240. | #define HAVE_STDINT_H 1
  241. | #define HAVE_UNISTD_H 1
  242. | /* end confdefs.h.  */
  243. | #include <stdio.h>
  244. | #ifdef HAVE_SYS_TYPES_H
  245. | # include <sys/types.h>
  246. | #endif
  247. | #ifdef HAVE_SYS_STAT_H
  248. | # include <sys/stat.h>
  249. | #endif
  250. | #ifdef STDC_HEADERS
  251. | # include <stdlib.h>
  252. | # include <stddef.h>
  253. | #else
  254. | # ifdef HAVE_STDLIB_H
  255. | #  include <stdlib.h>
  256. | # endif
  257. | #endif
  258. | #ifdef HAVE_STRING_H
  259. | # if !defined STDC_HEADERS && defined HAVE_MEMORY_H
  260. | #  include <memory.h>
  261. | # endif
  262. | # include <string.h>
  263. | #endif
  264. | #ifdef HAVE_STRINGS_H
  265. | # include <strings.h>
  266. | #endif
  267. | #ifdef HAVE_INTTYPES_H
  268. | # include <inttypes.h>
  269. | #endif
  270. | #ifdef HAVE_STDINT_H
  271. | # include <stdint.h>
  272. | #endif
  273. | #ifdef HAVE_UNISTD_H
  274. | # include <unistd.h>
  275. | #endif
  276. | #include <minix/config.h>
  277. configure:4348: result: no
  278. configure:4348: checking minix/config.h presence
  279. configure:4348: gcc -E -D_FORTIFY_SOURCE=2 conftest.c
  280. conftest.c:19:26: fatal error: minix/config.h: No such file or directory
  281.  #include <minix/config.h>
  282.                           ^
  283. compilation terminated.
  284. configure:4348: $? = 1
  285. configure: failed program was:
  286. | /* confdefs.h */
  287. | #define PACKAGE_NAME "cairo"
  288. | #define PACKAGE_TARNAME "cairo"
  289. | #define PACKAGE_VERSION "1.12.16"
  290. | #define PACKAGE_STRING "cairo 1.12.16"
  291. | #define PACKAGE_BUGREPORT "http://bugs.freedesktop.org/enter_bug.cgi?product=cairo"
  292. | #define PACKAGE_URL "http://cairographics.org/"
  293. | #define STDC_HEADERS 1
  294. | #define HAVE_SYS_TYPES_H 1
  295. | #define HAVE_SYS_STAT_H 1
  296. | #define HAVE_STDLIB_H 1
  297. | #define HAVE_STRING_H 1
  298. | #define HAVE_MEMORY_H 1
  299. | #define HAVE_STRINGS_H 1
  300. | #define HAVE_INTTYPES_H 1
  301. | #define HAVE_STDINT_H 1
  302. | #define HAVE_UNISTD_H 1
  303. | /* end confdefs.h.  */
  304. | #include <minix/config.h>
  305. configure:4348: result: no
  306. configure:4348: checking for minix/config.h
  307. configure:4348: result: no
  308. configure:4369: checking whether it is safe to define __EXTENSIONS__
  309. configure:4387: gcc -c -march=x86-64 -mtune=generic -O2 -pipe -fstack-protector --param=ssp-buffer-size=4 -D_FORTIFY_SOURCE=2 conftest.c >&5
  310. configure:4387: $? = 0
  311. configure:4394: result: yes
  312. configure:4415: checking for unistd.h
  313. configure:4415: result: yes
  314. configure:4415: checking sys/ioctl.h usability
  315. configure:4415: gcc -c -march=x86-64 -mtune=generic -O2 -pipe -fstack-protector --param=ssp-buffer-size=4 -D_FORTIFY_SOURCE=2 conftest.c >&5
  316. configure:4415: $? = 0
  317. configure:4415: result: yes
  318. configure:4415: checking sys/ioctl.h presence
  319. configure:4415: gcc -E -D_FORTIFY_SOURCE=2 conftest.c
  320. In file included from /usr/include/sys/ioctl.h:21:0,
  321.                  from conftest.c:25:
  322. /usr/include/features.h:327:4: warning: #warning _FORTIFY_SOURCE requires compiling with optimization (-O) [-Wcpp]
  323.  #  warning _FORTIFY_SOURCE requires compiling with optimization (-O)
  324.     ^
  325. configure:4415: $? = 0
  326. configure:4415: result: yes
  327. configure:4415: checking for sys/ioctl.h
  328. configure:4415: result: yes
  329. configure:4442: checking for a BSD-compatible install
  330. configure:4510: result: /usr/bin/install -c
  331. configure:4521: checking whether build environment is sane
  332. configure:4571: result: yes
  333. configure:4712: checking for a thread-safe mkdir -p
  334. configure:4751: result: /usr/bin/mkdir -p
  335. configure:4764: checking for gawk
  336. configure:4780: found /usr/bin/gawk
  337. configure:4791: result: gawk
  338. configure:4802: checking whether make sets $(MAKE)
  339. configure:4824: result: yes
  340. configure:4854: checking for style of include used by make
  341. configure:4882: result: GNU
  342. configure:4959: checking dependency style of gcc
  343. configure:5070: result: gcc3
  344. configure:5087: checking whether to enable maintainer-specific portions of Makefiles
  345. configure:5096: result: no
  346. configure:5120: checking whether make supports nested variables
  347. configure:5137: result: yes
  348. configure:5199: checking for ar
  349. configure:5215: found /usr/bin/ar
  350. configure:5226: result: ar
  351. configure:5252: checking the archiver (ar) interface
  352. configure:5262: gcc -c -march=x86-64 -mtune=generic -O2 -pipe -fstack-protector --param=ssp-buffer-size=4 -D_FORTIFY_SOURCE=2 conftest.c >&5
  353. configure:5262: $? = 0
  354. configure:5264: ar cru libconftest.a conftest.o >&5
  355. configure:5267: $? = 0
  356. configure:5290: result: ar
  357. configure:5313: WARNING: Libtool does not cope well with whitespace in `pwd`
  358. configure:5340: checking build system type
  359. configure:5354: result: x86_64-unknown-linux-gnu
  360. configure:5374: checking host system type
  361. configure:5387: result: x86_64-unknown-linux-gnu
  362. configure:5428: checking how to print strings
  363. configure:5455: result: printf
  364. configure:5476: checking for a sed that does not truncate output
  365. configure:5540: result: /bin/sed
  366. configure:5558: checking for fgrep
  367. configure:5620: result: /usr/bin/grep -F
  368. configure:5655: checking for ld used by gcc
  369. configure:5722: result: /usr/bin/ld
  370. configure:5729: checking if the linker (/usr/bin/ld) is GNU ld
  371. configure:5744: result: yes
  372. configure:5756: checking for BSD- or MS-compatible name lister (nm)
  373. configure:5805: result: /usr/bin/nm -B
  374. configure:5935: checking the name lister (/usr/bin/nm -B) interface
  375. configure:5942: gcc -c -march=x86-64 -mtune=generic -O2 -pipe -fstack-protector --param=ssp-buffer-size=4 -D_FORTIFY_SOURCE=2 conftest.c >&5
  376. configure:5945: /usr/bin/nm -B "conftest.o"
  377. configure:5948: output
  378. 0000000000000000 B some_variable
  379. configure:5955: result: BSD nm
  380. configure:5958: checking whether ln -s works
  381. configure:5962: result: yes
  382. configure:5970: checking the maximum length of command line arguments
  383. configure:6100: result: 1572864
  384. configure:6117: checking whether the shell understands some XSI constructs
  385. configure:6127: result: yes
  386. configure:6131: checking whether the shell understands "+="
  387. configure:6137: result: yes
  388. configure:6172: checking how to convert x86_64-unknown-linux-gnu file names to x86_64-unknown-linux-gnu format
  389. configure:6212: result: func_convert_file_noop
  390. configure:6219: checking how to convert x86_64-unknown-linux-gnu file names to toolchain format
  391. configure:6239: result: func_convert_file_noop
  392. configure:6246: checking for /usr/bin/ld option to reload object files
  393. configure:6253: result: -r
  394. configure:6327: checking for objdump
  395. configure:6343: found /usr/bin/objdump
  396. configure:6354: result: objdump
  397. configure:6383: checking how to recognize dependent libraries
  398. configure:6585: result: pass_all
  399. configure:6670: checking for dlltool
  400. configure:6700: result: no
  401. configure:6727: checking how to associate runtime and link libraries
  402. configure:6754: result: printf %s\n
  403. configure:6878: checking for archiver @FILE support
  404. configure:6895: gcc -c -march=x86-64 -mtune=generic -O2 -pipe -fstack-protector --param=ssp-buffer-size=4 -D_FORTIFY_SOURCE=2 conftest.c >&5
  405. configure:6895: $? = 0
  406. configure:6898: ar cru libconftest.a @conftest.lst >&5
  407. configure:6901: $? = 0
  408. configure:6906: ar cru libconftest.a @conftest.lst >&5
  409. ar: conftest.o: No such file or directory
  410. configure:6909: $? = 1
  411. configure:6921: result: @
  412. configure:6979: checking for strip
  413. configure:6995: found /usr/bin/strip
  414. configure:7006: result: strip
  415. configure:7078: checking for ranlib
  416. configure:7094: found /usr/bin/ranlib
  417. configure:7105: result: ranlib
  418. configure:7207: checking command to parse /usr/bin/nm -B output from gcc object
  419. configure:7327: gcc -c -march=x86-64 -mtune=generic -O2 -pipe -fstack-protector --param=ssp-buffer-size=4 -D_FORTIFY_SOURCE=2 conftest.c >&5
  420. configure:7330: $? = 0
  421. configure:7334: /usr/bin/nm -B conftest.o \| sed -n -e 's/^.*[ ]\([ABCDGIRSTW][ABCDGIRSTW]*\)[ ][ ]*\([_A-Za-z][_A-Za-z0-9]*\)$/\1 \2 \2/p' | sed '/ __gnu_lto/d' \> conftest.nm
  422. configure:7337: $? = 0
  423. configure:7403: gcc -o conftest -march=x86-64 -mtune=generic -O2 -pipe -fstack-protector --param=ssp-buffer-size=4 -D_FORTIFY_SOURCE=2 -Wl,-O1,--sort-common,--as-needed,-z,relro conftest.c conftstm.o >&5
  424. configure:7406: $? = 0
  425. configure:7444: result: ok
  426. configure:7481: checking for sysroot
  427. configure:7511: result: no
  428. configure:7588: gcc -c -march=x86-64 -mtune=generic -O2 -pipe -fstack-protector --param=ssp-buffer-size=4 -D_FORTIFY_SOURCE=2 conftest.c >&5
  429. configure:7591: $? = 0
  430. configure:7767: checking for mt
  431. configure:7797: result: no
  432. configure:7817: checking if : is a manifest tool
  433. configure:7823: : '-?'
  434. configure:7831: result: no
  435. configure:8470: checking for dlfcn.h
  436. configure:8470: gcc -c -march=x86-64 -mtune=generic -O2 -pipe -fstack-protector --param=ssp-buffer-size=4 -D_FORTIFY_SOURCE=2 conftest.c >&5
  437. configure:8470: $? = 0
  438. configure:8470: result: yes
  439. configure:8974: checking for objdir
  440. configure:8989: result: .libs
  441. configure:9260: checking if gcc supports -fno-rtti -fno-exceptions
  442. configure:9278: gcc -c -march=x86-64 -mtune=generic -O2 -pipe -fstack-protector --param=ssp-buffer-size=4 -D_FORTIFY_SOURCE=2 -fno-rtti -fno-exceptions conftest.c >&5
  443. cc1: warning: command line option '-fno-rtti' is valid for C++/ObjC++ but not for C [enabled by default]
  444. configure:9282: $? = 0
  445. configure:9295: result: no
  446. configure:9622: checking for gcc option to produce PIC
  447. configure:9629: result: -fPIC -DPIC
  448. configure:9637: checking if gcc PIC flag -fPIC -DPIC works
  449. configure:9655: gcc -c -march=x86-64 -mtune=generic -O2 -pipe -fstack-protector --param=ssp-buffer-size=4 -D_FORTIFY_SOURCE=2 -fPIC -DPIC -DPIC conftest.c >&5
  450. configure:9659: $? = 0
  451. configure:9672: result: yes
  452. configure:9701: checking if gcc static flag -static works
  453. configure:9729: result: yes
  454. configure:9744: checking if gcc supports -c -o file.o
  455. configure:9765: gcc -c -march=x86-64 -mtune=generic -O2 -pipe -fstack-protector --param=ssp-buffer-size=4 -D_FORTIFY_SOURCE=2 -o out/conftest2.o conftest.c >&5
  456. configure:9769: $? = 0
  457. configure:9791: result: yes
  458. configure:9799: checking if gcc supports -c -o file.o
  459. configure:9846: result: yes
  460. configure:9879: checking whether the gcc linker (/usr/bin/ld -m elf_x86_64) supports shared libraries
  461. configure:11032: result: yes
  462. configure:11069: checking whether -lc should be explicitly linked in
  463. configure:11077: gcc -c -march=x86-64 -mtune=generic -O2 -pipe -fstack-protector --param=ssp-buffer-size=4 -D_FORTIFY_SOURCE=2 conftest.c >&5
  464. configure:11080: $? = 0
  465. configure:11095: gcc -shared  -fPIC -DPIC conftest.o  -v -Wl,-soname -Wl,conftest -o conftest 2\>\&1 \| /usr/bin/grep  -lc  \>/dev/null 2\>\&1
  466. configure:11098: $? = 0
  467. configure:11112: result: no
  468. configure:11272: checking dynamic linker characteristics
  469. configure:11783: gcc -o conftest -march=x86-64 -mtune=generic -O2 -pipe -fstack-protector --param=ssp-buffer-size=4 -D_FORTIFY_SOURCE=2 -Wl,-O1,--sort-common,--as-needed,-z,relro -Wl,-rpath -Wl,/foo conftest.c  >&5
  470. configure:11783: $? = 0
  471. configure:12005: result: GNU/Linux ld.so
  472. configure:12112: checking how to hardcode library paths into programs
  473. configure:12137: result: immediate
  474. configure:12677: checking whether stripping libraries is possible
  475. configure:12682: result: yes
  476. configure:12717: checking if libtool supports shared libraries
  477. configure:12719: result: yes
  478. configure:12722: checking whether to build shared libraries
  479. configure:12743: result: yes
  480. configure:12746: checking whether to build static libraries
  481. configure:12750: result: no
  482. configure:12838: checking for pkg-config
  483. configure:12856: found /usr/bin/pkg-config
  484. configure:12868: result: /usr/bin/pkg-config
  485. configure:12893: checking pkg-config is at least version 0.9.0
  486. configure:12896: result: yes
  487. configure:12910: checking for gtkdoc-check
  488. configure:12928: found /usr/bin/gtkdoc-check
  489. configure:12940: result: /usr/bin/gtkdoc-check
  490. configure:12952: checking for gtkdoc-rebase
  491. configure:12970: found /usr/bin/gtkdoc-rebase
  492. configure:12982: result: /usr/bin/gtkdoc-rebase
  493. configure:12996: checking for gtkdoc-mkpdf
  494. configure:13014: found /usr/bin/gtkdoc-mkpdf
  495. configure:13026: result: /usr/bin/gtkdoc-mkpdf
  496. configure:13155: checking whether to build gtk-doc documentation
  497. configure:13157: result: no
  498. configure:13229: checking for special C compiler options needed for large files
  499. configure:13274: result: no
  500. configure:13280: checking for _FILE_OFFSET_BITS value needed for large files
  501. configure:13305: gcc -c -march=x86-64 -mtune=generic -O2 -pipe -fstack-protector --param=ssp-buffer-size=4 -D_FORTIFY_SOURCE=2 conftest.c >&5
  502. configure:13305: $? = 0
  503. configure:13337: result: no
  504. configure:13450: checking for find
  505. configure:13468: found /usr/bin/find
  506. configure:13480: result: /usr/bin/find
  507. configure:13490: checking for xargs
  508. configure:13508: found /usr/bin/xargs
  509. configure:13520: result: /usr/bin/xargs
  510. configure:13577: checking for gcc
  511. configure:13604: result: gcc
  512. configure:13833: checking for C compiler version
  513. configure:13842: gcc --version >&5
  514. gcc (GCC) 4.8.1 20130725 (prerelease)
  515. Copyright (C) 2013 Free Software Foundation, Inc.
  516. This is free software; see the source for copying conditions.  There is NO
  517. warranty; not even for MERCHANTABILITY or FITNESS FOR A PARTICULAR PURPOSE.
  518.  
  519. configure:13853: $? = 0
  520. configure:13842: gcc -v >&5
  521. Using built-in specs.
  522. COLLECT_GCC=gcc
  523. COLLECT_LTO_WRAPPER=/usr/lib/gcc/x86_64-unknown-linux-gnu/4.8.1/lto-wrapper
  524. Target: x86_64-unknown-linux-gnu
  525. Configured with: /chakra/lib32-testing/gcc-multilib/src/gcc-4.8-20130725/configure --prefix=/usr --libdir=/usr/lib --libexecdir=/usr/lib --mandir=/usr/share/man --infodir=/usr/share/info --with-bugurl=https://www.chakralinux.org/bugs --enable-languages=c,c++,ada,fortran,go,lto,objc,obj-c++ --enable-shared --enable-threads=posix --with-system-zlib --enable-__cxa_atexit --disable-libunwind-exceptions --enable-clocale=gnu --disable-libstdcxx-pch --enable-gnu-unique-object --enable-linker-build-id --enable-cloog-backend=isl --disable-cloog-version-check --enable-lto --enable-gold --enable-ld=default --enable-plugin --with-plugin-ld=ld.gold --with-linker-hash-style=gnu --disable-install-libiberty --enable-multilib --disable-libssp --disable-werror --enable-checking=release
  526. Thread model: posix
  527. gcc version 4.8.1 20130725 (prerelease) (GCC)
  528. configure:13853: $? = 0
  529. configure:13842: gcc -V >&5
  530. gcc: error: unrecognized command line option '-V'
  531. gcc: fatal error: no input files
  532. compilation terminated.
  533. configure:13853: $? = 1
  534. configure:13842: gcc -qversion >&5
  535. gcc: error: unrecognized command line option '-qversion'
  536. gcc: fatal error: no input files
  537. compilation terminated.
  538. configure:13853: $? = 1
  539. configure:13857: checking whether we are using the GNU C compiler
  540. configure:13885: result: yes
  541. configure:13894: checking whether gcc accepts -g
  542. configure:13955: result: yes
  543. configure:13972: checking for gcc option to accept ISO C89
  544. configure:14048: result: none needed
  545. configure:14073: checking how to run the C preprocessor
  546. configure:14143: result: gcc -E
  547. configure:14163: gcc -E -D_FORTIFY_SOURCE=2 conftest.c
  548. In file included from /usr/include/limits.h:25:0,
  549.                  from /usr/lib/gcc/x86_64-unknown-linux-gnu/4.8.1/include-fixed/limits.h:168,
  550.                  from /usr/lib/gcc/x86_64-unknown-linux-gnu/4.8.1/include-fixed/syslimits.h:7,
  551.                  from /usr/lib/gcc/x86_64-unknown-linux-gnu/4.8.1/include-fixed/limits.h:34,
  552.                  from conftest.c:29:
  553. /usr/include/features.h:327:4: warning: #warning _FORTIFY_SOURCE requires compiling with optimization (-O) [-Wcpp]
  554.  #  warning _FORTIFY_SOURCE requires compiling with optimization (-O)
  555.     ^
  556. configure:14163: $? = 0
  557. configure:14177: gcc -E -D_FORTIFY_SOURCE=2 conftest.c
  558. conftest.c:28:28: fatal error: ac_nonexistent.h: No such file or directory
  559.  #include <ac_nonexistent.h>
  560.                             ^
  561. compilation terminated.
  562. configure:14177: $? = 1
  563. configure: failed program was:
  564. | /* confdefs.h */
  565. | #define PACKAGE_NAME "cairo"
  566. | #define PACKAGE_TARNAME "cairo"
  567. | #define PACKAGE_VERSION "1.12.16"
  568. | #define PACKAGE_STRING "cairo 1.12.16"
  569. | #define PACKAGE_BUGREPORT "http://bugs.freedesktop.org/enter_bug.cgi?product=cairo"
  570. | #define PACKAGE_URL "http://cairographics.org/"
  571. | #define STDC_HEADERS 1
  572. | #define HAVE_SYS_TYPES_H 1
  573. | #define HAVE_SYS_STAT_H 1
  574. | #define HAVE_STDLIB_H 1
  575. | #define HAVE_STRING_H 1
  576. | #define HAVE_MEMORY_H 1
  577. | #define HAVE_STRINGS_H 1
  578. | #define HAVE_INTTYPES_H 1
  579. | #define HAVE_STDINT_H 1
  580. | #define HAVE_UNISTD_H 1
  581. | #define __EXTENSIONS__ 1
  582. | #define _ALL_SOURCE 1
  583. | #define _GNU_SOURCE 1
  584. | #define _POSIX_PTHREAD_SEMANTICS 1
  585. | #define _TANDEM_SOURCE 1
  586. | #define HAVE_UNISTD_H 1
  587. | #define HAVE_SYS_IOCTL_H 1
  588. | #define HAVE_DLFCN_H 1
  589. | #define LT_OBJDIR ".libs/"
  590. | /* end confdefs.h.  */
  591. | #include <ac_nonexistent.h>
  592. configure:14263: checking for g++
  593. configure:14279: found /usr/bin/g++
  594. configure:14290: result: g++
  595. configure:14317: checking for C++ compiler version
  596. configure:14326: g++ --version >&5
  597. g++ (GCC) 4.8.1 20130725 (prerelease)
  598. Copyright (C) 2013 Free Software Foundation, Inc.
  599. This is free software; see the source for copying conditions.  There is NO
  600. warranty; not even for MERCHANTABILITY or FITNESS FOR A PARTICULAR PURPOSE.
  601.  
  602. configure:14337: $? = 0
  603. configure:14326: g++ -v >&5
  604. Using built-in specs.
  605. COLLECT_GCC=g++
  606. COLLECT_LTO_WRAPPER=/usr/lib/gcc/x86_64-unknown-linux-gnu/4.8.1/lto-wrapper
  607. Target: x86_64-unknown-linux-gnu
  608. Configured with: /chakra/lib32-testing/gcc-multilib/src/gcc-4.8-20130725/configure --prefix=/usr --libdir=/usr/lib --libexecdir=/usr/lib --mandir=/usr/share/man --infodir=/usr/share/info --with-bugurl=https://www.chakralinux.org/bugs --enable-languages=c,c++,ada,fortran,go,lto,objc,obj-c++ --enable-shared --enable-threads=posix --with-system-zlib --enable-__cxa_atexit --disable-libunwind-exceptions --enable-clocale=gnu --disable-libstdcxx-pch --enable-gnu-unique-object --enable-linker-build-id --enable-cloog-backend=isl --disable-cloog-version-check --enable-lto --enable-gold --enable-ld=default --enable-plugin --with-plugin-ld=ld.gold --with-linker-hash-style=gnu --disable-install-libiberty --enable-multilib --disable-libssp --disable-werror --enable-checking=release
  609. Thread model: posix
  610. gcc version 4.8.1 20130725 (prerelease) (GCC)
  611. configure:14337: $? = 0
  612. configure:14326: g++ -V >&5
  613. g++: error: unrecognized command line option '-V'
  614. g++: fatal error: no input files
  615. compilation terminated.
  616. configure:14337: $? = 1
  617. configure:14326: g++ -qversion >&5
  618. g++: error: unrecognized command line option '-qversion'
  619. g++: fatal error: no input files
  620. compilation terminated.
  621. configure:14337: $? = 1
  622. configure:14341: checking whether we are using the GNU C++ compiler
  623. configure:14360: g++ -c -march=x86-64 -mtune=generic -O2 -pipe -fstack-protector --param=ssp-buffer-size=4 -D_FORTIFY_SOURCE=2 conftest.cpp >&5
  624. configure:14360: $? = 0
  625. configure:14369: result: yes
  626. configure:14378: checking whether g++ accepts -g
  627. configure:14398: g++ -c -g -D_FORTIFY_SOURCE=2 conftest.cpp >&5
  628. configure:14398: $? = 0
  629. configure:14439: result: yes
  630. configure:14464: checking dependency style of g++
  631. configure:14575: result: gcc3
  632. configure:14608: checking how to run the C++ preprocessor
  633. configure:14635: g++ -E -D_FORTIFY_SOURCE=2 conftest.cpp
  634. In file included from /usr/include/limits.h:25:0,
  635.                  from /usr/lib/gcc/x86_64-unknown-linux-gnu/4.8.1/include-fixed/limits.h:168,
  636.                  from /usr/lib/gcc/x86_64-unknown-linux-gnu/4.8.1/include-fixed/syslimits.h:7,
  637.                  from /usr/lib/gcc/x86_64-unknown-linux-gnu/4.8.1/include-fixed/limits.h:34,
  638.                  from conftest.cpp:29:
  639. /usr/include/features.h:327:4: warning: #warning _FORTIFY_SOURCE requires compiling with optimization (-O) [-Wcpp]
  640.  #  warning _FORTIFY_SOURCE requires compiling with optimization (-O)
  641.     ^
  642. configure:14635: $? = 0
  643. configure:14649: g++ -E -D_FORTIFY_SOURCE=2 conftest.cpp
  644. conftest.cpp:28:28: fatal error: ac_nonexistent.h: No such file or directory
  645.  #include <ac_nonexistent.h>
  646.                             ^
  647. compilation terminated.
  648. configure:14649: $? = 1
  649. configure: failed program was:
  650. | /* confdefs.h */
  651. | #define PACKAGE_NAME "cairo"
  652. | #define PACKAGE_TARNAME "cairo"
  653. | #define PACKAGE_VERSION "1.12.16"
  654. | #define PACKAGE_STRING "cairo 1.12.16"
  655. | #define PACKAGE_BUGREPORT "http://bugs.freedesktop.org/enter_bug.cgi?product=cairo"
  656. | #define PACKAGE_URL "http://cairographics.org/"
  657. | #define STDC_HEADERS 1
  658. | #define HAVE_SYS_TYPES_H 1
  659. | #define HAVE_SYS_STAT_H 1
  660. | #define HAVE_STDLIB_H 1
  661. | #define HAVE_STRING_H 1
  662. | #define HAVE_MEMORY_H 1
  663. | #define HAVE_STRINGS_H 1
  664. | #define HAVE_INTTYPES_H 1
  665. | #define HAVE_STDINT_H 1
  666. | #define HAVE_UNISTD_H 1
  667. | #define __EXTENSIONS__ 1
  668. | #define _ALL_SOURCE 1
  669. | #define _GNU_SOURCE 1
  670. | #define _POSIX_PTHREAD_SEMANTICS 1
  671. | #define _TANDEM_SOURCE 1
  672. | #define HAVE_UNISTD_H 1
  673. | #define HAVE_SYS_IOCTL_H 1
  674. | #define HAVE_DLFCN_H 1
  675. | #define LT_OBJDIR ".libs/"
  676. | /* end confdefs.h.  */
  677. | #include <ac_nonexistent.h>
  678. configure:14674: result: g++ -E
  679. configure:14694: g++ -E -D_FORTIFY_SOURCE=2 conftest.cpp
  680. In file included from /usr/include/limits.h:25:0,
  681.                  from /usr/lib/gcc/x86_64-unknown-linux-gnu/4.8.1/include-fixed/limits.h:168,
  682.                  from /usr/lib/gcc/x86_64-unknown-linux-gnu/4.8.1/include-fixed/syslimits.h:7,
  683.                  from /usr/lib/gcc/x86_64-unknown-linux-gnu/4.8.1/include-fixed/limits.h:34,
  684.                  from conftest.cpp:29:
  685. /usr/include/features.h:327:4: warning: #warning _FORTIFY_SOURCE requires compiling with optimization (-O) [-Wcpp]
  686.  #  warning _FORTIFY_SOURCE requires compiling with optimization (-O)
  687.     ^
  688. configure:14694: $? = 0
  689. configure:14708: g++ -E -D_FORTIFY_SOURCE=2 conftest.cpp
  690. conftest.cpp:28:28: fatal error: ac_nonexistent.h: No such file or directory
  691.  #include <ac_nonexistent.h>
  692.                             ^
  693. compilation terminated.
  694. configure:14708: $? = 1
  695. configure: failed program was:
  696. | /* confdefs.h */
  697. | #define PACKAGE_NAME "cairo"
  698. | #define PACKAGE_TARNAME "cairo"
  699. | #define PACKAGE_VERSION "1.12.16"
  700. | #define PACKAGE_STRING "cairo 1.12.16"
  701. | #define PACKAGE_BUGREPORT "http://bugs.freedesktop.org/enter_bug.cgi?product=cairo"
  702. | #define PACKAGE_URL "http://cairographics.org/"
  703. | #define STDC_HEADERS 1
  704. | #define HAVE_SYS_TYPES_H 1
  705. | #define HAVE_SYS_STAT_H 1
  706. | #define HAVE_STDLIB_H 1
  707. | #define HAVE_STRING_H 1
  708. | #define HAVE_MEMORY_H 1
  709. | #define HAVE_STRINGS_H 1
  710. | #define HAVE_INTTYPES_H 1
  711. | #define HAVE_STDINT_H 1
  712. | #define HAVE_UNISTD_H 1
  713. | #define __EXTENSIONS__ 1
  714. | #define _ALL_SOURCE 1
  715. | #define _GNU_SOURCE 1
  716. | #define _POSIX_PTHREAD_SEMANTICS 1
  717. | #define _TANDEM_SOURCE 1
  718. | #define HAVE_UNISTD_H 1
  719. | #define HAVE_SYS_IOCTL_H 1
  720. | #define HAVE_DLFCN_H 1
  721. | #define LT_OBJDIR ".libs/"
  722. | /* end confdefs.h.  */
  723. | #include <ac_nonexistent.h>
  724. configure:14877: checking for ld used by g++
  725. configure:14944: result: /usr/bin/ld -m elf_x86_64
  726. configure:14951: checking if the linker (/usr/bin/ld -m elf_x86_64) is GNU ld
  727. configure:14966: result: yes
  728. configure:15021: checking whether the g++ linker (/usr/bin/ld -m elf_x86_64) supports shared libraries
  729. configure:16026: result: yes
  730. configure:16062: g++ -c -march=x86-64 -mtune=generic -O2 -pipe -fstack-protector --param=ssp-buffer-size=4 -D_FORTIFY_SOURCE=2 conftest.cpp >&5
  731. configure:16065: $? = 0
  732. configure:16585: checking for g++ option to produce PIC
  733. configure:16592: result: -fPIC -DPIC
  734. configure:16600: checking if g++ PIC flag -fPIC -DPIC works
  735. configure:16618: g++ -c -march=x86-64 -mtune=generic -O2 -pipe -fstack-protector --param=ssp-buffer-size=4 -D_FORTIFY_SOURCE=2 -fPIC -DPIC -DPIC conftest.cpp >&5
  736. configure:16622: $? = 0
  737. configure:16635: result: yes
  738. configure:16658: checking if g++ static flag -static works
  739. configure:16686: result: yes
  740. configure:16698: checking if g++ supports -c -o file.o
  741. configure:16719: g++ -c -march=x86-64 -mtune=generic -O2 -pipe -fstack-protector --param=ssp-buffer-size=4 -D_FORTIFY_SOURCE=2 -o out/conftest2.o conftest.cpp >&5
  742. configure:16723: $? = 0
  743. configure:16745: result: yes
  744. configure:16750: checking if g++ supports -c -o file.o
  745. configure:16797: result: yes
  746. configure:16827: checking whether the g++ linker (/usr/bin/ld -m elf_x86_64) supports shared libraries
  747. configure:16863: result: yes
  748. configure:17004: checking dynamic linker characteristics
  749. configure:17671: result: GNU/Linux ld.so
  750. configure:17724: checking how to hardcode library paths into programs
  751. configure:17749: result: immediate
  752. configure:17789: checking whether gcc and cc understand -c and -o together
  753. configure:17820: gcc -c conftest.c -o conftest2.o >&5
  754. configure:17824: $? = 0
  755. configure:17830: gcc -c conftest.c -o conftest2.o >&5
  756. configure:17834: $? = 0
  757. configure:17845: cc -c conftest.c >&5
  758. configure:17849: $? = 0
  759. configure:17857: cc -c conftest.c -o conftest2.o >&5
  760. configure:17861: $? = 0
  761. configure:17867: cc -c conftest.c -o conftest2.o >&5
  762. configure:17871: $? = 0
  763. configure:17889: result: yes
  764. configure:17914: checking for inline
  765. configure:17930: gcc -c -march=x86-64 -mtune=generic -O2 -pipe -fstack-protector --param=ssp-buffer-size=4 -D_FORTIFY_SOURCE=2 conftest.c >&5
  766. configure:17930: $? = 0
  767. configure:17938: result: inline
  768. configure:18007: checking for pkg-config
  769. configure:18037: result: /usr/bin/pkg-config
  770. configure:18062: checking pkg-config is at least version 0.9.0
  771. configure:18065: result: yes
  772. configure:18348: checking for supported warning flags
  773. configure:18373: checking whether gcc supports -Werror
  774. configure:18391: gcc -o conftest -march=x86-64 -mtune=generic -O2 -pipe -fstack-protector --param=ssp-buffer-size=4 -Werror -D_FORTIFY_SOURCE=2 -Wl,-O1,--sort-common,--as-needed,-z,relro conftest.c  >&5
  775. configure:18391: $? = 0
  776. configure:18415: result: yes
  777. configure:18373: checking whether gcc supports -errwarn
  778. configure:18391: gcc -o conftest -march=x86-64 -mtune=generic -O2 -pipe -fstack-protector --param=ssp-buffer-size=4 -errwarn -D_FORTIFY_SOURCE=2 -Wl,-O1,--sort-common,--as-needed,-z,relro conftest.c  >&5
  779. /usr/bin/ld: warning: cannot find entry symbol rrwarn; defaulting to 0000000000400400
  780. configure:18391: $? = 0
  781. configure:18415: result: no
  782. configure:18420: checking whether gcc supports -Wall
  783. configure:18438: gcc -o conftest -march=x86-64 -mtune=generic -O2 -pipe -fstack-protector --param=ssp-buffer-size=4  -Werror -Wall -D_FORTIFY_SOURCE=2 -Wl,-O1,--sort-common,--as-needed,-z,relro conftest.c  >&5
  784. configure:18438: $? = 0
  785. configure:18462: result: yes
  786. configure:18420: checking whether gcc supports -Wextra
  787. configure:18438: gcc -o conftest -march=x86-64 -mtune=generic -O2 -pipe -fstack-protector --param=ssp-buffer-size=4  -Werror -Wextra -D_FORTIFY_SOURCE=2 -Wl,-O1,--sort-common,--as-needed,-z,relro conftest.c  >&5
  788. configure:18438: $? = 0
  789. configure:18462: result: yes
  790. configure:18420: checking whether gcc supports -Wold-style-definition
  791. configure:18438: gcc -o conftest -march=x86-64 -mtune=generic -O2 -pipe -fstack-protector --param=ssp-buffer-size=4  -Werror -Wold-style-definition -D_FORTIFY_SOURCE=2 -Wl,-O1,--sort-common,--as-needed,-z,relro conftest.c  >&5
  792. configure:18438: $? = 0
  793. configure:18462: result: yes
  794. configure:18420: checking whether gcc supports -Wdeclaration-after-statement
  795. configure:18438: gcc -o conftest -march=x86-64 -mtune=generic -O2 -pipe -fstack-protector --param=ssp-buffer-size=4  -Werror -Wdeclaration-after-statement -D_FORTIFY_SOURCE=2 -Wl,-O1,--sort-common,--as-needed,-z,relro conftest.c  >&5
  796. configure:18438: $? = 0
  797. configure:18462: result: yes
  798. configure:18420: checking whether gcc supports -Wmissing-declarations
  799. configure:18438: gcc -o conftest -march=x86-64 -mtune=generic -O2 -pipe -fstack-protector --param=ssp-buffer-size=4  -Werror -Wmissing-declarations -D_FORTIFY_SOURCE=2 -Wl,-O1,--sort-common,--as-needed,-z,relro conftest.c  >&5
  800. configure:18438: $? = 0
  801. configure:18462: result: yes
  802. configure:18420: checking whether gcc supports -Werror-implicit-function-declaration
  803. configure:18438: gcc -o conftest -march=x86-64 -mtune=generic -O2 -pipe -fstack-protector --param=ssp-buffer-size=4  -Werror -Werror-implicit-function-declaration -D_FORTIFY_SOURCE=2 -Wl,-O1,--sort-common,--as-needed,-z,relro conftest.c  >&5
  804. configure:18438: $? = 0
  805. configure:18462: result: yes
  806. configure:18420: checking whether gcc supports -Wnested-externs
  807. configure:18438: gcc -o conftest -march=x86-64 -mtune=generic -O2 -pipe -fstack-protector --param=ssp-buffer-size=4  -Werror -Wnested-externs -D_FORTIFY_SOURCE=2 -Wl,-O1,--sort-common,--as-needed,-z,relro conftest.c  >&5
  808. configure:18438: $? = 0
  809. configure:18462: result: yes
  810. configure:18420: checking whether gcc supports -Wpointer-arith
  811. configure:18438: gcc -o conftest -march=x86-64 -mtune=generic -O2 -pipe -fstack-protector --param=ssp-buffer-size=4  -Werror -Wpointer-arith -D_FORTIFY_SOURCE=2 -Wl,-O1,--sort-common,--as-needed,-z,relro conftest.c  >&5
  812. configure:18438: $? = 0
  813. configure:18462: result: yes
  814. configure:18420: checking whether gcc supports -Wwrite-strings
  815. configure:18438: gcc -o conftest -march=x86-64 -mtune=generic -O2 -pipe -fstack-protector --param=ssp-buffer-size=4  -Werror -Wwrite-strings -D_FORTIFY_SOURCE=2 -Wl,-O1,--sort-common,--as-needed,-z,relro conftest.c  >&5
  816. configure:18438: $? = 0
  817. configure:18462: result: yes
  818. configure:18420: checking whether gcc supports -Wsign-compare
  819. configure:18438: gcc -o conftest -march=x86-64 -mtune=generic -O2 -pipe -fstack-protector --param=ssp-buffer-size=4  -Werror -Wsign-compare -D_FORTIFY_SOURCE=2 -Wl,-O1,--sort-common,--as-needed,-z,relro conftest.c  >&5
  820. configure:18438: $? = 0
  821. configure:18462: result: yes
  822. configure:18420: checking whether gcc supports -Wstrict-prototypes
  823. configure:18438: gcc -o conftest -march=x86-64 -mtune=generic -O2 -pipe -fstack-protector --param=ssp-buffer-size=4  -Werror -Wstrict-prototypes -D_FORTIFY_SOURCE=2 -Wl,-O1,--sort-common,--as-needed,-z,relro conftest.c  >&5
  824. configure:18438: $? = 0
  825. configure:18462: result: yes
  826. configure:18420: checking whether gcc supports -Wmissing-prototypes
  827. configure:18438: gcc -o conftest -march=x86-64 -mtune=generic -O2 -pipe -fstack-protector --param=ssp-buffer-size=4  -Werror -Wmissing-prototypes -D_FORTIFY_SOURCE=2 -Wl,-O1,--sort-common,--as-needed,-z,relro conftest.c  >&5
  828. configure:18438: $? = 0
  829. configure:18462: result: yes
  830. configure:18420: checking whether gcc supports -Wpacked
  831. configure:18438: gcc -o conftest -march=x86-64 -mtune=generic -O2 -pipe -fstack-protector --param=ssp-buffer-size=4  -Werror -Wpacked -D_FORTIFY_SOURCE=2 -Wl,-O1,--sort-common,--as-needed,-z,relro conftest.c  >&5
  832. configure:18438: $? = 0
  833. configure:18462: result: yes
  834. configure:18420: checking whether gcc supports -Wswitch-enum
  835. configure:18438: gcc -o conftest -march=x86-64 -mtune=generic -O2 -pipe -fstack-protector --param=ssp-buffer-size=4  -Werror -Wswitch-enum -D_FORTIFY_SOURCE=2 -Wl,-O1,--sort-common,--as-needed,-z,relro conftest.c  >&5
  836. configure:18438: $? = 0
  837. configure:18462: result: yes
  838. configure:18420: checking whether gcc supports -Wmissing-format-attribute
  839. configure:18438: gcc -o conftest -march=x86-64 -mtune=generic -O2 -pipe -fstack-protector --param=ssp-buffer-size=4  -Werror -Wmissing-format-attribute -D_FORTIFY_SOURCE=2 -Wl,-O1,--sort-common,--as-needed,-z,relro conftest.c  >&5
  840. configure:18438: $? = 0
  841. configure:18462: result: yes
  842. configure:18420: checking whether gcc supports -Wbad-function-cast
  843. configure:18438: gcc -o conftest -march=x86-64 -mtune=generic -O2 -pipe -fstack-protector --param=ssp-buffer-size=4  -Werror -Wbad-function-cast -D_FORTIFY_SOURCE=2 -Wl,-O1,--sort-common,--as-needed,-z,relro conftest.c  >&5
  844. configure:18438: $? = 0
  845. configure:18462: result: yes
  846. configure:18420: checking whether gcc supports -Wvolatile-register-var
  847. configure:18438: gcc -o conftest -march=x86-64 -mtune=generic -O2 -pipe -fstack-protector --param=ssp-buffer-size=4  -Werror -Wvolatile-register-var -D_FORTIFY_SOURCE=2 -Wl,-O1,--sort-common,--as-needed,-z,relro conftest.c  >&5
  848. configure:18438: $? = 0
  849. configure:18462: result: yes
  850. configure:18420: checking whether gcc supports -Wstrict-aliasing=2
  851. configure:18438: gcc -o conftest -march=x86-64 -mtune=generic -O2 -pipe -fstack-protector --param=ssp-buffer-size=4  -Werror -Wstrict-aliasing=2 -D_FORTIFY_SOURCE=2 -Wl,-O1,--sort-common,--as-needed,-z,relro conftest.c  >&5
  852. configure:18438: $? = 0
  853. configure:18462: result: yes
  854. configure:18420: checking whether gcc supports -Winit-self
  855. configure:18438: gcc -o conftest -march=x86-64 -mtune=generic -O2 -pipe -fstack-protector --param=ssp-buffer-size=4  -Werror -Winit-self -D_FORTIFY_SOURCE=2 -Wl,-O1,--sort-common,--as-needed,-z,relro conftest.c  >&5
  856. configure:18438: $? = 0
  857. configure:18462: result: yes
  858. configure:18420: checking whether gcc supports -Wunsafe-loop-optimizations
  859. configure:18438: gcc -o conftest -march=x86-64 -mtune=generic -O2 -pipe -fstack-protector --param=ssp-buffer-size=4  -Werror -Wunsafe-loop-optimizations -D_FORTIFY_SOURCE=2 -Wl,-O1,--sort-common,--as-needed,-z,relro conftest.c  >&5
  860. configure:18438: $? = 0
  861. configure:18462: result: yes
  862. configure:18420: checking whether gcc supports -Wno-missing-field-initializers
  863. configure:18438: gcc -o conftest -march=x86-64 -mtune=generic -O2 -pipe -fstack-protector --param=ssp-buffer-size=4  -Werror -Wno-missing-field-initializers -D_FORTIFY_SOURCE=2 -Wl,-O1,--sort-common,--as-needed,-z,relro conftest.c  >&5
  864. configure:18438: $? = 0
  865. configure:18462: result: yes
  866. configure:18420: checking whether gcc supports -Wno-unused-parameter
  867. configure:18438: gcc -o conftest -march=x86-64 -mtune=generic -O2 -pipe -fstack-protector --param=ssp-buffer-size=4  -Werror -Wno-unused-parameter -D_FORTIFY_SOURCE=2 -Wl,-O1,--sort-common,--as-needed,-z,relro conftest.c  >&5
  868. configure:18438: $? = 0
  869. configure:18462: result: yes
  870. configure:18420: checking whether gcc supports -Wno-attributes
  871. configure:18438: gcc -o conftest -march=x86-64 -mtune=generic -O2 -pipe -fstack-protector --param=ssp-buffer-size=4  -Werror -Wno-attributes -D_FORTIFY_SOURCE=2 -Wl,-O1,--sort-common,--as-needed,-z,relro conftest.c  >&5
  872. configure:18438: $? = 0
  873. configure:18462: result: yes
  874. configure:18420: checking whether gcc supports -Wno-long-long
  875. configure:18438: gcc -o conftest -march=x86-64 -mtune=generic -O2 -pipe -fstack-protector --param=ssp-buffer-size=4  -Werror -Wno-long-long -D_FORTIFY_SOURCE=2 -Wl,-O1,--sort-common,--as-needed,-z,relro conftest.c  >&5
  876. configure:18438: $? = 0
  877. configure:18462: result: yes
  878. configure:18420: checking whether gcc supports -Winline
  879. configure:18438: gcc -o conftest -march=x86-64 -mtune=generic -O2 -pipe -fstack-protector --param=ssp-buffer-size=4  -Werror -Winline -D_FORTIFY_SOURCE=2 -Wl,-O1,--sort-common,--as-needed,-z,relro conftest.c  >&5
  880. configure:18438: $? = 0
  881. configure:18462: result: yes
  882. configure:18420: checking whether gcc supports -erroff=E_ENUM_TYPE_MISMATCH_ARG
  883. configure:18438: gcc -o conftest -march=x86-64 -mtune=generic -O2 -pipe -fstack-protector --param=ssp-buffer-size=4  -Werror -erroff=E_ENUM_TYPE_MISMATCH_ARG -D_FORTIFY_SOURCE=2 -Wl,-O1,--sort-common,--as-needed,-z,relro conftest.c  >&5
  884. /usr/bin/ld: warning: cannot find entry symbol rroff=E_ENUM_TYPE_MISMATCH_ARG; defaulting to 0000000000400400
  885. configure:18438: $? = 0
  886. configure:18462: result: no
  887. configure:18420: checking whether gcc supports -erroff=E_ENUM_TYPE_MISMATCH_OP
  888. configure:18438: gcc -o conftest -march=x86-64 -mtune=generic -O2 -pipe -fstack-protector --param=ssp-buffer-size=4  -Werror -erroff=E_ENUM_TYPE_MISMATCH_OP -D_FORTIFY_SOURCE=2 -Wl,-O1,--sort-common,--as-needed,-z,relro conftest.c  >&5
  889. /usr/bin/ld: warning: cannot find entry symbol rroff=E_ENUM_TYPE_MISMATCH_OP; defaulting to 0000000000400400
  890. configure:18438: $? = 0
  891. configure:18462: result: no
  892. configure:18420: checking whether gcc supports -fno-strict-aliasing
  893. configure:18438: gcc -o conftest -march=x86-64 -mtune=generic -O2 -pipe -fstack-protector --param=ssp-buffer-size=4  -Werror -fno-strict-aliasing -D_FORTIFY_SOURCE=2 -Wl,-O1,--sort-common,--as-needed,-z,relro conftest.c  >&5
  894. configure:18438: $? = 0
  895. configure:18462: result: yes
  896. configure:18420: checking whether gcc supports -fno-common
  897. configure:18438: gcc -o conftest -march=x86-64 -mtune=generic -O2 -pipe -fstack-protector --param=ssp-buffer-size=4  -Werror -fno-common -D_FORTIFY_SOURCE=2 -Wl,-O1,--sort-common,--as-needed,-z,relro conftest.c  >&5
  898. configure:18438: $? = 0
  899. configure:18462: result: yes
  900. configure:18420: checking whether gcc supports -Wp,-D_FORTIFY_SOURCE=2
  901. configure:18438: gcc -o conftest -march=x86-64 -mtune=generic -O2 -pipe -fstack-protector --param=ssp-buffer-size=4  -Werror -Wp,-D_FORTIFY_SOURCE=2 -D_FORTIFY_SOURCE=2 -Wl,-O1,--sort-common,--as-needed,-z,relro conftest.c  >&5
  902. configure:18438: $? = 0
  903. configure:18462: result: yes
  904. configure:18518: checking whether gcc supports -Wunused-but-set-variable -Wno-unused-but-set-variable
  905. configure:18536: gcc -o conftest -march=x86-64 -mtune=generic -O2 -pipe -fstack-protector --param=ssp-buffer-size=4  -Werror -Wunused-but-set-variable -Wno-unused-but-set-variable -D_FORTIFY_SOURCE=2 -Wl,-O1,--sort-common,--as-needed,-z,relro conftest.c  >&5
  906. configure:18536: $? = 0
  907. configure:18560: result: yes
  908. configure:18567: checking which warning flags were supported
  909. configure:18571: result:  -Wall -Wextra -Wold-style-definition -Wdeclaration-after-statement -Wmissing-declarations -Werror-implicit-function-declaration -Wnested-externs -Wpointer-arith -Wwrite-strings -Wsign-compare -Wstrict-prototypes -Wmissing-prototypes -Wpacked -Wswitch-enum -Wmissing-format-attribute -Wbad-function-cast -Wvolatile-register-var -Wstrict-aliasing=2 -Winit-self -Wunsafe-loop-optimizations -Wno-missing-field-initializers -Wno-unused-parameter -Wno-attributes -Wno-long-long -Winline -fno-strict-aliasing -fno-common -Wp,-D_FORTIFY_SOURCE=2 -Wno-unused-but-set-variable
  910. configure:18579: checking how to enable unused result warnings
  911. configure:18605: gcc -o conftest -march=x86-64 -mtune=generic -O2 -pipe -fstack-protector --param=ssp-buffer-size=4 -Wno-attributes -D_FORTIFY_SOURCE=2 -Wl,-O1,--sort-common,--as-needed,-z,relro conftest.c  >&5
  912. configure:18605: $? = 0
  913. configure:18632: result: __attribute__((__warn_unused_result__))
  914. configure:18640: checking how to allow undefined symbols in shared libraries used by test suite
  915. configure:18661: gcc -o conftest -march=x86-64 -mtune=generic -O2 -pipe -fstack-protector --param=ssp-buffer-size=4 -Wl,--allow-shlib-undefined -D_FORTIFY_SOURCE=2 -Wl,-O1,--sort-common,--as-needed,-z,relro conftest.c  >&5
  916. configure:18661: $? = 0
  917. configure:18686: result: -Wl,--allow-shlib-undefined
  918. configure:18705: checking whether byte ordering is bigendian
  919. configure:18720: gcc -c -march=x86-64 -mtune=generic -O2 -pipe -fstack-protector --param=ssp-buffer-size=4 -D_FORTIFY_SOURCE=2 conftest.c >&5
  920. conftest.c:30:9: error: unknown type name 'not'
  921.          not a universal capable compiler
  922.          ^
  923. conftest.c:30:15: error: expected '=', ',', ';', 'asm' or '__attribute__' before 'universal'
  924.          not a universal capable compiler
  925.                ^
  926. conftest.c:30:15: error: unknown type name 'universal'
  927. configure:18720: $? = 1
  928. configure: failed program was:
  929. | /* confdefs.h */
  930. | #define PACKAGE_NAME "cairo"
  931. | #define PACKAGE_TARNAME "cairo"
  932. | #define PACKAGE_VERSION "1.12.16"
  933. | #define PACKAGE_STRING "cairo 1.12.16"
  934. | #define PACKAGE_BUGREPORT "http://bugs.freedesktop.org/enter_bug.cgi?product=cairo"
  935. | #define PACKAGE_URL "http://cairographics.org/"
  936. | #define STDC_HEADERS 1
  937. | #define HAVE_SYS_TYPES_H 1
  938. | #define HAVE_SYS_STAT_H 1
  939. | #define HAVE_STDLIB_H 1
  940. | #define HAVE_STRING_H 1
  941. | #define HAVE_MEMORY_H 1
  942. | #define HAVE_STRINGS_H 1
  943. | #define HAVE_INTTYPES_H 1
  944. | #define HAVE_STDINT_H 1
  945. | #define HAVE_UNISTD_H 1
  946. | #define __EXTENSIONS__ 1
  947. | #define _ALL_SOURCE 1
  948. | #define _GNU_SOURCE 1
  949. | #define _POSIX_PTHREAD_SEMANTICS 1
  950. | #define _TANDEM_SOURCE 1
  951. | #define HAVE_UNISTD_H 1
  952. | #define HAVE_SYS_IOCTL_H 1
  953. | #define HAVE_DLFCN_H 1
  954. | #define LT_OBJDIR ".libs/"
  955. | #define WARN_UNUSED_RESULT __attribute__((__warn_unused_result__))
  956. | /* end confdefs.h.  */
  957. | #ifndef __APPLE_CC__
  958. |          not a universal capable compiler
  959. |        #endif
  960. |        typedef int dummy;
  961. |
  962. configure:18765: gcc -c -march=x86-64 -mtune=generic -O2 -pipe -fstack-protector --param=ssp-buffer-size=4 -D_FORTIFY_SOURCE=2 conftest.c >&5
  963. configure:18765: $? = 0
  964. configure:18783: gcc -c -march=x86-64 -mtune=generic -O2 -pipe -fstack-protector --param=ssp-buffer-size=4 -D_FORTIFY_SOURCE=2 conftest.c >&5
  965. conftest.c: In function 'main':
  966. conftest.c:36:4: error: unknown type name 'not'
  967.     not big endian
  968.     ^
  969. conftest.c:36:12: error: expected '=', ',', ';', 'asm' or '__attribute__' before 'endian'
  970.     not big endian
  971.             ^
  972. configure:18783: $? = 1
  973. configure: failed program was:
  974. | /* confdefs.h */
  975. | #define PACKAGE_NAME "cairo"
  976. | #define PACKAGE_TARNAME "cairo"
  977. | #define PACKAGE_VERSION "1.12.16"
  978. | #define PACKAGE_STRING "cairo 1.12.16"
  979. | #define PACKAGE_BUGREPORT "http://bugs.freedesktop.org/enter_bug.cgi?product=cairo"
  980. | #define PACKAGE_URL "http://cairographics.org/"
  981. | #define STDC_HEADERS 1
  982. | #define HAVE_SYS_TYPES_H 1
  983. | #define HAVE_SYS_STAT_H 1
  984. | #define HAVE_STDLIB_H 1
  985. | #define HAVE_STRING_H 1
  986. | #define HAVE_MEMORY_H 1
  987. | #define HAVE_STRINGS_H 1
  988. | #define HAVE_INTTYPES_H 1
  989. | #define HAVE_STDINT_H 1
  990. | #define HAVE_UNISTD_H 1
  991. | #define __EXTENSIONS__ 1
  992. | #define _ALL_SOURCE 1
  993. | #define _GNU_SOURCE 1
  994. | #define _POSIX_PTHREAD_SEMANTICS 1
  995. | #define _TANDEM_SOURCE 1
  996. | #define HAVE_UNISTD_H 1
  997. | #define HAVE_SYS_IOCTL_H 1
  998. | #define HAVE_DLFCN_H 1
  999. | #define LT_OBJDIR ".libs/"
  1000. | #define WARN_UNUSED_RESULT __attribute__((__warn_unused_result__))
  1001. | /* end confdefs.h.  */
  1002. | #include <sys/types.h>
  1003. |       #include <sys/param.h>
  1004. |
  1005. | int
  1006. | main ()
  1007. | {
  1008. | #if BYTE_ORDER != BIG_ENDIAN
  1009. |        not big endian
  1010. |       #endif
  1011. |
  1012. |   ;
  1013. |   return 0;
  1014. | }
  1015. configure:18911: result: no
  1016. configure:18929: checking whether float word ordering is bigendian
  1017. configure:18956: gcc -c -march=x86-64 -mtune=generic -O2 -pipe -fstack-protector --param=ssp-buffer-size=4 -D_FORTIFY_SOURCE=2 conftest.c >&5
  1018. configure:18956: $? = 0
  1019. configure:18974: result: no
  1020. configure:19006: checking for native atomic primitives
  1021. configure:19028: gcc -o conftest -march=x86-64 -mtune=generic -O2 -pipe -fstack-protector --param=ssp-buffer-size=4 -D_FORTIFY_SOURCE=2 -Wl,-O1,--sort-common,--as-needed,-z,relro conftest.c  >&5
  1022. configure:19028: $? = 0
  1023. configure:19054: result: Intel
  1024. configure:19074: checking whether atomic ops require a memory barrier
  1025. configure:19088: result: no
  1026. configure:19104: checking size of void *
  1027. configure:19109: gcc -o conftest -march=x86-64 -mtune=generic -O2 -pipe -fstack-protector --param=ssp-buffer-size=4 -D_FORTIFY_SOURCE=2 -Wl,-O1,--sort-common,--as-needed,-z,relro conftest.c  >&5
  1028. configure:19109: $? = 0
  1029. configure:19109: ./conftest
  1030. configure:19109: $? = 0
  1031. configure:19123: result: 8
  1032. configure:19137: checking size of int
  1033. configure:19142: gcc -o conftest -march=x86-64 -mtune=generic -O2 -pipe -fstack-protector --param=ssp-buffer-size=4 -D_FORTIFY_SOURCE=2 -Wl,-O1,--sort-common,--as-needed,-z,relro conftest.c  >&5
  1034. configure:19142: $? = 0
  1035. configure:19142: ./conftest
  1036. configure:19142: $? = 0
  1037. configure:19156: result: 4
  1038. configure:19170: checking size of long
  1039. configure:19175: gcc -o conftest -march=x86-64 -mtune=generic -O2 -pipe -fstack-protector --param=ssp-buffer-size=4 -D_FORTIFY_SOURCE=2 -Wl,-O1,--sort-common,--as-needed,-z,relro conftest.c  >&5
  1040. configure:19175: $? = 0
  1041. configure:19175: ./conftest
  1042. configure:19175: $? = 0
  1043. configure:19189: result: 8
  1044. configure:19203: checking size of long long
  1045. configure:19208: gcc -o conftest -march=x86-64 -mtune=generic -O2 -pipe -fstack-protector --param=ssp-buffer-size=4 -D_FORTIFY_SOURCE=2 -Wl,-O1,--sort-common,--as-needed,-z,relro conftest.c  >&5
  1046. configure:19208: $? = 0
  1047. configure:19208: ./conftest
  1048. configure:19208: $? = 0
  1049. configure:19222: result: 8
  1050. configure:19236: checking size of size_t
  1051. configure:19241: gcc -o conftest -march=x86-64 -mtune=generic -O2 -pipe -fstack-protector --param=ssp-buffer-size=4 -D_FORTIFY_SOURCE=2 -Wl,-O1,--sort-common,--as-needed,-z,relro conftest.c  >&5
  1052. configure:19241: $? = 0
  1053. configure:19241: ./conftest
  1054. configure:19241: $? = 0
  1055. configure:19255: result: 8
  1056. configure:19266: checking for native Win32
  1057. configure:19276: result: no
  1058. configure:19287: checking for Sun Solaris (non-POSIX ctime_r)
  1059. configure:19298: result: no
  1060. configure:19390: checking for cos in -lm
  1061. configure:19415: gcc -o conftest -march=x86-64 -mtune=generic -O2 -pipe -fstack-protector --param=ssp-buffer-size=4 -D_FORTIFY_SOURCE=2 -Wl,-O1,--sort-common,--as-needed,-z,relro conftest.c -lm   >&5
  1062. conftest.c:42:6: warning: conflicting types for built-in function 'cos' [enabled by default]
  1063.  char cos ();
  1064.       ^
  1065. configure:19415: $? = 0
  1066. configure:19424: result: yes
  1067. configure:19436: checking for sched_yield in -lrt
  1068. configure:19461: gcc -o conftest -march=x86-64 -mtune=generic -O2 -pipe -fstack-protector --param=ssp-buffer-size=4 -D_FORTIFY_SOURCE=2 -Wl,-O1,--sort-common,--as-needed,-z,relro conftest.c -lrt   -lm >&5
  1069. configure:19461: $? = 0
  1070. configure:19470: result: yes
  1071. configure:19483: checking for shm_open in -lrt
  1072. configure:19508: gcc -o conftest -march=x86-64 -mtune=generic -O2 -pipe -fstack-protector --param=ssp-buffer-size=4 -D_FORTIFY_SOURCE=2 -Wl,-O1,--sort-common,--as-needed,-z,relro conftest.c -lrt  -lrt  -lm >&5
  1073. configure:19508: $? = 0
  1074. configure:19517: result: yes
  1075. configure:19538: checking for connect in -lsocket
  1076. configure:19563: gcc -o conftest -march=x86-64 -mtune=generic -O2 -pipe -fstack-protector --param=ssp-buffer-size=4 -D_FORTIFY_SOURCE=2 -Wl,-O1,--sort-common,--as-needed,-z,relro conftest.c -lsocket  -lrt  -lm >&5
  1077. /usr/bin/ld: cannot find -lsocket
  1078. collect2: error: ld returned 1 exit status
  1079. configure:19563: $? = 1
  1080. configure: failed program was:
  1081. | /* confdefs.h */
  1082. | #define PACKAGE_NAME "cairo"
  1083. | #define PACKAGE_TARNAME "cairo"
  1084. | #define PACKAGE_VERSION "1.12.16"
  1085. | #define PACKAGE_STRING "cairo 1.12.16"
  1086. | #define PACKAGE_BUGREPORT "http://bugs.freedesktop.org/enter_bug.cgi?product=cairo"
  1087. | #define PACKAGE_URL "http://cairographics.org/"
  1088. | #define STDC_HEADERS 1
  1089. | #define HAVE_SYS_TYPES_H 1
  1090. | #define HAVE_SYS_STAT_H 1
  1091. | #define HAVE_STDLIB_H 1
  1092. | #define HAVE_STRING_H 1
  1093. | #define HAVE_MEMORY_H 1
  1094. | #define HAVE_STRINGS_H 1
  1095. | #define HAVE_INTTYPES_H 1
  1096. | #define HAVE_STDINT_H 1
  1097. | #define HAVE_UNISTD_H 1
  1098. | #define __EXTENSIONS__ 1
  1099. | #define _ALL_SOURCE 1
  1100. | #define _GNU_SOURCE 1
  1101. | #define _POSIX_PTHREAD_SEMANTICS 1
  1102. | #define _TANDEM_SOURCE 1
  1103. | #define HAVE_UNISTD_H 1
  1104. | #define HAVE_SYS_IOCTL_H 1
  1105. | #define HAVE_DLFCN_H 1
  1106. | #define LT_OBJDIR ".libs/"
  1107. | #define WARN_UNUSED_RESULT __attribute__((__warn_unused_result__))
  1108. | #define HAVE_INTEL_ATOMIC_PRIMITIVES 1
  1109. | #define SIZEOF_VOID_P 8
  1110. | #define SIZEOF_INT 4
  1111. | #define SIZEOF_LONG 8
  1112. | #define SIZEOF_LONG_LONG 8
  1113. | #define SIZEOF_SIZE_T 8
  1114. | #define HAVE_LIBRT 1
  1115. | /* end confdefs.h.  */
  1116. |
  1117. | /* Override any GCC internal prototype to avoid an error.
  1118. |    Use char because int might match the return type of a GCC
  1119. |    builtin and then its argument prototype would still apply.  */
  1120. | #ifdef __cplusplus
  1121. | extern "C"
  1122. | #endif
  1123. | char connect ();
  1124. | int
  1125. | main ()
  1126. | {
  1127. | return connect ();
  1128. |   ;
  1129. |   return 0;
  1130. | }
  1131. configure:19572: result: no
  1132. configure:19584: checking for __builtin_return_address(0)
  1133. configure:19597: gcc -c -march=x86-64 -mtune=generic -O2 -pipe -fstack-protector --param=ssp-buffer-size=4 -D_FORTIFY_SOURCE=2 conftest.c >&5
  1134. configure:19597: $? = 0
  1135. configure:19603: result: yes
  1136. configure:19614: checking for stdint.h
  1137. configure:19614: result: yes
  1138. configure:19614: checking for inttypes.h
  1139. configure:19614: result: yes
  1140. configure:19614: checking sys/int_types.h usability
  1141. configure:19614: gcc -c -march=x86-64 -mtune=generic -O2 -pipe -fstack-protector --param=ssp-buffer-size=4 -D_FORTIFY_SOURCE=2 conftest.c >&5
  1142. conftest.c:72:27: fatal error: sys/int_types.h: No such file or directory
  1143.  #include <sys/int_types.h>
  1144.                            ^
  1145. compilation terminated.
  1146. configure:19614: $? = 1
  1147. configure: failed program was:
  1148. | /* confdefs.h */
  1149. | #define PACKAGE_NAME "cairo"
  1150. | #define PACKAGE_TARNAME "cairo"
  1151. | #define PACKAGE_VERSION "1.12.16"
  1152. | #define PACKAGE_STRING "cairo 1.12.16"
  1153. | #define PACKAGE_BUGREPORT "http://bugs.freedesktop.org/enter_bug.cgi?product=cairo"
  1154. | #define PACKAGE_URL "http://cairographics.org/"
  1155. | #define STDC_HEADERS 1
  1156. | #define HAVE_SYS_TYPES_H 1
  1157. | #define HAVE_SYS_STAT_H 1
  1158. | #define HAVE_STDLIB_H 1
  1159. | #define HAVE_STRING_H 1
  1160. | #define HAVE_MEMORY_H 1
  1161. | #define HAVE_STRINGS_H 1
  1162. | #define HAVE_INTTYPES_H 1
  1163. | #define HAVE_STDINT_H 1
  1164. | #define HAVE_UNISTD_H 1
  1165. | #define __EXTENSIONS__ 1
  1166. | #define _ALL_SOURCE 1
  1167. | #define _GNU_SOURCE 1
  1168. | #define _POSIX_PTHREAD_SEMANTICS 1
  1169. | #define _TANDEM_SOURCE 1
  1170. | #define HAVE_UNISTD_H 1
  1171. | #define HAVE_SYS_IOCTL_H 1
  1172. | #define HAVE_DLFCN_H 1
  1173. | #define LT_OBJDIR ".libs/"
  1174. | #define WARN_UNUSED_RESULT __attribute__((__warn_unused_result__))
  1175. | #define HAVE_INTEL_ATOMIC_PRIMITIVES 1
  1176. | #define SIZEOF_VOID_P 8
  1177. | #define SIZEOF_INT 4
  1178. | #define SIZEOF_LONG 8
  1179. | #define SIZEOF_LONG_LONG 8
  1180. | #define SIZEOF_SIZE_T 8
  1181. | #define HAVE_LIBRT 1
  1182. | #define HAVE_BUILTIN_RETURN_ADDRESS 1
  1183. | #define HAVE_STDINT_H 1
  1184. | #define HAVE_INTTYPES_H 1
  1185. | /* end confdefs.h.  */
  1186. | #include <stdio.h>
  1187. | #ifdef HAVE_SYS_TYPES_H
  1188. | # include <sys/types.h>
  1189. | #endif
  1190. | #ifdef HAVE_SYS_STAT_H
  1191. | # include <sys/stat.h>
  1192. | #endif
  1193. | #ifdef STDC_HEADERS
  1194. | # include <stdlib.h>
  1195. | # include <stddef.h>
  1196. | #else
  1197. | # ifdef HAVE_STDLIB_H
  1198. | #  include <stdlib.h>
  1199. | # endif
  1200. | #endif
  1201. | #ifdef HAVE_STRING_H
  1202. | # if !defined STDC_HEADERS && defined HAVE_MEMORY_H
  1203. | #  include <memory.h>
  1204. | # endif
  1205. | # include <string.h>
  1206. | #endif
  1207. | #ifdef HAVE_STRINGS_H
  1208. | # include <strings.h>
  1209. | #endif
  1210. | #ifdef HAVE_INTTYPES_H
  1211. | # include <inttypes.h>
  1212. | #endif
  1213. | #ifdef HAVE_STDINT_H
  1214. | # include <stdint.h>
  1215. | #endif
  1216. | #ifdef HAVE_UNISTD_H
  1217. | # include <unistd.h>
  1218. | #endif
  1219. | #include <sys/int_types.h>
  1220. configure:19614: result: no
  1221. configure:19614: checking sys/int_types.h presence
  1222. configure:19614: gcc -E -D_FORTIFY_SOURCE=2 conftest.c
  1223. conftest.c:39:27: fatal error: sys/int_types.h: No such file or directory
  1224.  #include <sys/int_types.h>
  1225.                            ^
  1226. compilation terminated.
  1227. configure:19614: $? = 1
  1228. configure: failed program was:
  1229. | /* confdefs.h */
  1230. | #define PACKAGE_NAME "cairo"
  1231. | #define PACKAGE_TARNAME "cairo"
  1232. | #define PACKAGE_VERSION "1.12.16"
  1233. | #define PACKAGE_STRING "cairo 1.12.16"
  1234. | #define PACKAGE_BUGREPORT "http://bugs.freedesktop.org/enter_bug.cgi?product=cairo"
  1235. | #define PACKAGE_URL "http://cairographics.org/"
  1236. | #define STDC_HEADERS 1
  1237. | #define HAVE_SYS_TYPES_H 1
  1238. | #define HAVE_SYS_STAT_H 1
  1239. | #define HAVE_STDLIB_H 1
  1240. | #define HAVE_STRING_H 1
  1241. | #define HAVE_MEMORY_H 1
  1242. | #define HAVE_STRINGS_H 1
  1243. | #define HAVE_INTTYPES_H 1
  1244. | #define HAVE_STDINT_H 1
  1245. | #define HAVE_UNISTD_H 1
  1246. | #define __EXTENSIONS__ 1
  1247. | #define _ALL_SOURCE 1
  1248. | #define _GNU_SOURCE 1
  1249. | #define _POSIX_PTHREAD_SEMANTICS 1
  1250. | #define _TANDEM_SOURCE 1
  1251. | #define HAVE_UNISTD_H 1
  1252. | #define HAVE_SYS_IOCTL_H 1
  1253. | #define HAVE_DLFCN_H 1
  1254. | #define LT_OBJDIR ".libs/"
  1255. | #define WARN_UNUSED_RESULT __attribute__((__warn_unused_result__))
  1256. | #define HAVE_INTEL_ATOMIC_PRIMITIVES 1
  1257. | #define SIZEOF_VOID_P 8
  1258. | #define SIZEOF_INT 4
  1259. | #define SIZEOF_LONG 8
  1260. | #define SIZEOF_LONG_LONG 8
  1261. | #define SIZEOF_SIZE_T 8
  1262. | #define HAVE_LIBRT 1
  1263. | #define HAVE_BUILTIN_RETURN_ADDRESS 1
  1264. | #define HAVE_STDINT_H 1
  1265. | #define HAVE_INTTYPES_H 1
  1266. | /* end confdefs.h.  */
  1267. | #include <sys/int_types.h>
  1268. configure:19614: result: no
  1269. configure:19614: checking for sys/int_types.h
  1270. configure:19614: result: no
  1271. configure:19624: checking for uint64_t
  1272. configure:19624: gcc -c -march=x86-64 -mtune=generic -O2 -pipe -fstack-protector --param=ssp-buffer-size=4 -D_FORTIFY_SOURCE=2 conftest.c >&5
  1273. configure:19624: $? = 0
  1274. configure:19624: gcc -c -march=x86-64 -mtune=generic -O2 -pipe -fstack-protector --param=ssp-buffer-size=4 -D_FORTIFY_SOURCE=2 conftest.c >&5
  1275. conftest.c: In function 'main':
  1276. conftest.c:75:23: error: expected expression before ')' token
  1277.  if (sizeof ((uint64_t)))
  1278.                        ^
  1279. configure:19624: $? = 1
  1280. configure: failed program was:
  1281. | /* confdefs.h */
  1282. | #define PACKAGE_NAME "cairo"
  1283. | #define PACKAGE_TARNAME "cairo"
  1284. | #define PACKAGE_VERSION "1.12.16"
  1285. | #define PACKAGE_STRING "cairo 1.12.16"
  1286. | #define PACKAGE_BUGREPORT "http://bugs.freedesktop.org/enter_bug.cgi?product=cairo"
  1287. | #define PACKAGE_URL "http://cairographics.org/"
  1288. | #define STDC_HEADERS 1
  1289. | #define HAVE_SYS_TYPES_H 1
  1290. | #define HAVE_SYS_STAT_H 1
  1291. | #define HAVE_STDLIB_H 1
  1292. | #define HAVE_STRING_H 1
  1293. | #define HAVE_MEMORY_H 1
  1294. | #define HAVE_STRINGS_H 1
  1295. | #define HAVE_INTTYPES_H 1
  1296. | #define HAVE_STDINT_H 1
  1297. | #define HAVE_UNISTD_H 1
  1298. | #define __EXTENSIONS__ 1
  1299. | #define _ALL_SOURCE 1
  1300. | #define _GNU_SOURCE 1
  1301. | #define _POSIX_PTHREAD_SEMANTICS 1
  1302. | #define _TANDEM_SOURCE 1
  1303. | #define HAVE_UNISTD_H 1
  1304. | #define HAVE_SYS_IOCTL_H 1
  1305. | #define HAVE_DLFCN_H 1
  1306. | #define LT_OBJDIR ".libs/"
  1307. | #define WARN_UNUSED_RESULT __attribute__((__warn_unused_result__))
  1308. | #define HAVE_INTEL_ATOMIC_PRIMITIVES 1
  1309. | #define SIZEOF_VOID_P 8
  1310. | #define SIZEOF_INT 4
  1311. | #define SIZEOF_LONG 8
  1312. | #define SIZEOF_LONG_LONG 8
  1313. | #define SIZEOF_SIZE_T 8
  1314. | #define HAVE_LIBRT 1
  1315. | #define HAVE_BUILTIN_RETURN_ADDRESS 1
  1316. | #define HAVE_STDINT_H 1
  1317. | #define HAVE_INTTYPES_H 1
  1318. | /* end confdefs.h.  */
  1319. | #include <stdio.h>
  1320. | #ifdef HAVE_SYS_TYPES_H
  1321. | # include <sys/types.h>
  1322. | #endif
  1323. | #ifdef HAVE_SYS_STAT_H
  1324. | # include <sys/stat.h>
  1325. | #endif
  1326. | #ifdef STDC_HEADERS
  1327. | # include <stdlib.h>
  1328. | # include <stddef.h>
  1329. | #else
  1330. | # ifdef HAVE_STDLIB_H
  1331. | #  include <stdlib.h>
  1332. | # endif
  1333. | #endif
  1334. | #ifdef HAVE_STRING_H
  1335. | # if !defined STDC_HEADERS && defined HAVE_MEMORY_H
  1336. | #  include <memory.h>
  1337. | # endif
  1338. | # include <string.h>
  1339. | #endif
  1340. | #ifdef HAVE_STRINGS_H
  1341. | # include <strings.h>
  1342. | #endif
  1343. | #ifdef HAVE_INTTYPES_H
  1344. | # include <inttypes.h>
  1345. | #endif
  1346. | #ifdef HAVE_STDINT_H
  1347. | # include <stdint.h>
  1348. | #endif
  1349. | #ifdef HAVE_UNISTD_H
  1350. | # include <unistd.h>
  1351. | #endif
  1352. | int
  1353. | main ()
  1354. | {
  1355. | if (sizeof ((uint64_t)))
  1356. |       return 0;
  1357. |   ;
  1358. |   return 0;
  1359. | }
  1360. configure:19624: result: yes
  1361. configure:19633: checking for uint128_t
  1362. configure:19633: gcc -c -march=x86-64 -mtune=generic -O2 -pipe -fstack-protector --param=ssp-buffer-size=4 -D_FORTIFY_SOURCE=2 conftest.c >&5
  1363. conftest.c: In function 'main':
  1364. conftest.c:76:13: error: 'uint128_t' undeclared (first use in this function)
  1365.  if (sizeof (uint128_t))
  1366.              ^
  1367. conftest.c:76:13: note: each undeclared identifier is reported only once for each function it appears in
  1368. configure:19633: $? = 1
  1369. configure: failed program was:
  1370. | /* confdefs.h */
  1371. | #define PACKAGE_NAME "cairo"
  1372. | #define PACKAGE_TARNAME "cairo"
  1373. | #define PACKAGE_VERSION "1.12.16"
  1374. | #define PACKAGE_STRING "cairo 1.12.16"
  1375. | #define PACKAGE_BUGREPORT "http://bugs.freedesktop.org/enter_bug.cgi?product=cairo"
  1376. | #define PACKAGE_URL "http://cairographics.org/"
  1377. | #define STDC_HEADERS 1
  1378. | #define HAVE_SYS_TYPES_H 1
  1379. | #define HAVE_SYS_STAT_H 1
  1380. | #define HAVE_STDLIB_H 1
  1381. | #define HAVE_STRING_H 1
  1382. | #define HAVE_MEMORY_H 1
  1383. | #define HAVE_STRINGS_H 1
  1384. | #define HAVE_INTTYPES_H 1
  1385. | #define HAVE_STDINT_H 1
  1386. | #define HAVE_UNISTD_H 1
  1387. | #define __EXTENSIONS__ 1
  1388. | #define _ALL_SOURCE 1
  1389. | #define _GNU_SOURCE 1
  1390. | #define _POSIX_PTHREAD_SEMANTICS 1
  1391. | #define _TANDEM_SOURCE 1
  1392. | #define HAVE_UNISTD_H 1
  1393. | #define HAVE_SYS_IOCTL_H 1
  1394. | #define HAVE_DLFCN_H 1
  1395. | #define LT_OBJDIR ".libs/"
  1396. | #define WARN_UNUSED_RESULT __attribute__((__warn_unused_result__))
  1397. | #define HAVE_INTEL_ATOMIC_PRIMITIVES 1
  1398. | #define SIZEOF_VOID_P 8
  1399. | #define SIZEOF_INT 4
  1400. | #define SIZEOF_LONG 8
  1401. | #define SIZEOF_LONG_LONG 8
  1402. | #define SIZEOF_SIZE_T 8
  1403. | #define HAVE_LIBRT 1
  1404. | #define HAVE_BUILTIN_RETURN_ADDRESS 1
  1405. | #define HAVE_STDINT_H 1
  1406. | #define HAVE_INTTYPES_H 1
  1407. | #define HAVE_UINT64_T 1
  1408. | /* end confdefs.h.  */
  1409. | #include <stdio.h>
  1410. | #ifdef HAVE_SYS_TYPES_H
  1411. | # include <sys/types.h>
  1412. | #endif
  1413. | #ifdef HAVE_SYS_STAT_H
  1414. | # include <sys/stat.h>
  1415. | #endif
  1416. | #ifdef STDC_HEADERS
  1417. | # include <stdlib.h>
  1418. | # include <stddef.h>
  1419. | #else
  1420. | # ifdef HAVE_STDLIB_H
  1421. | #  include <stdlib.h>
  1422. | # endif
  1423. | #endif
  1424. | #ifdef HAVE_STRING_H
  1425. | # if !defined STDC_HEADERS && defined HAVE_MEMORY_H
  1426. | #  include <memory.h>
  1427. | # endif
  1428. | # include <string.h>
  1429. | #endif
  1430. | #ifdef HAVE_STRINGS_H
  1431. | # include <strings.h>
  1432. | #endif
  1433. | #ifdef HAVE_INTTYPES_H
  1434. | # include <inttypes.h>
  1435. | #endif
  1436. | #ifdef HAVE_STDINT_H
  1437. | # include <stdint.h>
  1438. | #endif
  1439. | #ifdef HAVE_UNISTD_H
  1440. | # include <unistd.h>
  1441. | #endif
  1442. | int
  1443. | main ()
  1444. | {
  1445. | if (sizeof (uint128_t))
  1446. |    return 0;
  1447. |   ;
  1448. |   return 0;
  1449. | }
  1450. configure:19633: result: no
  1451. configure:19642: checking for __uint128_t
  1452. configure:19642: gcc -c -march=x86-64 -mtune=generic -O2 -pipe -fstack-protector --param=ssp-buffer-size=4 -D_FORTIFY_SOURCE=2 conftest.c >&5
  1453. configure:19642: $? = 0
  1454. configure:19642: gcc -c -march=x86-64 -mtune=generic -O2 -pipe -fstack-protector --param=ssp-buffer-size=4 -D_FORTIFY_SOURCE=2 conftest.c >&5
  1455. conftest.c: In function 'main':
  1456. conftest.c:76:26: error: expected expression before ')' token
  1457.  if (sizeof ((__uint128_t)))
  1458.                           ^
  1459. configure:19642: $? = 1
  1460. configure: failed program was:
  1461. | /* confdefs.h */
  1462. | #define PACKAGE_NAME "cairo"
  1463. | #define PACKAGE_TARNAME "cairo"
  1464. | #define PACKAGE_VERSION "1.12.16"
  1465. | #define PACKAGE_STRING "cairo 1.12.16"
  1466. | #define PACKAGE_BUGREPORT "http://bugs.freedesktop.org/enter_bug.cgi?product=cairo"
  1467. | #define PACKAGE_URL "http://cairographics.org/"
  1468. | #define STDC_HEADERS 1
  1469. | #define HAVE_SYS_TYPES_H 1
  1470. | #define HAVE_SYS_STAT_H 1
  1471. | #define HAVE_STDLIB_H 1
  1472. | #define HAVE_STRING_H 1
  1473. | #define HAVE_MEMORY_H 1
  1474. | #define HAVE_STRINGS_H 1
  1475. | #define HAVE_INTTYPES_H 1
  1476. | #define HAVE_STDINT_H 1
  1477. | #define HAVE_UNISTD_H 1
  1478. | #define __EXTENSIONS__ 1
  1479. | #define _ALL_SOURCE 1
  1480. | #define _GNU_SOURCE 1
  1481. | #define _POSIX_PTHREAD_SEMANTICS 1
  1482. | #define _TANDEM_SOURCE 1
  1483. | #define HAVE_UNISTD_H 1
  1484. | #define HAVE_SYS_IOCTL_H 1
  1485. | #define HAVE_DLFCN_H 1
  1486. | #define LT_OBJDIR ".libs/"
  1487. | #define WARN_UNUSED_RESULT __attribute__((__warn_unused_result__))
  1488. | #define HAVE_INTEL_ATOMIC_PRIMITIVES 1
  1489. | #define SIZEOF_VOID_P 8
  1490. | #define SIZEOF_INT 4
  1491. | #define SIZEOF_LONG 8
  1492. | #define SIZEOF_LONG_LONG 8
  1493. | #define SIZEOF_SIZE_T 8
  1494. | #define HAVE_LIBRT 1
  1495. | #define HAVE_BUILTIN_RETURN_ADDRESS 1
  1496. | #define HAVE_STDINT_H 1
  1497. | #define HAVE_INTTYPES_H 1
  1498. | #define HAVE_UINT64_T 1
  1499. | /* end confdefs.h.  */
  1500. | #include <stdio.h>
  1501. | #ifdef HAVE_SYS_TYPES_H
  1502. | # include <sys/types.h>
  1503. | #endif
  1504. | #ifdef HAVE_SYS_STAT_H
  1505. | # include <sys/stat.h>
  1506. | #endif
  1507. | #ifdef STDC_HEADERS
  1508. | # include <stdlib.h>
  1509. | # include <stddef.h>
  1510. | #else
  1511. | # ifdef HAVE_STDLIB_H
  1512. | #  include <stdlib.h>
  1513. | # endif
  1514. | #endif
  1515. | #ifdef HAVE_STRING_H
  1516. | # if !defined STDC_HEADERS && defined HAVE_MEMORY_H
  1517. | #  include <memory.h>
  1518. | # endif
  1519. | # include <string.h>
  1520. | #endif
  1521. | #ifdef HAVE_STRINGS_H
  1522. | # include <strings.h>
  1523. | #endif
  1524. | #ifdef HAVE_INTTYPES_H
  1525. | # include <inttypes.h>
  1526. | #endif
  1527. | #ifdef HAVE_STDINT_H
  1528. | # include <stdint.h>
  1529. | #endif
  1530. | #ifdef HAVE_UNISTD_H
  1531. | # include <unistd.h>
  1532. | #endif
  1533. | int
  1534. | main ()
  1535. | {
  1536. | if (sizeof ((__uint128_t)))
  1537. |       return 0;
  1538. |   ;
  1539. |   return 0;
  1540. | }
  1541. configure:19642: result: yes
  1542. configure:19656: checking fcntl.h usability
  1543. configure:19656: gcc -c -march=x86-64 -mtune=generic -O2 -pipe -fstack-protector --param=ssp-buffer-size=4 -D_FORTIFY_SOURCE=2 conftest.c >&5
  1544. configure:19656: $? = 0
  1545. configure:19656: result: yes
  1546. configure:19656: checking fcntl.h presence
  1547. configure:19656: gcc -E -D_FORTIFY_SOURCE=2 conftest.c
  1548. In file included from /usr/include/fcntl.h:25:0,
  1549.                  from conftest.c:41:
  1550. /usr/include/features.h:327:4: warning: #warning _FORTIFY_SOURCE requires compiling with optimization (-O) [-Wcpp]
  1551.  #  warning _FORTIFY_SOURCE requires compiling with optimization (-O)
  1552.     ^
  1553. configure:19656: $? = 0
  1554. configure:19656: result: yes
  1555. configure:19656: checking for fcntl.h
  1556. configure:19656: result: yes
  1557. configure:19656: checking for unistd.h
  1558. configure:19656: result: yes
  1559. configure:19656: checking signal.h usability
  1560. configure:19656: gcc -c -march=x86-64 -mtune=generic -O2 -pipe -fstack-protector --param=ssp-buffer-size=4 -D_FORTIFY_SOURCE=2 conftest.c >&5
  1561. configure:19656: $? = 0
  1562. configure:19656: result: yes
  1563. configure:19656: checking signal.h presence
  1564. configure:19656: gcc -E -D_FORTIFY_SOURCE=2 conftest.c
  1565. In file included from /usr/include/signal.h:28:0,
  1566.                  from conftest.c:43:
  1567. /usr/include/features.h:327:4: warning: #warning _FORTIFY_SOURCE requires compiling with optimization (-O) [-Wcpp]
  1568.  #  warning _FORTIFY_SOURCE requires compiling with optimization (-O)
  1569.     ^
  1570. configure:19656: $? = 0
  1571. configure:19656: result: yes
  1572. configure:19656: checking for signal.h
  1573. configure:19656: result: yes
  1574. configure:19656: checking for sys/stat.h
  1575. configure:19656: result: yes
  1576. configure:19656: checking sys/socket.h usability
  1577. configure:19656: gcc -c -march=x86-64 -mtune=generic -O2 -pipe -fstack-protector --param=ssp-buffer-size=4 -D_FORTIFY_SOURCE=2 conftest.c >&5
  1578. configure:19656: $? = 0
  1579. configure:19656: result: yes
  1580. configure:19656: checking sys/socket.h presence
  1581. configure:19656: gcc -E -D_FORTIFY_SOURCE=2 conftest.c
  1582. In file included from /usr/include/sys/socket.h:22:0,
  1583.                  from conftest.c:45:
  1584. /usr/include/features.h:327:4: warning: #warning _FORTIFY_SOURCE requires compiling with optimization (-O) [-Wcpp]
  1585.  #  warning _FORTIFY_SOURCE requires compiling with optimization (-O)
  1586.     ^
  1587. configure:19656: $? = 0
  1588. configure:19656: result: yes
  1589. configure:19656: checking for sys/socket.h
  1590. configure:19656: result: yes
  1591. configure:19656: checking sys/poll.h usability
  1592. configure:19656: gcc -c -march=x86-64 -mtune=generic -O2 -pipe -fstack-protector --param=ssp-buffer-size=4 -D_FORTIFY_SOURCE=2 conftest.c >&5
  1593. configure:19656: $? = 0
  1594. configure:19656: result: yes
  1595. configure:19656: checking sys/poll.h presence
  1596. configure:19656: gcc -E -D_FORTIFY_SOURCE=2 conftest.c
  1597. In file included from /usr/include/sys/poll.h:22:0,
  1598.                  from conftest.c:46:
  1599. /usr/include/features.h:327:4: warning: #warning _FORTIFY_SOURCE requires compiling with optimization (-O) [-Wcpp]
  1600.  #  warning _FORTIFY_SOURCE requires compiling with optimization (-O)
  1601.     ^
  1602. configure:19656: $? = 0
  1603. configure:19656: result: yes
  1604. configure:19656: checking for sys/poll.h
  1605. configure:19656: result: yes
  1606. configure:19656: checking sys/un.h usability
  1607. configure:19656: gcc -c -march=x86-64 -mtune=generic -O2 -pipe -fstack-protector --param=ssp-buffer-size=4 -D_FORTIFY_SOURCE=2 conftest.c >&5
  1608. configure:19656: $? = 0
  1609. configure:19656: result: yes
  1610. configure:19656: checking sys/un.h presence
  1611. configure:19656: gcc -E -D_FORTIFY_SOURCE=2 conftest.c
  1612. In file included from /usr/include/sys/cdefs.h:23:0,
  1613.                  from /usr/include/sys/un.h:21,
  1614.                  from conftest.c:47:
  1615. /usr/include/features.h:327:4: warning: #warning _FORTIFY_SOURCE requires compiling with optimization (-O) [-Wcpp]
  1616.  #  warning _FORTIFY_SOURCE requires compiling with optimization (-O)
  1617.     ^
  1618. configure:19656: $? = 0
  1619. configure:19656: result: yes
  1620. configure:19656: checking for sys/un.h
  1621. configure:19656: result: yes
  1622. configure:19669: checking for alarm
  1623. configure:19669: gcc -o conftest -march=x86-64 -mtune=generic -O2 -pipe -fstack-protector --param=ssp-buffer-size=4 -D_FORTIFY_SOURCE=2 -Wl,-O1,--sort-common,--as-needed,-z,relro conftest.c -lrt  -lm >&5
  1624. configure:19669: $? = 0
  1625. configure:19669: result: yes
  1626. configure:19681: checking sched.h usability
  1627. configure:19681: gcc -c -march=x86-64 -mtune=generic -O2 -pipe -fstack-protector --param=ssp-buffer-size=4 -D_FORTIFY_SOURCE=2 conftest.c >&5
  1628. configure:19681: $? = 0
  1629. configure:19681: result: yes
  1630. configure:19681: checking sched.h presence
  1631. configure:19681: gcc -E -D_FORTIFY_SOURCE=2 conftest.c
  1632. In file included from /usr/include/sched.h:22:0,
  1633.                  from conftest.c:49:
  1634. /usr/include/features.h:327:4: warning: #warning _FORTIFY_SOURCE requires compiling with optimization (-O) [-Wcpp]
  1635.  #  warning _FORTIFY_SOURCE requires compiling with optimization (-O)
  1636.     ^
  1637. configure:19681: $? = 0
  1638. configure:19681: result: yes
  1639. configure:19681: checking for sched.h
  1640. configure:19681: result: yes
  1641. configure:19688: checking for sched_getaffinity
  1642. configure:19688: gcc -o conftest -march=x86-64 -mtune=generic -O2 -pipe -fstack-protector --param=ssp-buffer-size=4 -D_FORTIFY_SOURCE=2 -Wl,-O1,--sort-common,--as-needed,-z,relro conftest.c -lrt  -lm >&5
  1643. configure:19688: $? = 0
  1644. configure:19688: result: yes
  1645. configure:19704: checking sys/mman.h usability
  1646. configure:19704: gcc -c -march=x86-64 -mtune=generic -O2 -pipe -fstack-protector --param=ssp-buffer-size=4 -D_FORTIFY_SOURCE=2 conftest.c >&5
  1647. configure:19704: $? = 0
  1648. configure:19704: result: yes
  1649. configure:19704: checking sys/mman.h presence
  1650. configure:19704: gcc -E -D_FORTIFY_SOURCE=2 conftest.c
  1651. In file included from /usr/include/sys/mman.h:22:0,
  1652.                  from conftest.c:51:
  1653. /usr/include/features.h:327:4: warning: #warning _FORTIFY_SOURCE requires compiling with optimization (-O) [-Wcpp]
  1654.  #  warning _FORTIFY_SOURCE requires compiling with optimization (-O)
  1655.     ^
  1656. configure:19704: $? = 0
  1657. configure:19704: result: yes
  1658. configure:19704: checking for sys/mman.h
  1659. configure:19704: result: yes
  1660. configure:19711: checking for mmap
  1661. configure:19711: gcc -o conftest -march=x86-64 -mtune=generic -O2 -pipe -fstack-protector --param=ssp-buffer-size=4 -D_FORTIFY_SOURCE=2 -Wl,-O1,--sort-common,--as-needed,-z,relro conftest.c -lrt  -lm >&5
  1662. configure:19711: $? = 0
  1663. configure:19711: result: yes
  1664. configure:19727: checking time.h usability
  1665. configure:19727: gcc -c -march=x86-64 -mtune=generic -O2 -pipe -fstack-protector --param=ssp-buffer-size=4 -D_FORTIFY_SOURCE=2 conftest.c >&5
  1666. configure:19727: $? = 0
  1667. configure:19727: result: yes
  1668. configure:19727: checking time.h presence
  1669. configure:19727: gcc -E -D_FORTIFY_SOURCE=2 conftest.c
  1670. In file included from /usr/include/time.h:27:0,
  1671.                  from conftest.c:53:
  1672. /usr/include/features.h:327:4: warning: #warning _FORTIFY_SOURCE requires compiling with optimization (-O) [-Wcpp]
  1673.  #  warning _FORTIFY_SOURCE requires compiling with optimization (-O)
  1674.     ^
  1675. configure:19727: $? = 0
  1676. configure:19727: result: yes
  1677. configure:19727: checking for time.h
  1678. configure:19727: result: yes
  1679. configure:19734: checking for clock_gettime
  1680. configure:19734: gcc -o conftest -march=x86-64 -mtune=generic -O2 -pipe -fstack-protector --param=ssp-buffer-size=4 -D_FORTIFY_SOURCE=2 -Wl,-O1,--sort-common,--as-needed,-z,relro conftest.c -lrt  -lm >&5
  1681. configure:19734: $? = 0
  1682. configure:19734: result: yes
  1683. configure:19748: checking fenv.h usability
  1684. configure:19748: gcc -c -march=x86-64 -mtune=generic -O2 -pipe -fstack-protector --param=ssp-buffer-size=4 -D_FORTIFY_SOURCE=2 conftest.c >&5
  1685. configure:19748: $? = 0
  1686. configure:19748: result: yes
  1687. configure:19748: checking fenv.h presence
  1688. configure:19748: gcc -E -D_FORTIFY_SOURCE=2 conftest.c
  1689. In file included from /usr/include/fenv.h:25:0,
  1690.                  from conftest.c:55:
  1691. /usr/include/features.h:327:4: warning: #warning _FORTIFY_SOURCE requires compiling with optimization (-O) [-Wcpp]
  1692.  #  warning _FORTIFY_SOURCE requires compiling with optimization (-O)
  1693.     ^
  1694. configure:19748: $? = 0
  1695. configure:19748: result: yes
  1696. configure:19748: checking for fenv.h
  1697. configure:19748: result: yes
  1698. configure:19753: checking for feenableexcept
  1699. configure:19753: gcc -o conftest -march=x86-64 -mtune=generic -O2 -pipe -fstack-protector --param=ssp-buffer-size=4 -D_FORTIFY_SOURCE=2 -Wl,-O1,--sort-common,--as-needed,-z,relro conftest.c -lrt  -lm >&5
  1700. configure:19753: $? = 0
  1701. configure:19753: result: yes
  1702. configure:19753: checking for fedisableexcept
  1703. configure:19753: gcc -o conftest -march=x86-64 -mtune=generic -O2 -pipe -fstack-protector --param=ssp-buffer-size=4 -D_FORTIFY_SOURCE=2 -Wl,-O1,--sort-common,--as-needed,-z,relro conftest.c -lrt  -lm >&5
  1704. configure:19753: $? = 0
  1705. configure:19753: result: yes
  1706. configure:19753: checking for feclearexcept
  1707. configure:19753: gcc -o conftest -march=x86-64 -mtune=generic -O2 -pipe -fstack-protector --param=ssp-buffer-size=4 -D_FORTIFY_SOURCE=2 -Wl,-O1,--sort-common,--as-needed,-z,relro conftest.c -lrt  -lm >&5
  1708. configure:19753: $? = 0
  1709. configure:19753: result: yes
  1710. configure:19769: checking libgen.h usability
  1711. configure:19769: gcc -c -march=x86-64 -mtune=generic -O2 -pipe -fstack-protector --param=ssp-buffer-size=4 -D_FORTIFY_SOURCE=2 conftest.c >&5
  1712. configure:19769: $? = 0
  1713. configure:19769: result: yes
  1714. configure:19769: checking libgen.h presence
  1715. configure:19769: gcc -E -D_FORTIFY_SOURCE=2 conftest.c
  1716. In file included from /usr/include/libgen.h:21:0,
  1717.                  from conftest.c:58:
  1718. /usr/include/features.h:327:4: warning: #warning _FORTIFY_SOURCE requires compiling with optimization (-O) [-Wcpp]
  1719.  #  warning _FORTIFY_SOURCE requires compiling with optimization (-O)
  1720.     ^
  1721. configure:19769: $? = 0
  1722. configure:19769: result: yes
  1723. configure:19769: checking for libgen.h
  1724. configure:19769: result: yes
  1725. configure:19769: checking byteswap.h usability
  1726. configure:19769: gcc -c -march=x86-64 -mtune=generic -O2 -pipe -fstack-protector --param=ssp-buffer-size=4 -D_FORTIFY_SOURCE=2 conftest.c >&5
  1727. configure:19769: $? = 0
  1728. configure:19769: result: yes
  1729. configure:19769: checking byteswap.h presence
  1730. configure:19769: gcc -E -D_FORTIFY_SOURCE=2 conftest.c
  1731. In file included from /usr/include/byteswap.h:21:0,
  1732.                  from conftest.c:59:
  1733. /usr/include/features.h:327:4: warning: #warning _FORTIFY_SOURCE requires compiling with optimization (-O) [-Wcpp]
  1734.  #  warning _FORTIFY_SOURCE requires compiling with optimization (-O)
  1735.     ^
  1736. configure:19769: $? = 0
  1737. configure:19769: result: yes
  1738. configure:19769: checking for byteswap.h
  1739. configure:19769: result: yes
  1740. configure:19769: checking for signal.h
  1741. configure:19769: result: yes
  1742. configure:19769: checking setjmp.h usability
  1743. configure:19769: gcc -c -march=x86-64 -mtune=generic -O2 -pipe -fstack-protector --param=ssp-buffer-size=4 -D_FORTIFY_SOURCE=2 conftest.c >&5
  1744. configure:19769: $? = 0
  1745. configure:19769: result: yes
  1746. configure:19769: checking setjmp.h presence
  1747. configure:19769: gcc -E -D_FORTIFY_SOURCE=2 conftest.c
  1748. In file included from /usr/include/setjmp.h:25:0,
  1749.                  from conftest.c:61:
  1750. /usr/include/features.h:327:4: warning: #warning _FORTIFY_SOURCE requires compiling with optimization (-O) [-Wcpp]
  1751.  #  warning _FORTIFY_SOURCE requires compiling with optimization (-O)
  1752.     ^
  1753. configure:19769: $? = 0
  1754. configure:19769: result: yes
  1755. configure:19769: checking for setjmp.h
  1756. configure:19769: result: yes
  1757. configure:19769: checking for fenv.h
  1758. configure:19769: result: yes
  1759. configure:19769: checking sys/wait.h usability
  1760. configure:19769: gcc -c -march=x86-64 -mtune=generic -O2 -pipe -fstack-protector --param=ssp-buffer-size=4 -D_FORTIFY_SOURCE=2 conftest.c >&5
  1761. configure:19769: $? = 0
  1762. configure:19769: result: yes
  1763. configure:19769: checking sys/wait.h presence
  1764. configure:19769: gcc -E -D_FORTIFY_SOURCE=2 conftest.c
  1765. In file included from /usr/include/sys/wait.h:25:0,
  1766.                  from conftest.c:63:
  1767. /usr/include/features.h:327:4: warning: #warning _FORTIFY_SOURCE requires compiling with optimization (-O) [-Wcpp]
  1768.  #  warning _FORTIFY_SOURCE requires compiling with optimization (-O)
  1769.     ^
  1770. configure:19769: $? = 0
  1771. configure:19769: result: yes
  1772. configure:19769: checking for sys/wait.h
  1773. configure:19769: result: yes
  1774. configure:19782: checking for ctime_r
  1775. configure:19782: gcc -o conftest -march=x86-64 -mtune=generic -O2 -pipe -fstack-protector --param=ssp-buffer-size=4 -D_FORTIFY_SOURCE=2 -Wl,-O1,--sort-common,--as-needed,-z,relro conftest.c -lrt  -lm >&5
  1776. configure:19782: $? = 0
  1777. configure:19782: result: yes
  1778. configure:19782: checking for drand48
  1779. configure:19782: gcc -o conftest -march=x86-64 -mtune=generic -O2 -pipe -fstack-protector --param=ssp-buffer-size=4 -D_FORTIFY_SOURCE=2 -Wl,-O1,--sort-common,--as-needed,-z,relro conftest.c -lrt  -lm >&5
  1780. configure:19782: $? = 0
  1781. configure:19782: result: yes
  1782. configure:19782: checking for flockfile
  1783. configure:19782: gcc -o conftest -march=x86-64 -mtune=generic -O2 -pipe -fstack-protector --param=ssp-buffer-size=4 -D_FORTIFY_SOURCE=2 -Wl,-O1,--sort-common,--as-needed,-z,relro conftest.c -lrt  -lm >&5
  1784. configure:19782: $? = 0
  1785. configure:19782: result: yes
  1786. configure:19782: checking for funlockfile
  1787. configure:19782: gcc -o conftest -march=x86-64 -mtune=generic -O2 -pipe -fstack-protector --param=ssp-buffer-size=4 -D_FORTIFY_SOURCE=2 -Wl,-O1,--sort-common,--as-needed,-z,relro conftest.c -lrt  -lm >&5
  1788. configure:19782: $? = 0
  1789. configure:19782: result: yes
  1790. configure:19782: checking for getline
  1791. configure:19782: gcc -o conftest -march=x86-64 -mtune=generic -O2 -pipe -fstack-protector --param=ssp-buffer-size=4 -D_FORTIFY_SOURCE=2 -Wl,-O1,--sort-common,--as-needed,-z,relro conftest.c -lrt  -lm >&5
  1792. configure:19782: $? = 0
  1793. configure:19782: result: yes
  1794. configure:19782: checking for link
  1795. configure:19782: gcc -o conftest -march=x86-64 -mtune=generic -O2 -pipe -fstack-protector --param=ssp-buffer-size=4 -D_FORTIFY_SOURCE=2 -Wl,-O1,--sort-common,--as-needed,-z,relro conftest.c -lrt  -lm >&5
  1796. configure:19782: $? = 0
  1797. configure:19782: result: yes
  1798. configure:19782: checking for strndup
  1799. configure:19782: gcc -o conftest -march=x86-64 -mtune=generic -O2 -pipe -fstack-protector --param=ssp-buffer-size=4 -D_FORTIFY_SOURCE=2 -Wl,-O1,--sort-common,--as-needed,-z,relro conftest.c -lrt  -lm >&5
  1800. conftest.c:93:6: warning: conflicting types for built-in function 'strndup' [enabled by default]
  1801.  char strndup ();
  1802.       ^
  1803. configure:19782: $? = 0
  1804. configure:19782: result: yes
  1805. configure:19794: checking windows.h usability
  1806. configure:19794: gcc -c -march=x86-64 -mtune=generic -O2 -pipe -fstack-protector --param=ssp-buffer-size=4 -D_FORTIFY_SOURCE=2 conftest.c >&5
  1807. conftest.c:104:21: fatal error: windows.h: No such file or directory
  1808.  #include <windows.h>
  1809.                      ^
  1810. compilation terminated.
  1811. configure:19794: $? = 1
  1812. configure: failed program was:
  1813. | /* confdefs.h */
  1814. | #define PACKAGE_NAME "cairo"
  1815. | #define PACKAGE_TARNAME "cairo"
  1816. | #define PACKAGE_VERSION "1.12.16"
  1817. | #define PACKAGE_STRING "cairo 1.12.16"
  1818. | #define PACKAGE_BUGREPORT "http://bugs.freedesktop.org/enter_bug.cgi?product=cairo"
  1819. | #define PACKAGE_URL "http://cairographics.org/"
  1820. | #define STDC_HEADERS 1
  1821. | #define HAVE_SYS_TYPES_H 1
  1822. | #define HAVE_SYS_STAT_H 1
  1823. | #define HAVE_STDLIB_H 1
  1824. | #define HAVE_STRING_H 1
  1825. | #define HAVE_MEMORY_H 1
  1826. | #define HAVE_STRINGS_H 1
  1827. | #define HAVE_INTTYPES_H 1
  1828. | #define HAVE_STDINT_H 1
  1829. | #define HAVE_UNISTD_H 1
  1830. | #define __EXTENSIONS__ 1
  1831. | #define _ALL_SOURCE 1
  1832. | #define _GNU_SOURCE 1
  1833. | #define _POSIX_PTHREAD_SEMANTICS 1
  1834. | #define _TANDEM_SOURCE 1
  1835. | #define HAVE_UNISTD_H 1
  1836. | #define HAVE_SYS_IOCTL_H 1
  1837. | #define HAVE_DLFCN_H 1
  1838. | #define LT_OBJDIR ".libs/"
  1839. | #define WARN_UNUSED_RESULT __attribute__((__warn_unused_result__))
  1840. | #define HAVE_INTEL_ATOMIC_PRIMITIVES 1
  1841. | #define SIZEOF_VOID_P 8
  1842. | #define SIZEOF_INT 4
  1843. | #define SIZEOF_LONG 8
  1844. | #define SIZEOF_LONG_LONG 8
  1845. | #define SIZEOF_SIZE_T 8
  1846. | #define HAVE_LIBRT 1
  1847. | #define HAVE_BUILTIN_RETURN_ADDRESS 1
  1848. | #define HAVE_STDINT_H 1
  1849. | #define HAVE_INTTYPES_H 1
  1850. | #define HAVE_UINT64_T 1
  1851. | #define HAVE___UINT128_T 1
  1852. | #define HAVE_FCNTL_H 1
  1853. | #define HAVE_UNISTD_H 1
  1854. | #define HAVE_SIGNAL_H 1
  1855. | #define HAVE_SYS_STAT_H 1
  1856. | #define HAVE_SYS_SOCKET_H 1
  1857. | #define HAVE_SYS_POLL_H 1
  1858. | #define HAVE_SYS_UN_H 1
  1859. | #define HAVE_ALARM 1
  1860. | #define HAVE_SCHED_H 1
  1861. | #define HAVE_SCHED_GETAFFINITY 1
  1862. | #define HAVE_SYS_MMAN_H 1
  1863. | #define HAVE_MMAP 1
  1864. | #define HAVE_TIME_H 1
  1865. | #define HAVE_CLOCK_GETTIME 1
  1866. | #define HAVE_FEENABLEEXCEPT 1
  1867. | #define HAVE_FEDISABLEEXCEPT 1
  1868. | #define HAVE_FECLEAREXCEPT 1
  1869. | #define HAVE_LIBGEN_H 1
  1870. | #define HAVE_BYTESWAP_H 1
  1871. | #define HAVE_SIGNAL_H 1
  1872. | #define HAVE_SETJMP_H 1
  1873. | #define HAVE_FENV_H 1
  1874. | #define HAVE_SYS_WAIT_H 1
  1875. | #define HAVE_CTIME_R 1
  1876. | #define HAVE_DRAND48 1
  1877. | #define HAVE_FLOCKFILE 1
  1878. | #define HAVE_FUNLOCKFILE 1
  1879. | #define HAVE_GETLINE 1
  1880. | #define HAVE_LINK 1
  1881. | #define HAVE_STRNDUP 1
  1882. | /* end confdefs.h.  */
  1883. | #include <stdio.h>
  1884. | #ifdef HAVE_SYS_TYPES_H
  1885. | # include <sys/types.h>
  1886. | #endif
  1887. | #ifdef HAVE_SYS_STAT_H
  1888. | # include <sys/stat.h>
  1889. | #endif
  1890. | #ifdef STDC_HEADERS
  1891. | # include <stdlib.h>
  1892. | # include <stddef.h>
  1893. | #else
  1894. | # ifdef HAVE_STDLIB_H
  1895. | #  include <stdlib.h>
  1896. | # endif
  1897. | #endif
  1898. | #ifdef HAVE_STRING_H
  1899. | # if !defined STDC_HEADERS && defined HAVE_MEMORY_H
  1900. | #  include <memory.h>
  1901. | # endif
  1902. | # include <string.h>
  1903. | #endif
  1904. | #ifdef HAVE_STRINGS_H
  1905. | # include <strings.h>
  1906. | #endif
  1907. | #ifdef HAVE_INTTYPES_H
  1908. | # include <inttypes.h>
  1909. | #endif
  1910. | #ifdef HAVE_STDINT_H
  1911. | # include <stdint.h>
  1912. | #endif
  1913. | #ifdef HAVE_UNISTD_H
  1914. | # include <unistd.h>
  1915. | #endif
  1916. | #include <windows.h>
  1917. configure:19794: result: no
  1918. configure:19794: checking windows.h presence
  1919. configure:19794: gcc -E -D_FORTIFY_SOURCE=2 conftest.c
  1920. conftest.c:71:21: fatal error: windows.h: No such file or directory
  1921.  #include <windows.h>
  1922.                      ^
  1923. compilation terminated.
  1924. configure:19794: $? = 1
  1925. configure: failed program was:
  1926. | /* confdefs.h */
  1927. | #define PACKAGE_NAME "cairo"
  1928. | #define PACKAGE_TARNAME "cairo"
  1929. | #define PACKAGE_VERSION "1.12.16"
  1930. | #define PACKAGE_STRING "cairo 1.12.16"
  1931. | #define PACKAGE_BUGREPORT "http://bugs.freedesktop.org/enter_bug.cgi?product=cairo"
  1932. | #define PACKAGE_URL "http://cairographics.org/"
  1933. | #define STDC_HEADERS 1
  1934. | #define HAVE_SYS_TYPES_H 1
  1935. | #define HAVE_SYS_STAT_H 1
  1936. | #define HAVE_STDLIB_H 1
  1937. | #define HAVE_STRING_H 1
  1938. | #define HAVE_MEMORY_H 1
  1939. | #define HAVE_STRINGS_H 1
  1940. | #define HAVE_INTTYPES_H 1
  1941. | #define HAVE_STDINT_H 1
  1942. | #define HAVE_UNISTD_H 1
  1943. | #define __EXTENSIONS__ 1
  1944. | #define _ALL_SOURCE 1
  1945. | #define _GNU_SOURCE 1
  1946. | #define _POSIX_PTHREAD_SEMANTICS 1
  1947. | #define _TANDEM_SOURCE 1
  1948. | #define HAVE_UNISTD_H 1
  1949. | #define HAVE_SYS_IOCTL_H 1
  1950. | #define HAVE_DLFCN_H 1
  1951. | #define LT_OBJDIR ".libs/"
  1952. | #define WARN_UNUSED_RESULT __attribute__((__warn_unused_result__))
  1953. | #define HAVE_INTEL_ATOMIC_PRIMITIVES 1
  1954. | #define SIZEOF_VOID_P 8
  1955. | #define SIZEOF_INT 4
  1956. | #define SIZEOF_LONG 8
  1957. | #define SIZEOF_LONG_LONG 8
  1958. | #define SIZEOF_SIZE_T 8
  1959. | #define HAVE_LIBRT 1
  1960. | #define HAVE_BUILTIN_RETURN_ADDRESS 1
  1961. | #define HAVE_STDINT_H 1
  1962. | #define HAVE_INTTYPES_H 1
  1963. | #define HAVE_UINT64_T 1
  1964. | #define HAVE___UINT128_T 1
  1965. | #define HAVE_FCNTL_H 1
  1966. | #define HAVE_UNISTD_H 1
  1967. | #define HAVE_SIGNAL_H 1
  1968. | #define HAVE_SYS_STAT_H 1
  1969. | #define HAVE_SYS_SOCKET_H 1
  1970. | #define HAVE_SYS_POLL_H 1
  1971. | #define HAVE_SYS_UN_H 1
  1972. | #define HAVE_ALARM 1
  1973. | #define HAVE_SCHED_H 1
  1974. | #define HAVE_SCHED_GETAFFINITY 1
  1975. | #define HAVE_SYS_MMAN_H 1
  1976. | #define HAVE_MMAP 1
  1977. | #define HAVE_TIME_H 1
  1978. | #define HAVE_CLOCK_GETTIME 1
  1979. | #define HAVE_FEENABLEEXCEPT 1
  1980. | #define HAVE_FEDISABLEEXCEPT 1
  1981. | #define HAVE_FECLEAREXCEPT 1
  1982. | #define HAVE_LIBGEN_H 1
  1983. | #define HAVE_BYTESWAP_H 1
  1984. | #define HAVE_SIGNAL_H 1
  1985. | #define HAVE_SETJMP_H 1
  1986. | #define HAVE_FENV_H 1
  1987. | #define HAVE_SYS_WAIT_H 1
  1988. | #define HAVE_CTIME_R 1
  1989. | #define HAVE_DRAND48 1
  1990. | #define HAVE_FLOCKFILE 1
  1991. | #define HAVE_FUNLOCKFILE 1
  1992. | #define HAVE_GETLINE 1
  1993. | #define HAVE_LINK 1
  1994. | #define HAVE_STRNDUP 1
  1995. | /* end confdefs.h.  */
  1996. | #include <windows.h>
  1997. configure:19794: result: no
  1998. configure:19794: checking for windows.h
  1999. configure:19794: result: no
  2000. configure:19811: checking for sys/stat.h
  2001. configure:19811: result: yes
  2002. configure:19811: checking io.h usability
  2003. configure:19811: gcc -c -march=x86-64 -mtune=generic -O2 -pipe -fstack-protector --param=ssp-buffer-size=4 -D_FORTIFY_SOURCE=2 conftest.c >&5
  2004. conftest.c:105:16: fatal error: io.h: No such file or directory
  2005.  #include <io.h>
  2006.                 ^
  2007. compilation terminated.
  2008. configure:19811: $? = 1
  2009. configure: failed program was:
  2010. | /* confdefs.h */
  2011. | #define PACKAGE_NAME "cairo"
  2012. | #define PACKAGE_TARNAME "cairo"
  2013. | #define PACKAGE_VERSION "1.12.16"
  2014. | #define PACKAGE_STRING "cairo 1.12.16"
  2015. | #define PACKAGE_BUGREPORT "http://bugs.freedesktop.org/enter_bug.cgi?product=cairo"
  2016. | #define PACKAGE_URL "http://cairographics.org/"
  2017. | #define STDC_HEADERS 1
  2018. | #define HAVE_SYS_TYPES_H 1
  2019. | #define HAVE_SYS_STAT_H 1
  2020. | #define HAVE_STDLIB_H 1
  2021. | #define HAVE_STRING_H 1
  2022. | #define HAVE_MEMORY_H 1
  2023. | #define HAVE_STRINGS_H 1
  2024. | #define HAVE_INTTYPES_H 1
  2025. | #define HAVE_STDINT_H 1
  2026. | #define HAVE_UNISTD_H 1
  2027. | #define __EXTENSIONS__ 1
  2028. | #define _ALL_SOURCE 1
  2029. | #define _GNU_SOURCE 1
  2030. | #define _POSIX_PTHREAD_SEMANTICS 1
  2031. | #define _TANDEM_SOURCE 1
  2032. | #define HAVE_UNISTD_H 1
  2033. | #define HAVE_SYS_IOCTL_H 1
  2034. | #define HAVE_DLFCN_H 1
  2035. | #define LT_OBJDIR ".libs/"
  2036. | #define WARN_UNUSED_RESULT __attribute__((__warn_unused_result__))
  2037. | #define HAVE_INTEL_ATOMIC_PRIMITIVES 1
  2038. | #define SIZEOF_VOID_P 8
  2039. | #define SIZEOF_INT 4
  2040. | #define SIZEOF_LONG 8
  2041. | #define SIZEOF_LONG_LONG 8
  2042. | #define SIZEOF_SIZE_T 8
  2043. | #define HAVE_LIBRT 1
  2044. | #define HAVE_BUILTIN_RETURN_ADDRESS 1
  2045. | #define HAVE_STDINT_H 1
  2046. | #define HAVE_INTTYPES_H 1
  2047. | #define HAVE_UINT64_T 1
  2048. | #define HAVE___UINT128_T 1
  2049. | #define HAVE_FCNTL_H 1
  2050. | #define HAVE_UNISTD_H 1
  2051. | #define HAVE_SIGNAL_H 1
  2052. | #define HAVE_SYS_STAT_H 1
  2053. | #define HAVE_SYS_SOCKET_H 1
  2054. | #define HAVE_SYS_POLL_H 1
  2055. | #define HAVE_SYS_UN_H 1
  2056. | #define HAVE_ALARM 1
  2057. | #define HAVE_SCHED_H 1
  2058. | #define HAVE_SCHED_GETAFFINITY 1
  2059. | #define HAVE_SYS_MMAN_H 1
  2060. | #define HAVE_MMAP 1
  2061. | #define HAVE_TIME_H 1
  2062. | #define HAVE_CLOCK_GETTIME 1
  2063. | #define HAVE_FEENABLEEXCEPT 1
  2064. | #define HAVE_FEDISABLEEXCEPT 1
  2065. | #define HAVE_FECLEAREXCEPT 1
  2066. | #define HAVE_LIBGEN_H 1
  2067. | #define HAVE_BYTESWAP_H 1
  2068. | #define HAVE_SIGNAL_H 1
  2069. | #define HAVE_SETJMP_H 1
  2070. | #define HAVE_FENV_H 1
  2071. | #define HAVE_SYS_WAIT_H 1
  2072. | #define HAVE_CTIME_R 1
  2073. | #define HAVE_DRAND48 1
  2074. | #define HAVE_FLOCKFILE 1
  2075. | #define HAVE_FUNLOCKFILE 1
  2076. | #define HAVE_GETLINE 1
  2077. | #define HAVE_LINK 1
  2078. | #define HAVE_STRNDUP 1
  2079. | #define HAVE_SYS_STAT_H 1
  2080. | /* end confdefs.h.  */
  2081. | #include <stdio.h>
  2082. | #ifdef HAVE_SYS_TYPES_H
  2083. | # include <sys/types.h>
  2084. | #endif
  2085. | #ifdef HAVE_SYS_STAT_H
  2086. | # include <sys/stat.h>
  2087. | #endif
  2088. | #ifdef STDC_HEADERS
  2089. | # include <stdlib.h>
  2090. | # include <stddef.h>
  2091. | #else
  2092. | # ifdef HAVE_STDLIB_H
  2093. | #  include <stdlib.h>
  2094. | # endif
  2095. | #endif
  2096. | #ifdef HAVE_STRING_H
  2097. | # if !defined STDC_HEADERS && defined HAVE_MEMORY_H
  2098. | #  include <memory.h>
  2099. | # endif
  2100. | # include <string.h>
  2101. | #endif
  2102. | #ifdef HAVE_STRINGS_H
  2103. | # include <strings.h>
  2104. | #endif
  2105. | #ifdef HAVE_INTTYPES_H
  2106. | # include <inttypes.h>
  2107. | #endif
  2108. | #ifdef HAVE_STDINT_H
  2109. | # include <stdint.h>
  2110. | #endif
  2111. | #ifdef HAVE_UNISTD_H
  2112. | # include <unistd.h>
  2113. | #endif
  2114. | #include <io.h>
  2115. configure:19811: result: no
  2116. configure:19811: checking io.h presence
  2117. configure:19811: gcc -E -D_FORTIFY_SOURCE=2 conftest.c
  2118. conftest.c:72:16: fatal error: io.h: No such file or directory
  2119.  #include <io.h>
  2120.                 ^
  2121. compilation terminated.
  2122. configure:19811: $? = 1
  2123. configure: failed program was:
  2124. | /* confdefs.h */
  2125. | #define PACKAGE_NAME "cairo"
  2126. | #define PACKAGE_TARNAME "cairo"
  2127. | #define PACKAGE_VERSION "1.12.16"
  2128. | #define PACKAGE_STRING "cairo 1.12.16"
  2129. | #define PACKAGE_BUGREPORT "http://bugs.freedesktop.org/enter_bug.cgi?product=cairo"
  2130. | #define PACKAGE_URL "http://cairographics.org/"
  2131. | #define STDC_HEADERS 1
  2132. | #define HAVE_SYS_TYPES_H 1
  2133. | #define HAVE_SYS_STAT_H 1
  2134. | #define HAVE_STDLIB_H 1
  2135. | #define HAVE_STRING_H 1
  2136. | #define HAVE_MEMORY_H 1
  2137. | #define HAVE_STRINGS_H 1
  2138. | #define HAVE_INTTYPES_H 1
  2139. | #define HAVE_STDINT_H 1
  2140. | #define HAVE_UNISTD_H 1
  2141. | #define __EXTENSIONS__ 1
  2142. | #define _ALL_SOURCE 1
  2143. | #define _GNU_SOURCE 1
  2144. | #define _POSIX_PTHREAD_SEMANTICS 1
  2145. | #define _TANDEM_SOURCE 1
  2146. | #define HAVE_UNISTD_H 1
  2147. | #define HAVE_SYS_IOCTL_H 1
  2148. | #define HAVE_DLFCN_H 1
  2149. | #define LT_OBJDIR ".libs/"
  2150. | #define WARN_UNUSED_RESULT __attribute__((__warn_unused_result__))
  2151. | #define HAVE_INTEL_ATOMIC_PRIMITIVES 1
  2152. | #define SIZEOF_VOID_P 8
  2153. | #define SIZEOF_INT 4
  2154. | #define SIZEOF_LONG 8
  2155. | #define SIZEOF_LONG_LONG 8
  2156. | #define SIZEOF_SIZE_T 8
  2157. | #define HAVE_LIBRT 1
  2158. | #define HAVE_BUILTIN_RETURN_ADDRESS 1
  2159. | #define HAVE_STDINT_H 1
  2160. | #define HAVE_INTTYPES_H 1
  2161. | #define HAVE_UINT64_T 1
  2162. | #define HAVE___UINT128_T 1
  2163. | #define HAVE_FCNTL_H 1
  2164. | #define HAVE_UNISTD_H 1
  2165. | #define HAVE_SIGNAL_H 1
  2166. | #define HAVE_SYS_STAT_H 1
  2167. | #define HAVE_SYS_SOCKET_H 1
  2168. | #define HAVE_SYS_POLL_H 1
  2169. | #define HAVE_SYS_UN_H 1
  2170. | #define HAVE_ALARM 1
  2171. | #define HAVE_SCHED_H 1
  2172. | #define HAVE_SCHED_GETAFFINITY 1
  2173. | #define HAVE_SYS_MMAN_H 1
  2174. | #define HAVE_MMAP 1
  2175. | #define HAVE_TIME_H 1
  2176. | #define HAVE_CLOCK_GETTIME 1
  2177. | #define HAVE_FEENABLEEXCEPT 1
  2178. | #define HAVE_FEDISABLEEXCEPT 1
  2179. | #define HAVE_FECLEAREXCEPT 1
  2180. | #define HAVE_LIBGEN_H 1
  2181. | #define HAVE_BYTESWAP_H 1
  2182. | #define HAVE_SIGNAL_H 1
  2183. | #define HAVE_SETJMP_H 1
  2184. | #define HAVE_FENV_H 1
  2185. | #define HAVE_SYS_WAIT_H 1
  2186. | #define HAVE_CTIME_R 1
  2187. | #define HAVE_DRAND48 1
  2188. | #define HAVE_FLOCKFILE 1
  2189. | #define HAVE_FUNLOCKFILE 1
  2190. | #define HAVE_GETLINE 1
  2191. | #define HAVE_LINK 1
  2192. | #define HAVE_STRNDUP 1
  2193. | #define HAVE_SYS_STAT_H 1
  2194. | /* end confdefs.h.  */
  2195. | #include <io.h>
  2196. configure:19811: result: no
  2197. configure:19811: checking for io.h
  2198. configure:19811: result: no
  2199. configure:19821: checking for mkdir
  2200. configure:19821: gcc -o conftest -march=x86-64 -mtune=generic -O2 -pipe -fstack-protector --param=ssp-buffer-size=4 -D_FORTIFY_SOURCE=2 -Wl,-O1,--sort-common,--as-needed,-z,relro conftest.c -lrt  -lm >&5
  2201. configure:19821: $? = 0
  2202. configure:19821: result: yes
  2203. configure:19823: checking mkdir variant
  2204. configure:19846: gcc -c  -Wall -Wextra -Wold-style-definition -Wdeclaration-after-statement -Wmissing-declarations -Werror-implicit-function-declaration -Wnested-externs -Wpointer-arith -Wwrite-strings -Wsign-compare -Wstrict-prototypes -Wmissing-prototypes -Wpacked -Wswitch-enum -Wmissing-format-attribute -Wbad-function-cast -Wvolatile-register-var -Wstrict-aliasing=2 -Winit-self -Wunsafe-loop-optimizations -Wno-missing-field-initializers -Wno-unused-parameter -Wno-attributes -Wno-long-long -Winline -fno-strict-aliasing -fno-common -Wp,-D_FORTIFY_SOURCE=2 -Wno-unused-but-set-variable -D_FORTIFY_SOURCE=2 conftest.c >&5
  2205. In file included from /usr/include/sys/stat.h:25:0,
  2206.                  from conftest.c:74:
  2207. /usr/include/features.h:327:4: warning: #warning _FORTIFY_SOURCE requires compiling with optimization (-O) [-Wcpp]
  2208.  #  warning _FORTIFY_SOURCE requires compiling with optimization (-O)
  2209.     ^
  2210. conftest.c:81:1: warning: function declaration isn't a prototype [-Wstrict-prototypes]
  2211. main ()
  2212. ^
  2213. conftest.c: In function 'main':
  2214. conftest.c:81:1: warning: old-style function definition [-Wold-style-definition]
  2215. configure:19846: $? = 0
  2216. configure:19873: result: mkdir(path, mode)
  2217. configure:19892: checking for fork
  2218. configure:19892: gcc -o conftest -march=x86-64 -mtune=generic -O2 -pipe -fstack-protector --param=ssp-buffer-size=4 -D_FORTIFY_SOURCE=2 -Wl,-O1,--sort-common,--as-needed,-z,relro conftest.c -lrt  -lm >&5
  2219. conftest.c:96:6: warning: conflicting types for built-in function 'fork' [enabled by default]
  2220. char fork ();
  2221.      ^
  2222. configure:19892: $? = 0
  2223. configure:19892: result: yes
  2224. configure:19892: checking for waitpid
  2225. configure:19892: gcc -o conftest -march=x86-64 -mtune=generic -O2 -pipe -fstack-protector --param=ssp-buffer-size=4 -D_FORTIFY_SOURCE=2 -Wl,-O1,--sort-common,--as-needed,-z,relro conftest.c -lrt  -lm >&5
  2226. configure:19892: $? = 0
  2227. configure:19892: result: yes
  2228. configure:19892: checking for raise
  2229. configure:19892: gcc -o conftest -march=x86-64 -mtune=generic -O2 -pipe -fstack-protector --param=ssp-buffer-size=4 -D_FORTIFY_SOURCE=2 -Wl,-O1,--sort-common,--as-needed,-z,relro conftest.c -lrt  -lm >&5
  2230. configure:19892: $? = 0
  2231. configure:19892: result: yes
  2232. configure:20205: checking for VALGRIND
  2233. configure:20212: $PKG_CONFIG --exists --print-errors "valgrind"
  2234. configure:20215: $? = 0
  2235. configure:20228: $PKG_CONFIG --exists --print-errors "valgrind"
  2236. configure:20231: $? = 0
  2237. configure:20268: result: yes
  2238. configure:20275: checking valgrind.h usability
  2239. configure:20275: gcc -c -march=x86-64 -mtune=generic -O2 -pipe -fstack-protector --param=ssp-buffer-size=4 -I/usr/include/valgrind   -D_FORTIFY_SOURCE=2 -I/usr/include/valgrind   conftest.c >&5
  2240. configure:20275: $? = 0
  2241. configure:20275: result: yes
  2242. configure:20275: checking valgrind.h presence
  2243. configure:20275: gcc -E -D_FORTIFY_SOURCE=2 -I/usr/include/valgrind   conftest.c
  2244. configure:20275: $? = 0
  2245. configure:20275: result: yes
  2246. configure:20275: checking for valgrind.h
  2247. configure:20275: result: yes
  2248. configure:20283: checking lockdep.h usability
  2249. configure:20283: gcc -c -march=x86-64 -mtune=generic -O2 -pipe -fstack-protector --param=ssp-buffer-size=4 -I/usr/include/valgrind   -D_FORTIFY_SOURCE=2 -I/usr/include/valgrind   conftest.c >&5
  2250. conftest.c:110:21: fatal error: lockdep.h: No such file or directory
  2251. #include <lockdep.h>
  2252.                     ^
  2253. compilation terminated.
  2254. configure:20283: $? = 1
  2255. configure: failed program was:
  2256. | /* confdefs.h */
  2257. | #define PACKAGE_NAME "cairo"
  2258. | #define PACKAGE_TARNAME "cairo"
  2259. | #define PACKAGE_VERSION "1.12.16"
  2260. | #define PACKAGE_STRING "cairo 1.12.16"
  2261. | #define PACKAGE_BUGREPORT "http://bugs.freedesktop.org/enter_bug.cgi?product=cairo"
  2262. | #define PACKAGE_URL "http://cairographics.org/"
  2263. | #define STDC_HEADERS 1
  2264. | #define HAVE_SYS_TYPES_H 1
  2265. | #define HAVE_SYS_STAT_H 1
  2266. | #define HAVE_STDLIB_H 1
  2267. | #define HAVE_STRING_H 1
  2268. | #define HAVE_MEMORY_H 1
  2269. | #define HAVE_STRINGS_H 1
  2270. | #define HAVE_INTTYPES_H 1
  2271. | #define HAVE_STDINT_H 1
  2272. | #define HAVE_UNISTD_H 1
  2273. | #define __EXTENSIONS__ 1
  2274. | #define _ALL_SOURCE 1
  2275. | #define _GNU_SOURCE 1
  2276. | #define _POSIX_PTHREAD_SEMANTICS 1
  2277. | #define _TANDEM_SOURCE 1
  2278. | #define HAVE_UNISTD_H 1
  2279. | #define HAVE_SYS_IOCTL_H 1
  2280. | #define HAVE_DLFCN_H 1
  2281. | #define LT_OBJDIR ".libs/"
  2282. | #define WARN_UNUSED_RESULT __attribute__((__warn_unused_result__))
  2283. | #define HAVE_INTEL_ATOMIC_PRIMITIVES 1
  2284. | #define SIZEOF_VOID_P 8
  2285. | #define SIZEOF_INT 4
  2286. | #define SIZEOF_LONG 8
  2287. | #define SIZEOF_LONG_LONG 8
  2288. | #define SIZEOF_SIZE_T 8
  2289. | #define HAVE_LIBRT 1
  2290. | #define HAVE_BUILTIN_RETURN_ADDRESS 1
  2291. | #define HAVE_STDINT_H 1
  2292. | #define HAVE_INTTYPES_H 1
  2293. | #define HAVE_UINT64_T 1
  2294. | #define HAVE___UINT128_T 1
  2295. | #define HAVE_FCNTL_H 1
  2296. | #define HAVE_UNISTD_H 1
  2297. | #define HAVE_SIGNAL_H 1
  2298. | #define HAVE_SYS_STAT_H 1
  2299. | #define HAVE_SYS_SOCKET_H 1
  2300. | #define HAVE_SYS_POLL_H 1
  2301. | #define HAVE_SYS_UN_H 1
  2302. | #define HAVE_ALARM 1
  2303. | #define HAVE_SCHED_H 1
  2304. | #define HAVE_SCHED_GETAFFINITY 1
  2305. | #define HAVE_SYS_MMAN_H 1
  2306. | #define HAVE_MMAP 1
  2307. | #define HAVE_TIME_H 1
  2308. | #define HAVE_CLOCK_GETTIME 1
  2309. | #define HAVE_FEENABLEEXCEPT 1
  2310. | #define HAVE_FEDISABLEEXCEPT 1
  2311. | #define HAVE_FECLEAREXCEPT 1
  2312. | #define HAVE_LIBGEN_H 1
  2313. | #define HAVE_BYTESWAP_H 1
  2314. | #define HAVE_SIGNAL_H 1
  2315. | #define HAVE_SETJMP_H 1
  2316. | #define HAVE_FENV_H 1
  2317. | #define HAVE_SYS_WAIT_H 1
  2318. | #define HAVE_CTIME_R 1
  2319. | #define HAVE_DRAND48 1
  2320. | #define HAVE_FLOCKFILE 1
  2321. | #define HAVE_FUNLOCKFILE 1
  2322. | #define HAVE_GETLINE 1
  2323. | #define HAVE_LINK 1
  2324. | #define HAVE_STRNDUP 1
  2325. | #define HAVE_SYS_STAT_H 1
  2326. | #define HAVE_MKDIR 2
  2327. | #define HAVE_FORK 1
  2328. | #define HAVE_WAITPID 1
  2329. | #define HAVE_RAISE 1
  2330. | #define HAVE_VALGRIND 1
  2331. | /* end confdefs.h.  */
  2332. | #include <stdio.h>
  2333. | #ifdef HAVE_SYS_TYPES_H
  2334. | # include <sys/types.h>
  2335. | #endif
  2336. | #ifdef HAVE_SYS_STAT_H
  2337. | # include <sys/stat.h>
  2338. | #endif
  2339. | #ifdef STDC_HEADERS
  2340. | # include <stdlib.h>
  2341. | # include <stddef.h>
  2342. | #else
  2343. | # ifdef HAVE_STDLIB_H
  2344. | #  include <stdlib.h>
  2345. | # endif
  2346. | #endif
  2347. | #ifdef HAVE_STRING_H
  2348. | # if !defined STDC_HEADERS && defined HAVE_MEMORY_H
  2349. | #  include <memory.h>
  2350. | # endif
  2351. | # include <string.h>
  2352. | #endif
  2353. | #ifdef HAVE_STRINGS_H
  2354. | # include <strings.h>
  2355. | #endif
  2356. | #ifdef HAVE_INTTYPES_H
  2357. | # include <inttypes.h>
  2358. | #endif
  2359. | #ifdef HAVE_STDINT_H
  2360. | # include <stdint.h>
  2361. | #endif
  2362. | #ifdef HAVE_UNISTD_H
  2363. | # include <unistd.h>
  2364. | #endif
  2365. | #include <lockdep.h>
  2366. configure:20283: result: no
  2367. configure:20283: checking lockdep.h presence
  2368. configure:20283: gcc -E -D_FORTIFY_SOURCE=2 -I/usr/include/valgrind   conftest.c
  2369. conftest.c:77:21: fatal error: lockdep.h: No such file or directory
  2370. #include <lockdep.h>
  2371.                     ^
  2372. compilation terminated.
  2373. configure:20283: $? = 1
  2374. configure: failed program was:
  2375. | /* confdefs.h */
  2376. | #define PACKAGE_NAME "cairo"
  2377. | #define PACKAGE_TARNAME "cairo"
  2378. | #define PACKAGE_VERSION "1.12.16"
  2379. | #define PACKAGE_STRING "cairo 1.12.16"
  2380. | #define PACKAGE_BUGREPORT "http://bugs.freedesktop.org/enter_bug.cgi?product=cairo"
  2381. | #define PACKAGE_URL "http://cairographics.org/"
  2382. | #define STDC_HEADERS 1
  2383. | #define HAVE_SYS_TYPES_H 1
  2384. | #define HAVE_SYS_STAT_H 1
  2385. | #define HAVE_STDLIB_H 1
  2386. | #define HAVE_STRING_H 1
  2387. | #define HAVE_MEMORY_H 1
  2388. | #define HAVE_STRINGS_H 1
  2389. | #define HAVE_INTTYPES_H 1
  2390. | #define HAVE_STDINT_H 1
  2391. | #define HAVE_UNISTD_H 1
  2392. | #define __EXTENSIONS__ 1
  2393. | #define _ALL_SOURCE 1
  2394. | #define _GNU_SOURCE 1
  2395. | #define _POSIX_PTHREAD_SEMANTICS 1
  2396. | #define _TANDEM_SOURCE 1
  2397. | #define HAVE_UNISTD_H 1
  2398. | #define HAVE_SYS_IOCTL_H 1
  2399. | #define HAVE_DLFCN_H 1
  2400. | #define LT_OBJDIR ".libs/"
  2401. | #define WARN_UNUSED_RESULT __attribute__((__warn_unused_result__))
  2402. | #define HAVE_INTEL_ATOMIC_PRIMITIVES 1
  2403. | #define SIZEOF_VOID_P 8
  2404. | #define SIZEOF_INT 4
  2405. | #define SIZEOF_LONG 8
  2406. | #define SIZEOF_LONG_LONG 8
  2407. | #define SIZEOF_SIZE_T 8
  2408. | #define HAVE_LIBRT 1
  2409. | #define HAVE_BUILTIN_RETURN_ADDRESS 1
  2410. | #define HAVE_STDINT_H 1
  2411. | #define HAVE_INTTYPES_H 1
  2412. | #define HAVE_UINT64_T 1
  2413. | #define HAVE___UINT128_T 1
  2414. | #define HAVE_FCNTL_H 1
  2415. | #define HAVE_UNISTD_H 1
  2416. | #define HAVE_SIGNAL_H 1
  2417. | #define HAVE_SYS_STAT_H 1
  2418. | #define HAVE_SYS_SOCKET_H 1
  2419. | #define HAVE_SYS_POLL_H 1
  2420. | #define HAVE_SYS_UN_H 1
  2421. | #define HAVE_ALARM 1
  2422. | #define HAVE_SCHED_H 1
  2423. | #define HAVE_SCHED_GETAFFINITY 1
  2424. | #define HAVE_SYS_MMAN_H 1
  2425. | #define HAVE_MMAP 1
  2426. | #define HAVE_TIME_H 1
  2427. | #define HAVE_CLOCK_GETTIME 1
  2428. | #define HAVE_FEENABLEEXCEPT 1
  2429. | #define HAVE_FEDISABLEEXCEPT 1
  2430. | #define HAVE_FECLEAREXCEPT 1
  2431. | #define HAVE_LIBGEN_H 1
  2432. | #define HAVE_BYTESWAP_H 1
  2433. | #define HAVE_SIGNAL_H 1
  2434. | #define HAVE_SETJMP_H 1
  2435. | #define HAVE_FENV_H 1
  2436. | #define HAVE_SYS_WAIT_H 1
  2437. | #define HAVE_CTIME_R 1
  2438. | #define HAVE_DRAND48 1
  2439. | #define HAVE_FLOCKFILE 1
  2440. | #define HAVE_FUNLOCKFILE 1
  2441. | #define HAVE_GETLINE 1
  2442. | #define HAVE_LINK 1
  2443. | #define HAVE_STRNDUP 1
  2444. | #define HAVE_SYS_STAT_H 1
  2445. | #define HAVE_MKDIR 2
  2446. | #define HAVE_FORK 1
  2447. | #define HAVE_WAITPID 1
  2448. | #define HAVE_RAISE 1
  2449. | #define HAVE_VALGRIND 1
  2450. | /* end confdefs.h.  */
  2451. | #include <lockdep.h>
  2452. configure:20283: result: no
  2453. configure:20283: checking for lockdep.h
  2454. configure:20283: result: no
  2455. configure:20291: checking memfault.h usability
  2456. configure:20291: gcc -c -march=x86-64 -mtune=generic -O2 -pipe -fstack-protector --param=ssp-buffer-size=4 -I/usr/include/valgrind   -D_FORTIFY_SOURCE=2 -I/usr/include/valgrind   conftest.c >&5
  2457. conftest.c:110:22: fatal error: memfault.h: No such file or directory
  2458. #include <memfault.h>
  2459.                      ^
  2460. compilation terminated.
  2461. configure:20291: $? = 1
  2462. configure: failed program was:
  2463. | /* confdefs.h */
  2464. | #define PACKAGE_NAME "cairo"
  2465. | #define PACKAGE_TARNAME "cairo"
  2466. | #define PACKAGE_VERSION "1.12.16"
  2467. | #define PACKAGE_STRING "cairo 1.12.16"
  2468. | #define PACKAGE_BUGREPORT "http://bugs.freedesktop.org/enter_bug.cgi?product=cairo"
  2469. | #define PACKAGE_URL "http://cairographics.org/"
  2470. | #define STDC_HEADERS 1
  2471. | #define HAVE_SYS_TYPES_H 1
  2472. | #define HAVE_SYS_STAT_H 1
  2473. | #define HAVE_STDLIB_H 1
  2474. | #define HAVE_STRING_H 1
  2475. | #define HAVE_MEMORY_H 1
  2476. | #define HAVE_STRINGS_H 1
  2477. | #define HAVE_INTTYPES_H 1
  2478. | #define HAVE_STDINT_H 1
  2479. | #define HAVE_UNISTD_H 1
  2480. | #define __EXTENSIONS__ 1
  2481. | #define _ALL_SOURCE 1
  2482. | #define _GNU_SOURCE 1
  2483. | #define _POSIX_PTHREAD_SEMANTICS 1
  2484. | #define _TANDEM_SOURCE 1
  2485. | #define HAVE_UNISTD_H 1
  2486. | #define HAVE_SYS_IOCTL_H 1
  2487. | #define HAVE_DLFCN_H 1
  2488. | #define LT_OBJDIR ".libs/"
  2489. | #define WARN_UNUSED_RESULT __attribute__((__warn_unused_result__))
  2490. | #define HAVE_INTEL_ATOMIC_PRIMITIVES 1
  2491. | #define SIZEOF_VOID_P 8
  2492. | #define SIZEOF_INT 4
  2493. | #define SIZEOF_LONG 8
  2494. | #define SIZEOF_LONG_LONG 8
  2495. | #define SIZEOF_SIZE_T 8
  2496. | #define HAVE_LIBRT 1
  2497. | #define HAVE_BUILTIN_RETURN_ADDRESS 1
  2498. | #define HAVE_STDINT_H 1
  2499. | #define HAVE_INTTYPES_H 1
  2500. | #define HAVE_UINT64_T 1
  2501. | #define HAVE___UINT128_T 1
  2502. | #define HAVE_FCNTL_H 1
  2503. | #define HAVE_UNISTD_H 1
  2504. | #define HAVE_SIGNAL_H 1
  2505. | #define HAVE_SYS_STAT_H 1
  2506. | #define HAVE_SYS_SOCKET_H 1
  2507. | #define HAVE_SYS_POLL_H 1
  2508. | #define HAVE_SYS_UN_H 1
  2509. | #define HAVE_ALARM 1
  2510. | #define HAVE_SCHED_H 1
  2511. | #define HAVE_SCHED_GETAFFINITY 1
  2512. | #define HAVE_SYS_MMAN_H 1
  2513. | #define HAVE_MMAP 1
  2514. | #define HAVE_TIME_H 1
  2515. | #define HAVE_CLOCK_GETTIME 1
  2516. | #define HAVE_FEENABLEEXCEPT 1
  2517. | #define HAVE_FEDISABLEEXCEPT 1
  2518. | #define HAVE_FECLEAREXCEPT 1
  2519. | #define HAVE_LIBGEN_H 1
  2520. | #define HAVE_BYTESWAP_H 1
  2521. | #define HAVE_SIGNAL_H 1
  2522. | #define HAVE_SETJMP_H 1
  2523. | #define HAVE_FENV_H 1
  2524. | #define HAVE_SYS_WAIT_H 1
  2525. | #define HAVE_CTIME_R 1
  2526. | #define HAVE_DRAND48 1
  2527. | #define HAVE_FLOCKFILE 1
  2528. | #define HAVE_FUNLOCKFILE 1
  2529. | #define HAVE_GETLINE 1
  2530. | #define HAVE_LINK 1
  2531. | #define HAVE_STRNDUP 1
  2532. | #define HAVE_SYS_STAT_H 1
  2533. | #define HAVE_MKDIR 2
  2534. | #define HAVE_FORK 1
  2535. | #define HAVE_WAITPID 1
  2536. | #define HAVE_RAISE 1
  2537. | #define HAVE_VALGRIND 1
  2538. | /* end confdefs.h.  */
  2539. | #include <stdio.h>
  2540. | #ifdef HAVE_SYS_TYPES_H
  2541. | # include <sys/types.h>
  2542. | #endif
  2543. | #ifdef HAVE_SYS_STAT_H
  2544. | # include <sys/stat.h>
  2545. | #endif
  2546. | #ifdef STDC_HEADERS
  2547. | # include <stdlib.h>
  2548. | # include <stddef.h>
  2549. | #else
  2550. | # ifdef HAVE_STDLIB_H
  2551. | #  include <stdlib.h>
  2552. | # endif
  2553. | #endif
  2554. | #ifdef HAVE_STRING_H
  2555. | # if !defined STDC_HEADERS && defined HAVE_MEMORY_H
  2556. | #  include <memory.h>
  2557. | # endif
  2558. | # include <string.h>
  2559. | #endif
  2560. | #ifdef HAVE_STRINGS_H
  2561. | # include <strings.h>
  2562. | #endif
  2563. | #ifdef HAVE_INTTYPES_H
  2564. | # include <inttypes.h>
  2565. | #endif
  2566. | #ifdef HAVE_STDINT_H
  2567. | # include <stdint.h>
  2568. | #endif
  2569. | #ifdef HAVE_UNISTD_H
  2570. | # include <unistd.h>
  2571. | #endif
  2572. | #include <memfault.h>
  2573. configure:20291: result: no
  2574. configure:20291: checking memfault.h presence
  2575. configure:20291: gcc -E -D_FORTIFY_SOURCE=2 -I/usr/include/valgrind   conftest.c
  2576. conftest.c:77:22: fatal error: memfault.h: No such file or directory
  2577. #include <memfault.h>
  2578.                      ^
  2579. compilation terminated.
  2580. configure:20291: $? = 1
  2581. configure: failed program was:
  2582. | /* confdefs.h */
  2583. | #define PACKAGE_NAME "cairo"
  2584. | #define PACKAGE_TARNAME "cairo"
  2585. | #define PACKAGE_VERSION "1.12.16"
  2586. | #define PACKAGE_STRING "cairo 1.12.16"
  2587. | #define PACKAGE_BUGREPORT "http://bugs.freedesktop.org/enter_bug.cgi?product=cairo"
  2588. | #define PACKAGE_URL "http://cairographics.org/"
  2589. | #define STDC_HEADERS 1
  2590. | #define HAVE_SYS_TYPES_H 1
  2591. | #define HAVE_SYS_STAT_H 1
  2592. | #define HAVE_STDLIB_H 1
  2593. | #define HAVE_STRING_H 1
  2594. | #define HAVE_MEMORY_H 1
  2595. | #define HAVE_STRINGS_H 1
  2596. | #define HAVE_INTTYPES_H 1
  2597. | #define HAVE_STDINT_H 1
  2598. | #define HAVE_UNISTD_H 1
  2599. | #define __EXTENSIONS__ 1
  2600. | #define _ALL_SOURCE 1
  2601. | #define _GNU_SOURCE 1
  2602. | #define _POSIX_PTHREAD_SEMANTICS 1
  2603. | #define _TANDEM_SOURCE 1
  2604. | #define HAVE_UNISTD_H 1
  2605. | #define HAVE_SYS_IOCTL_H 1
  2606. | #define HAVE_DLFCN_H 1
  2607. | #define LT_OBJDIR ".libs/"
  2608. | #define WARN_UNUSED_RESULT __attribute__((__warn_unused_result__))
  2609. | #define HAVE_INTEL_ATOMIC_PRIMITIVES 1
  2610. | #define SIZEOF_VOID_P 8
  2611. | #define SIZEOF_INT 4
  2612. | #define SIZEOF_LONG 8
  2613. | #define SIZEOF_LONG_LONG 8
  2614. | #define SIZEOF_SIZE_T 8
  2615. | #define HAVE_LIBRT 1
  2616. | #define HAVE_BUILTIN_RETURN_ADDRESS 1
  2617. | #define HAVE_STDINT_H 1
  2618. | #define HAVE_INTTYPES_H 1
  2619. | #define HAVE_UINT64_T 1
  2620. | #define HAVE___UINT128_T 1
  2621. | #define HAVE_FCNTL_H 1
  2622. | #define HAVE_UNISTD_H 1
  2623. | #define HAVE_SIGNAL_H 1
  2624. | #define HAVE_SYS_STAT_H 1
  2625. | #define HAVE_SYS_SOCKET_H 1
  2626. | #define HAVE_SYS_POLL_H 1
  2627. | #define HAVE_SYS_UN_H 1
  2628. | #define HAVE_ALARM 1
  2629. | #define HAVE_SCHED_H 1
  2630. | #define HAVE_SCHED_GETAFFINITY 1
  2631. | #define HAVE_SYS_MMAN_H 1
  2632. | #define HAVE_MMAP 1
  2633. | #define HAVE_TIME_H 1
  2634. | #define HAVE_CLOCK_GETTIME 1
  2635. | #define HAVE_FEENABLEEXCEPT 1
  2636. | #define HAVE_FEDISABLEEXCEPT 1
  2637. | #define HAVE_FECLEAREXCEPT 1
  2638. | #define HAVE_LIBGEN_H 1
  2639. | #define HAVE_BYTESWAP_H 1
  2640. | #define HAVE_SIGNAL_H 1
  2641. | #define HAVE_SETJMP_H 1
  2642. | #define HAVE_FENV_H 1
  2643. | #define HAVE_SYS_WAIT_H 1
  2644. | #define HAVE_CTIME_R 1
  2645. | #define HAVE_DRAND48 1
  2646. | #define HAVE_FLOCKFILE 1
  2647. | #define HAVE_FUNLOCKFILE 1
  2648. | #define HAVE_GETLINE 1
  2649. | #define HAVE_LINK 1
  2650. | #define HAVE_STRNDUP 1
  2651. | #define HAVE_SYS_STAT_H 1
  2652. | #define HAVE_MKDIR 2
  2653. | #define HAVE_FORK 1
  2654. | #define HAVE_WAITPID 1
  2655. | #define HAVE_RAISE 1
  2656. | #define HAVE_VALGRIND 1
  2657. | /* end confdefs.h.  */
  2658. | #include <memfault.h>
  2659. configure:20291: result: no
  2660. configure:20291: checking for memfault.h
  2661. configure:20291: result: no
  2662. configure:20414: checking for compress in -lz
  2663. configure:20439: gcc -o conftest -march=x86-64 -mtune=generic -O2 -pipe -fstack-protector --param=ssp-buffer-size=4 -D_FORTIFY_SOURCE=2 -Wl,-O1,--sort-common,--as-needed,-z,relro conftest.c -lz  -lrt  -lm >&5
  2664. configure:20439: $? = 0
  2665. configure:20448: result: yes
  2666. configure:20451: checking zlib.h usability
  2667. configure:20451: gcc -c -march=x86-64 -mtune=generic -O2 -pipe -fstack-protector --param=ssp-buffer-size=4 -D_FORTIFY_SOURCE=2 conftest.c >&5
  2668. configure:20451: $? = 0
  2669. configure:20451: result: yes
  2670. configure:20451: checking zlib.h presence
  2671. configure:20451: gcc -E -D_FORTIFY_SOURCE=2 conftest.c
  2672. In file included from /usr/include/limits.h:25:0,
  2673.                 from /usr/lib/gcc/x86_64-unknown-linux-gnu/4.8.1/include-fixed/limits.h:168,
  2674.                 from /usr/lib/gcc/x86_64-unknown-linux-gnu/4.8.1/include-fixed/syslimits.h:7,
  2675.                 from /usr/lib/gcc/x86_64-unknown-linux-gnu/4.8.1/include-fixed/limits.h:34,
  2676.                 from /usr/include/zconf.h:395,
  2677.                 from /usr/include/zlib.h:34,
  2678.                 from conftest.c:85:
  2679. /usr/include/features.h:327:4: warning: #warning _FORTIFY_SOURCE requires compiling with optimization (-O) [-Wcpp]
  2680. #  warning _FORTIFY_SOURCE requires compiling with optimization (-O)
  2681.    ^
  2682. configure:20451: $? = 0
  2683. configure:20451: result: yes
  2684. configure:20451: checking for zlib.h
  2685. configure:20451: result: yes
  2686. configure:20470: checking for lzo2a_decompress in -llzo2
  2687. configure:20495: gcc -o conftest -march=x86-64 -mtune=generic -O2 -pipe -fstack-protector --param=ssp-buffer-size=4 -D_FORTIFY_SOURCE=2 -Wl,-O1,--sort-common,--as-needed,-z,relro conftest.c -llzo2  -lrt  -lm >&5
  2688. configure:20495: $? = 0
  2689. configure:20504: result: yes
  2690. configure:20507: checking lzo/lzo2a.h usability
  2691. configure:20507: gcc -c -march=x86-64 -mtune=generic -O2 -pipe -fstack-protector --param=ssp-buffer-size=4 -D_FORTIFY_SOURCE=2 conftest.c >&5
  2692. configure:20507: $? = 0
  2693. configure:20507: result: yes
  2694. configure:20507: checking lzo/lzo2a.h presence
  2695. configure:20507: gcc -E -D_FORTIFY_SOURCE=2 conftest.c
  2696. In file included from /usr/include/limits.h:25:0,
  2697.                 from /usr/lib/gcc/x86_64-unknown-linux-gnu/4.8.1/include-fixed/limits.h:168,
  2698.                 from /usr/lib/gcc/x86_64-unknown-linux-gnu/4.8.1/include-fixed/syslimits.h:7,
  2699.                 from /usr/lib/gcc/x86_64-unknown-linux-gnu/4.8.1/include-fixed/limits.h:34,
  2700.                 from /usr/include/lzo/lzoconf.h:55,
  2701.                 from /usr/include/lzo/lzo2a.h:48,
  2702.                 from conftest.c:86:
  2703. /usr/include/features.h:327:4: warning: #warning _FORTIFY_SOURCE requires compiling with optimization (-O) [-Wcpp]
  2704. #  warning _FORTIFY_SOURCE requires compiling with optimization (-O)
  2705.    ^
  2706. configure:20507: $? = 0
  2707. configure:20507: result: yes
  2708. configure:20507: checking for lzo/lzo2a.h
  2709. configure:20507: result: yes
  2710. configure:20528: checking for dlsym in -ldl
  2711. configure:20553: gcc -o conftest -march=x86-64 -mtune=generic -O2 -pipe -fstack-protector --param=ssp-buffer-size=4 -D_FORTIFY_SOURCE=2 -Wl,-O1,--sort-common,--as-needed,-z,relro conftest.c -ldl  -lrt  -lm >&5
  2712. configure:20553: $? = 0
  2713. configure:20562: result: yes
  2714. configure:20581: checking for dlfcn.h
  2715. configure:20581: result: yes
  2716. configure:20616: checking for X
  2717. configure:20724: gcc -E -D_FORTIFY_SOURCE=2 conftest.c
  2718. In file included from /usr/include/sys/types.h:25:0,
  2719.                 from /usr/include/X11/Xlib.h:38,
  2720.                 from conftest.c:89:
  2721. /usr/include/features.h:327:4: warning: #warning _FORTIFY_SOURCE requires compiling with optimization (-O) [-Wcpp]
  2722. #  warning _FORTIFY_SOURCE requires compiling with optimization (-O)
  2723.    ^
  2724. configure:20724: $? = 0
  2725. configure:20755: gcc -o conftest -march=x86-64 -mtune=generic -O2 -pipe -fstack-protector --param=ssp-buffer-size=4 -D_FORTIFY_SOURCE=2 -Wl,-O1,--sort-common,--as-needed,-z,relro conftest.c -lX11 -lrt  -lm >&5
  2726. configure:20755: $? = 0
  2727. configure:20805: result: libraries , headers
  2728. configure:20821: checking for cairo's Xlib surface backend feature
  2729. configure:20839: checking for xlib
  2730. configure:20846: $PKG_CONFIG --exists --print-errors "$xlib_REQUIRES"
  2731. configure:20849: $? = 0
  2732. configure:20862: $PKG_CONFIG --exists --print-errors "$xlib_REQUIRES"
  2733. configure:20865: $? = 0
  2734. configure:21892: result: yes
  2735. configure:21897: checking sys/ipc.h usability
  2736. configure:21897: gcc -c -march=x86-64 -mtune=generic -O2 -pipe -fstack-protector --param=ssp-buffer-size=4 -D_FORTIFY_SOURCE=2 conftest.c >&5
  2737. configure:21897: $? = 0
  2738. configure:21897: result: yes
  2739. configure:21897: checking sys/ipc.h presence
  2740. configure:21897: gcc -E -D_FORTIFY_SOURCE=2 conftest.c
  2741. In file included from /usr/include/sys/ipc.h:21:0,
  2742.                  from conftest.c:89:
  2743. /usr/include/features.h:327:4: warning: #warning _FORTIFY_SOURCE requires compiling with optimization (-O) [-Wcpp]
  2744.  #  warning _FORTIFY_SOURCE requires compiling with optimization (-O)
  2745.     ^
  2746. configure:21897: $? = 0
  2747. configure:21897: result: yes
  2748. configure:21897: checking for sys/ipc.h
  2749. configure:21897: result: yes
  2750. configure:21903: checking sys/shm.h usability
  2751. configure:21903: gcc -c -march=x86-64 -mtune=generic -O2 -pipe -fstack-protector --param=ssp-buffer-size=4 -D_FORTIFY_SOURCE=2 conftest.c >&5
  2752. configure:21903: $? = 0
  2753. configure:21903: result: yes
  2754. configure:21903: checking sys/shm.h presence
  2755. configure:21903: gcc -E -D_FORTIFY_SOURCE=2 conftest.c
  2756. In file included from /usr/include/sys/shm.h:21:0,
  2757.                  from conftest.c:89:
  2758. /usr/include/features.h:327:4: warning: #warning _FORTIFY_SOURCE requires compiling with optimization (-O) [-Wcpp]
  2759.  #  warning _FORTIFY_SOURCE requires compiling with optimization (-O)
  2760.     ^
  2761. configure:21903: $? = 0
  2762. configure:21903: result: yes
  2763. configure:21903: checking for sys/shm.h
  2764. configure:21903: result: yes
  2765. configure:21911: checking whether shmctl IPC_RMID allowes subsequent attaches
  2766. configure:21940: gcc -o conftest -march=x86-64 -mtune=generic -O2 -pipe -fstack-protector --param=ssp-buffer-size=4 -D_FORTIFY_SOURCE=2 -Wl,-O1,--sort-common,--as-needed,-z,relro conftest.c -lrt  -lm >&5
  2767. configure:21940: $? = 0
  2768. configure:21940: ./conftest
  2769. configure:21940: $? = 0
  2770. configure:21944: result: yes
  2771. configure:21959: checking for X11/extensions/XShm.h
  2772. configure:21959: gcc -c -march=x86-64 -mtune=generic -O2 -pipe -fstack-protector --param=ssp-buffer-size=4 -D_FORTIFY_SOURCE=2 conftest.c >&5
  2773. configure:21959: $? = 0
  2774. configure:21959: result: yes
  2775. configure:21959: checking for X11/extensions/shmproto.h
  2776. configure:21959: gcc -c -march=x86-64 -mtune=generic -O2 -pipe -fstack-protector --param=ssp-buffer-size=4 -D_FORTIFY_SOURCE=2 conftest.c >&5
  2777. configure:21959: $? = 0
  2778. configure:21959: result: yes
  2779. configure:21959: checking for X11/extensions/shmstr.h
  2780. configure:21959: gcc -c -march=x86-64 -mtune=generic -O2 -pipe -fstack-protector --param=ssp-buffer-size=4 -D_FORTIFY_SOURCE=2 conftest.c >&5
  2781. configure:21959: $? = 0
  2782. configure:21959: result: yes
  2783. configure:21973: checking whether cairo's Xlib surface backend feature could be enabled
  2784. configure:21975: result: yes
  2785. configure:22198: checking for cairo's Xlib Xrender surface backend feature
  2786. configure:22220: checking for xlib_xrender
  2787. configure:22227: $PKG_CONFIG --exists --print-errors "$xlib_xrender_REQUIRES"
  2788. configure:22230: $? = 0
  2789. configure:22243: $PKG_CONFIG --exists --print-errors "$xlib_xrender_REQUIRES"
  2790. configure:22246: $? = 0
  2791. configure:22307: result: yes
  2792. configure:22319: checking for XRenderCreateLinearGradient
  2793. configure:22319: gcc -o conftest -march=x86-64 -mtune=generic -O2 -pipe -fstack-protector --param=ssp-buffer-size=4       -D_FORTIFY_SOURCE=2 -Wl,-O1,--sort-common,--as-needed,-z,relro conftest.c -lrt  -lm -lX11 -lXext    -lXrender -lX11    >&5
  2794. configure:22319: $? = 0
  2795. configure:22319: result: yes
  2796. configure:22319: checking for XRenderCreateRadialGradient
  2797. configure:22319: gcc -o conftest -march=x86-64 -mtune=generic -O2 -pipe -fstack-protector --param=ssp-buffer-size=4       -D_FORTIFY_SOURCE=2 -Wl,-O1,--sort-common,--as-needed,-z,relro conftest.c -lrt  -lm -lX11 -lXext    -lXrender -lX11    >&5
  2798. configure:22319: $? = 0
  2799. configure:22319: result: yes
  2800. configure:22319: checking for XRenderCreateConicalGradient
  2801. configure:22319: gcc -o conftest -march=x86-64 -mtune=generic -O2 -pipe -fstack-protector --param=ssp-buffer-size=4       -D_FORTIFY_SOURCE=2 -Wl,-O1,--sort-common,--as-needed,-z,relro conftest.c -lrt  -lm -lX11 -lXext    -lXrender -lX11    >&5
  2802. configure:22319: $? = 0
  2803. configure:22319: result: yes
  2804. configure:22334: checking whether cairo's Xlib Xrender surface backend feature could be enabled
  2805. configure:22336: result: yes
  2806. configure:22560: checking for cairo's XCB surface backend feature
  2807. configure:22578: checking for xcb
  2808. configure:22585: $PKG_CONFIG --exists --print-errors "$xcb_REQUIRES"
  2809. configure:22588: $? = 0
  2810. configure:22601: $PKG_CONFIG --exists --print-errors "$xcb_REQUIRES"
  2811. configure:22604: $? = 0
  2812. configure:22639: result: yes
  2813. configure:22645: checking whether cairo's XCB surface backend feature could be enabled
  2814. configure:22647: result: yes
  2815. configure:23180: checking for cairo's XCB/SHM functions feature
  2816. configure:23199: checking for xcb_shm
  2817. configure:23206: $PKG_CONFIG --exists --print-errors "$xcb_shm_REQUIRES"
  2818. configure:23209: $? = 0
  2819. configure:23222: $PKG_CONFIG --exists --print-errors "$xcb_shm_REQUIRES"
  2820. configure:23225: $? = 0
  2821. configure:23260: result: yes
  2822. configure:23269: checking whether cairo's XCB/SHM functions feature could be enabled
  2823. configure:23271: result: yes
  2824. configure:23800: checking for cairo's Quartz surface backend feature
  2825. configure:23815: checking ApplicationServices/ApplicationServices.h usability
  2826. configure:23815: gcc -c -march=x86-64 -mtune=generic -O2 -pipe -fstack-protector --param=ssp-buffer-size=4 -D_FORTIFY_SOURCE=2 conftest.c >&5
  2827. conftest.c:129:53: fatal error: ApplicationServices/ApplicationServices.h: No such file or directory
  2828.  #include <ApplicationServices/ApplicationServices.h>
  2829.                                                      ^
  2830. compilation terminated.
  2831. configure:23815: $? = 1
  2832. configure: failed program was:
  2833. | /* confdefs.h */
  2834. | #define PACKAGE_NAME "cairo"
  2835. | #define PACKAGE_TARNAME "cairo"
  2836. | #define PACKAGE_VERSION "1.12.16"
  2837. | #define PACKAGE_STRING "cairo 1.12.16"
  2838. | #define PACKAGE_BUGREPORT "http://bugs.freedesktop.org/enter_bug.cgi?product=cairo"
  2839. | #define PACKAGE_URL "http://cairographics.org/"
  2840. | #define STDC_HEADERS 1
  2841. | #define HAVE_SYS_TYPES_H 1
  2842. | #define HAVE_SYS_STAT_H 1
  2843. | #define HAVE_STDLIB_H 1
  2844. | #define HAVE_STRING_H 1
  2845. | #define HAVE_MEMORY_H 1
  2846. | #define HAVE_STRINGS_H 1
  2847. | #define HAVE_INTTYPES_H 1
  2848. | #define HAVE_STDINT_H 1
  2849. | #define HAVE_UNISTD_H 1
  2850. | #define __EXTENSIONS__ 1
  2851. | #define _ALL_SOURCE 1
  2852. | #define _GNU_SOURCE 1
  2853. | #define _POSIX_PTHREAD_SEMANTICS 1
  2854. | #define _TANDEM_SOURCE 1
  2855. | #define HAVE_UNISTD_H 1
  2856. | #define HAVE_SYS_IOCTL_H 1
  2857. | #define HAVE_DLFCN_H 1
  2858. | #define LT_OBJDIR ".libs/"
  2859. | #define WARN_UNUSED_RESULT __attribute__((__warn_unused_result__))
  2860. | #define HAVE_INTEL_ATOMIC_PRIMITIVES 1
  2861. | #define SIZEOF_VOID_P 8
  2862. | #define SIZEOF_INT 4
  2863. | #define SIZEOF_LONG 8
  2864. | #define SIZEOF_LONG_LONG 8
  2865. | #define SIZEOF_SIZE_T 8
  2866. | #define HAVE_LIBRT 1
  2867. | #define HAVE_BUILTIN_RETURN_ADDRESS 1
  2868. | #define HAVE_STDINT_H 1
  2869. | #define HAVE_INTTYPES_H 1
  2870. | #define HAVE_UINT64_T 1
  2871. | #define HAVE___UINT128_T 1
  2872. | #define HAVE_FCNTL_H 1
  2873. | #define HAVE_UNISTD_H 1
  2874. | #define HAVE_SIGNAL_H 1
  2875. | #define HAVE_SYS_STAT_H 1
  2876. | #define HAVE_SYS_SOCKET_H 1
  2877. | #define HAVE_SYS_POLL_H 1
  2878. | #define HAVE_SYS_UN_H 1
  2879. | #define HAVE_ALARM 1
  2880. | #define HAVE_SCHED_H 1
  2881. | #define HAVE_SCHED_GETAFFINITY 1
  2882. | #define HAVE_SYS_MMAN_H 1
  2883. | #define HAVE_MMAP 1
  2884. | #define HAVE_TIME_H 1
  2885. | #define HAVE_CLOCK_GETTIME 1
  2886. | #define HAVE_FEENABLEEXCEPT 1
  2887. | #define HAVE_FEDISABLEEXCEPT 1
  2888. | #define HAVE_FECLEAREXCEPT 1
  2889. | #define HAVE_LIBGEN_H 1
  2890. | #define HAVE_BYTESWAP_H 1
  2891. | #define HAVE_SIGNAL_H 1
  2892. | #define HAVE_SETJMP_H 1
  2893. | #define HAVE_FENV_H 1
  2894. | #define HAVE_SYS_WAIT_H 1
  2895. | #define HAVE_CTIME_R 1
  2896. | #define HAVE_DRAND48 1
  2897. | #define HAVE_FLOCKFILE 1
  2898. | #define HAVE_FUNLOCKFILE 1
  2899. | #define HAVE_GETLINE 1
  2900. | #define HAVE_LINK 1
  2901. | #define HAVE_STRNDUP 1
  2902. | #define HAVE_SYS_STAT_H 1
  2903. | #define HAVE_MKDIR 2
  2904. | #define HAVE_FORK 1
  2905. | #define HAVE_WAITPID 1
  2906. | #define HAVE_RAISE 1
  2907. | #define HAVE_VALGRIND 1
  2908. | #undef PACKAGE_VERSION
  2909. | #undef PACKAGE_STRING
  2910. | #undef PACKAGE_NAME
  2911. | #undef PACKAGE_TARNAME
  2912. | #define PACKAGE_VERSION USE_cairo_version_OR_cairo_version_string_INSTEAD
  2913. | #define PACKAGE_STRING USE_cairo_version_OR_cairo_version_string_INSTEAD
  2914. | #define PACKAGE_NAME USE_cairo_INSTEAD
  2915. | #define PACKAGE_TARNAME USE_cairo_INSTEAD
  2916. | #define HAVE_ZLIB 1
  2917. | #define HAVE_LZO 1
  2918. | #define HAVE_DLFCN_H 1
  2919. | #define CAIRO_HAS_DLSYM 1
  2920. | #define IPC_RMID_DEFERRED_RELEASE 1
  2921. | #define HAVE_X11_EXTENSIONS_XSHM_H 1
  2922. | #define HAVE_X11_EXTENSIONS_SHMPROTO_H 1
  2923. | #define HAVE_X11_EXTENSIONS_SHMSTR_H 1
  2924. | #define HAVE_XRENDERCREATELINEARGRADIENT 1
  2925. | #define HAVE_XRENDERCREATERADIALGRADIENT 1
  2926. | #define HAVE_XRENDERCREATECONICALGRADIENT 1
  2927. | /* end confdefs.h.  */
  2928. | #include <stdio.h>
  2929. | #ifdef HAVE_SYS_TYPES_H
  2930. | # include <sys/types.h>
  2931. | #endif
  2932. | #ifdef HAVE_SYS_STAT_H
  2933. | # include <sys/stat.h>
  2934. | #endif
  2935. | #ifdef STDC_HEADERS
  2936. | # include <stdlib.h>
  2937. | # include <stddef.h>
  2938. | #else
  2939. | # ifdef HAVE_STDLIB_H
  2940. | #  include <stdlib.h>
  2941. | # endif
  2942. | #endif
  2943. | #ifdef HAVE_STRING_H
  2944. | # if !defined STDC_HEADERS && defined HAVE_MEMORY_H
  2945. | #  include <memory.h>
  2946. | # endif
  2947. | # include <string.h>
  2948. | #endif
  2949. | #ifdef HAVE_STRINGS_H
  2950. | # include <strings.h>
  2951. | #endif
  2952. | #ifdef HAVE_INTTYPES_H
  2953. | # include <inttypes.h>
  2954. | #endif
  2955. | #ifdef HAVE_STDINT_H
  2956. | # include <stdint.h>
  2957. | #endif
  2958. | #ifdef HAVE_UNISTD_H
  2959. | # include <unistd.h>
  2960. | #endif
  2961. | #include <ApplicationServices/ApplicationServices.h>
  2962. configure:23815: result: no
  2963. configure:23815: checking ApplicationServices/ApplicationServices.h presence
  2964. configure:23815: gcc -E -D_FORTIFY_SOURCE=2 conftest.c
  2965. conftest.c:96:53: fatal error: ApplicationServices/ApplicationServices.h: No such file or directory
  2966.  #include <ApplicationServices/ApplicationServices.h>
  2967.                                                      ^
  2968. compilation terminated.
  2969. configure:23815: $? = 1
  2970. configure: failed program was:
  2971. | /* confdefs.h */
  2972. | #define PACKAGE_NAME "cairo"
  2973. | #define PACKAGE_TARNAME "cairo"
  2974. | #define PACKAGE_VERSION "1.12.16"
  2975. | #define PACKAGE_STRING "cairo 1.12.16"
  2976. | #define PACKAGE_BUGREPORT "http://bugs.freedesktop.org/enter_bug.cgi?product=cairo"
  2977. | #define PACKAGE_URL "http://cairographics.org/"
  2978. | #define STDC_HEADERS 1
  2979. | #define HAVE_SYS_TYPES_H 1
  2980. | #define HAVE_SYS_STAT_H 1
  2981. | #define HAVE_STDLIB_H 1
  2982. | #define HAVE_STRING_H 1
  2983. | #define HAVE_MEMORY_H 1
  2984. | #define HAVE_STRINGS_H 1
  2985. | #define HAVE_INTTYPES_H 1
  2986. | #define HAVE_STDINT_H 1
  2987. | #define HAVE_UNISTD_H 1
  2988. | #define __EXTENSIONS__ 1
  2989. | #define _ALL_SOURCE 1
  2990. | #define _GNU_SOURCE 1
  2991. | #define _POSIX_PTHREAD_SEMANTICS 1
  2992. | #define _TANDEM_SOURCE 1
  2993. | #define HAVE_UNISTD_H 1
  2994. | #define HAVE_SYS_IOCTL_H 1
  2995. | #define HAVE_DLFCN_H 1
  2996. | #define LT_OBJDIR ".libs/"
  2997. | #define WARN_UNUSED_RESULT __attribute__((__warn_unused_result__))
  2998. | #define HAVE_INTEL_ATOMIC_PRIMITIVES 1
  2999. | #define SIZEOF_VOID_P 8
  3000. | #define SIZEOF_INT 4
  3001. | #define SIZEOF_LONG 8
  3002. | #define SIZEOF_LONG_LONG 8
  3003. | #define SIZEOF_SIZE_T 8
  3004. | #define HAVE_LIBRT 1
  3005. | #define HAVE_BUILTIN_RETURN_ADDRESS 1
  3006. | #define HAVE_STDINT_H 1
  3007. | #define HAVE_INTTYPES_H 1
  3008. | #define HAVE_UINT64_T 1
  3009. | #define HAVE___UINT128_T 1
  3010. | #define HAVE_FCNTL_H 1
  3011. | #define HAVE_UNISTD_H 1
  3012. | #define HAVE_SIGNAL_H 1
  3013. | #define HAVE_SYS_STAT_H 1
  3014. | #define HAVE_SYS_SOCKET_H 1
  3015. | #define HAVE_SYS_POLL_H 1
  3016. | #define HAVE_SYS_UN_H 1
  3017. | #define HAVE_ALARM 1
  3018. | #define HAVE_SCHED_H 1
  3019. | #define HAVE_SCHED_GETAFFINITY 1
  3020. | #define HAVE_SYS_MMAN_H 1
  3021. | #define HAVE_MMAP 1
  3022. | #define HAVE_TIME_H 1
  3023. | #define HAVE_CLOCK_GETTIME 1
  3024. | #define HAVE_FEENABLEEXCEPT 1
  3025. | #define HAVE_FEDISABLEEXCEPT 1
  3026. | #define HAVE_FECLEAREXCEPT 1
  3027. | #define HAVE_LIBGEN_H 1
  3028. | #define HAVE_BYTESWAP_H 1
  3029. | #define HAVE_SIGNAL_H 1
  3030. | #define HAVE_SETJMP_H 1
  3031. | #define HAVE_FENV_H 1
  3032. | #define HAVE_SYS_WAIT_H 1
  3033. | #define HAVE_CTIME_R 1
  3034. | #define HAVE_DRAND48 1
  3035. | #define HAVE_FLOCKFILE 1
  3036. | #define HAVE_FUNLOCKFILE 1
  3037. | #define HAVE_GETLINE 1
  3038. | #define HAVE_LINK 1
  3039. | #define HAVE_STRNDUP 1
  3040. | #define HAVE_SYS_STAT_H 1
  3041. | #define HAVE_MKDIR 2
  3042. | #define HAVE_FORK 1
  3043. | #define HAVE_WAITPID 1
  3044. | #define HAVE_RAISE 1
  3045. | #define HAVE_VALGRIND 1
  3046. | #undef PACKAGE_VERSION
  3047. | #undef PACKAGE_STRING
  3048. | #undef PACKAGE_NAME
  3049. | #undef PACKAGE_TARNAME
  3050. | #define PACKAGE_VERSION USE_cairo_version_OR_cairo_version_string_INSTEAD
  3051. | #define PACKAGE_STRING USE_cairo_version_OR_cairo_version_string_INSTEAD
  3052. | #define PACKAGE_NAME USE_cairo_INSTEAD
  3053. | #define PACKAGE_TARNAME USE_cairo_INSTEAD
  3054. | #define HAVE_ZLIB 1
  3055. | #define HAVE_LZO 1
  3056. | #define HAVE_DLFCN_H 1
  3057. | #define CAIRO_HAS_DLSYM 1
  3058. | #define IPC_RMID_DEFERRED_RELEASE 1
  3059. | #define HAVE_X11_EXTENSIONS_XSHM_H 1
  3060. | #define HAVE_X11_EXTENSIONS_SHMPROTO_H 1
  3061. | #define HAVE_X11_EXTENSIONS_SHMSTR_H 1
  3062. | #define HAVE_XRENDERCREATELINEARGRADIENT 1
  3063. | #define HAVE_XRENDERCREATERADIALGRADIENT 1
  3064. | #define HAVE_XRENDERCREATECONICALGRADIENT 1
  3065. | /* end confdefs.h.  */
  3066. | #include <ApplicationServices/ApplicationServices.h>
  3067. configure:23815: result: no
  3068. configure:23815: checking for ApplicationServices/ApplicationServices.h
  3069. configure:23815: result: no
  3070. configure:23824: checking CoreGraphics/CoreGraphics.h usability
  3071. configure:23824: gcc -c -march=x86-64 -mtune=generic -O2 -pipe -fstack-protector --param=ssp-buffer-size=4 -D_FORTIFY_SOURCE=2 conftest.c >&5
  3072. conftest.c:129:39: fatal error: CoreGraphics/CoreGraphics.h: No such file or directory
  3073.  #include <CoreGraphics/CoreGraphics.h>
  3074.                                        ^
  3075. compilation terminated.
  3076. configure:23824: $? = 1
  3077. configure: failed program was:
  3078. | /* confdefs.h */
  3079. | #define PACKAGE_NAME "cairo"
  3080. | #define PACKAGE_TARNAME "cairo"
  3081. | #define PACKAGE_VERSION "1.12.16"
  3082. | #define PACKAGE_STRING "cairo 1.12.16"
  3083. | #define PACKAGE_BUGREPORT "http://bugs.freedesktop.org/enter_bug.cgi?product=cairo"
  3084. | #define PACKAGE_URL "http://cairographics.org/"
  3085. | #define STDC_HEADERS 1
  3086. | #define HAVE_SYS_TYPES_H 1
  3087. | #define HAVE_SYS_STAT_H 1
  3088. | #define HAVE_STDLIB_H 1
  3089. | #define HAVE_STRING_H 1
  3090. | #define HAVE_MEMORY_H 1
  3091. | #define HAVE_STRINGS_H 1
  3092. | #define HAVE_INTTYPES_H 1
  3093. | #define HAVE_STDINT_H 1
  3094. | #define HAVE_UNISTD_H 1
  3095. | #define __EXTENSIONS__ 1
  3096. | #define _ALL_SOURCE 1
  3097. | #define _GNU_SOURCE 1
  3098. | #define _POSIX_PTHREAD_SEMANTICS 1
  3099. | #define _TANDEM_SOURCE 1
  3100. | #define HAVE_UNISTD_H 1
  3101. | #define HAVE_SYS_IOCTL_H 1
  3102. | #define HAVE_DLFCN_H 1
  3103. | #define LT_OBJDIR ".libs/"
  3104. | #define WARN_UNUSED_RESULT __attribute__((__warn_unused_result__))
  3105. | #define HAVE_INTEL_ATOMIC_PRIMITIVES 1
  3106. | #define SIZEOF_VOID_P 8
  3107. | #define SIZEOF_INT 4
  3108. | #define SIZEOF_LONG 8
  3109. | #define SIZEOF_LONG_LONG 8
  3110. | #define SIZEOF_SIZE_T 8
  3111. | #define HAVE_LIBRT 1
  3112. | #define HAVE_BUILTIN_RETURN_ADDRESS 1
  3113. | #define HAVE_STDINT_H 1
  3114. | #define HAVE_INTTYPES_H 1
  3115. | #define HAVE_UINT64_T 1
  3116. | #define HAVE___UINT128_T 1
  3117. | #define HAVE_FCNTL_H 1
  3118. | #define HAVE_UNISTD_H 1
  3119. | #define HAVE_SIGNAL_H 1
  3120. | #define HAVE_SYS_STAT_H 1
  3121. | #define HAVE_SYS_SOCKET_H 1
  3122. | #define HAVE_SYS_POLL_H 1
  3123. | #define HAVE_SYS_UN_H 1
  3124. | #define HAVE_ALARM 1
  3125. | #define HAVE_SCHED_H 1
  3126. | #define HAVE_SCHED_GETAFFINITY 1
  3127. | #define HAVE_SYS_MMAN_H 1
  3128. | #define HAVE_MMAP 1
  3129. | #define HAVE_TIME_H 1
  3130. | #define HAVE_CLOCK_GETTIME 1
  3131. | #define HAVE_FEENABLEEXCEPT 1
  3132. | #define HAVE_FEDISABLEEXCEPT 1
  3133. | #define HAVE_FECLEAREXCEPT 1
  3134. | #define HAVE_LIBGEN_H 1
  3135. | #define HAVE_BYTESWAP_H 1
  3136. | #define HAVE_SIGNAL_H 1
  3137. | #define HAVE_SETJMP_H 1
  3138. | #define HAVE_FENV_H 1
  3139. | #define HAVE_SYS_WAIT_H 1
  3140. | #define HAVE_CTIME_R 1
  3141. | #define HAVE_DRAND48 1
  3142. | #define HAVE_FLOCKFILE 1
  3143. | #define HAVE_FUNLOCKFILE 1
  3144. | #define HAVE_GETLINE 1
  3145. | #define HAVE_LINK 1
  3146. | #define HAVE_STRNDUP 1
  3147. | #define HAVE_SYS_STAT_H 1
  3148. | #define HAVE_MKDIR 2
  3149. | #define HAVE_FORK 1
  3150. | #define HAVE_WAITPID 1
  3151. | #define HAVE_RAISE 1
  3152. | #define HAVE_VALGRIND 1
  3153. | #undef PACKAGE_VERSION
  3154. | #undef PACKAGE_STRING
  3155. | #undef PACKAGE_NAME
  3156. | #undef PACKAGE_TARNAME
  3157. | #define PACKAGE_VERSION USE_cairo_version_OR_cairo_version_string_INSTEAD
  3158. | #define PACKAGE_STRING USE_cairo_version_OR_cairo_version_string_INSTEAD
  3159. | #define PACKAGE_NAME USE_cairo_INSTEAD
  3160. | #define PACKAGE_TARNAME USE_cairo_INSTEAD
  3161. | #define HAVE_ZLIB 1
  3162. | #define HAVE_LZO 1
  3163. | #define HAVE_DLFCN_H 1
  3164. | #define CAIRO_HAS_DLSYM 1
  3165. | #define IPC_RMID_DEFERRED_RELEASE 1
  3166. | #define HAVE_X11_EXTENSIONS_XSHM_H 1
  3167. | #define HAVE_X11_EXTENSIONS_SHMPROTO_H 1
  3168. | #define HAVE_X11_EXTENSIONS_SHMSTR_H 1
  3169. | #define HAVE_XRENDERCREATELINEARGRADIENT 1
  3170. | #define HAVE_XRENDERCREATERADIALGRADIENT 1
  3171. | #define HAVE_XRENDERCREATECONICALGRADIENT 1
  3172. | /* end confdefs.h.  */
  3173. | #include <stdio.h>
  3174. | #ifdef HAVE_SYS_TYPES_H
  3175. | # include <sys/types.h>
  3176. | #endif
  3177. | #ifdef HAVE_SYS_STAT_H
  3178. | # include <sys/stat.h>
  3179. | #endif
  3180. | #ifdef STDC_HEADERS
  3181. | # include <stdlib.h>
  3182. | # include <stddef.h>
  3183. | #else
  3184. | # ifdef HAVE_STDLIB_H
  3185. | #  include <stdlib.h>
  3186. | # endif
  3187. | #endif
  3188. | #ifdef HAVE_STRING_H
  3189. | # if !defined STDC_HEADERS && defined HAVE_MEMORY_H
  3190. | #  include <memory.h>
  3191. | # endif
  3192. | # include <string.h>
  3193. | #endif
  3194. | #ifdef HAVE_STRINGS_H
  3195. | # include <strings.h>
  3196. | #endif
  3197. | #ifdef HAVE_INTTYPES_H
  3198. | # include <inttypes.h>
  3199. | #endif
  3200. | #ifdef HAVE_STDINT_H
  3201. | # include <stdint.h>
  3202. | #endif
  3203. | #ifdef HAVE_UNISTD_H
  3204. | # include <unistd.h>
  3205. | #endif
  3206. | #include <CoreGraphics/CoreGraphics.h>
  3207. configure:23824: result: no
  3208. configure:23824: checking CoreGraphics/CoreGraphics.h presence
  3209. configure:23824: gcc -E -D_FORTIFY_SOURCE=2 conftest.c
  3210. conftest.c:96:39: fatal error: CoreGraphics/CoreGraphics.h: No such file or directory
  3211.  #include <CoreGraphics/CoreGraphics.h>
  3212.                                        ^
  3213. compilation terminated.
  3214. configure:23824: $? = 1
  3215. configure: failed program was:
  3216. | /* confdefs.h */
  3217. | #define PACKAGE_NAME "cairo"
  3218. | #define PACKAGE_TARNAME "cairo"
  3219. | #define PACKAGE_VERSION "1.12.16"
  3220. | #define PACKAGE_STRING "cairo 1.12.16"
  3221. | #define PACKAGE_BUGREPORT "http://bugs.freedesktop.org/enter_bug.cgi?product=cairo"
  3222. | #define PACKAGE_URL "http://cairographics.org/"
  3223. | #define STDC_HEADERS 1
  3224. | #define HAVE_SYS_TYPES_H 1
  3225. | #define HAVE_SYS_STAT_H 1
  3226. | #define HAVE_STDLIB_H 1
  3227. | #define HAVE_STRING_H 1
  3228. | #define HAVE_MEMORY_H 1
  3229. | #define HAVE_STRINGS_H 1
  3230. | #define HAVE_INTTYPES_H 1
  3231. | #define HAVE_STDINT_H 1
  3232. | #define HAVE_UNISTD_H 1
  3233. | #define __EXTENSIONS__ 1
  3234. | #define _ALL_SOURCE 1
  3235. | #define _GNU_SOURCE 1
  3236. | #define _POSIX_PTHREAD_SEMANTICS 1
  3237. | #define _TANDEM_SOURCE 1
  3238. | #define HAVE_UNISTD_H 1
  3239. | #define HAVE_SYS_IOCTL_H 1
  3240. | #define HAVE_DLFCN_H 1
  3241. | #define LT_OBJDIR ".libs/"
  3242. | #define WARN_UNUSED_RESULT __attribute__((__warn_unused_result__))
  3243. | #define HAVE_INTEL_ATOMIC_PRIMITIVES 1
  3244. | #define SIZEOF_VOID_P 8
  3245. | #define SIZEOF_INT 4
  3246. | #define SIZEOF_LONG 8
  3247. | #define SIZEOF_LONG_LONG 8
  3248. | #define SIZEOF_SIZE_T 8
  3249. | #define HAVE_LIBRT 1
  3250. | #define HAVE_BUILTIN_RETURN_ADDRESS 1
  3251. | #define HAVE_STDINT_H 1
  3252. | #define HAVE_INTTYPES_H 1
  3253. | #define HAVE_UINT64_T 1
  3254. | #define HAVE___UINT128_T 1
  3255. | #define HAVE_FCNTL_H 1
  3256. | #define HAVE_UNISTD_H 1
  3257. | #define HAVE_SIGNAL_H 1
  3258. | #define HAVE_SYS_STAT_H 1
  3259. | #define HAVE_SYS_SOCKET_H 1
  3260. | #define HAVE_SYS_POLL_H 1
  3261. | #define HAVE_SYS_UN_H 1
  3262. | #define HAVE_ALARM 1
  3263. | #define HAVE_SCHED_H 1
  3264. | #define HAVE_SCHED_GETAFFINITY 1
  3265. | #define HAVE_SYS_MMAN_H 1
  3266. | #define HAVE_MMAP 1
  3267. | #define HAVE_TIME_H 1
  3268. | #define HAVE_CLOCK_GETTIME 1
  3269. | #define HAVE_FEENABLEEXCEPT 1
  3270. | #define HAVE_FEDISABLEEXCEPT 1
  3271. | #define HAVE_FECLEAREXCEPT 1
  3272. | #define HAVE_LIBGEN_H 1
  3273. | #define HAVE_BYTESWAP_H 1
  3274. | #define HAVE_SIGNAL_H 1
  3275. | #define HAVE_SETJMP_H 1
  3276. | #define HAVE_FENV_H 1
  3277. | #define HAVE_SYS_WAIT_H 1
  3278. | #define HAVE_CTIME_R 1
  3279. | #define HAVE_DRAND48 1
  3280. | #define HAVE_FLOCKFILE 1
  3281. | #define HAVE_FUNLOCKFILE 1
  3282. | #define HAVE_GETLINE 1
  3283. | #define HAVE_LINK 1
  3284. | #define HAVE_STRNDUP 1
  3285. | #define HAVE_SYS_STAT_H 1
  3286. | #define HAVE_MKDIR 2
  3287. | #define HAVE_FORK 1
  3288. | #define HAVE_WAITPID 1
  3289. | #define HAVE_RAISE 1
  3290. | #define HAVE_VALGRIND 1
  3291. | #undef PACKAGE_VERSION
  3292. | #undef PACKAGE_STRING
  3293. | #undef PACKAGE_NAME
  3294. | #undef PACKAGE_TARNAME
  3295. | #define PACKAGE_VERSION USE_cairo_version_OR_cairo_version_string_INSTEAD
  3296. | #define PACKAGE_STRING USE_cairo_version_OR_cairo_version_string_INSTEAD
  3297. | #define PACKAGE_NAME USE_cairo_INSTEAD
  3298. | #define PACKAGE_TARNAME USE_cairo_INSTEAD
  3299. | #define HAVE_ZLIB 1
  3300. | #define HAVE_LZO 1
  3301. | #define HAVE_DLFCN_H 1
  3302. | #define CAIRO_HAS_DLSYM 1
  3303. | #define IPC_RMID_DEFERRED_RELEASE 1
  3304. | #define HAVE_X11_EXTENSIONS_XSHM_H 1
  3305. | #define HAVE_X11_EXTENSIONS_SHMPROTO_H 1
  3306. | #define HAVE_X11_EXTENSIONS_SHMSTR_H 1
  3307. | #define HAVE_XRENDERCREATELINEARGRADIENT 1
  3308. | #define HAVE_XRENDERCREATERADIALGRADIENT 1
  3309. | #define HAVE_XRENDERCREATECONICALGRADIENT 1
  3310. | /* end confdefs.h.  */
  3311. | #include <CoreGraphics/CoreGraphics.h>
  3312. configure:23824: result: no
  3313. configure:23824: checking for CoreGraphics/CoreGraphics.h
  3314. configure:23824: result: no
  3315. configure:23838: checking whether cairo's Quartz surface backend feature could be enabled
  3316. configure:23840: result: no (requires CoreGraphics framework)
  3317. configure:24063: checking for cairo's Quartz font backend feature
  3318. configure:24081: checking whether cairo's Quartz font backend feature could be enabled
  3319. configure:24083: result: no (requires CoreGraphics framework)
  3320. configure:24546: checking for cairo's Microsoft Windows surface backend feature
  3321. configure:24567: checking whether cairo's Microsoft Windows surface backend feature could be enabled
  3322. configure:24569: result: no (requires a Win32 platform)
  3323. configure:24792: checking for cairo's Microsoft Windows font backend feature
  3324. configure:24810: checking whether cairo's Microsoft Windows font backend feature could be enabled
  3325. configure:24812: result: no (requires a Win32 platform)
  3326. configure:26481: checking for cairo's PNG functions feature
  3327. configure:26514: checking for png
  3328. configure:26521: $PKG_CONFIG --exists --print-errors "$png_REQUIRES"
  3329. configure:26524: $? = 0
  3330. configure:26537: $PKG_CONFIG --exists --print-errors "$png_REQUIRES"
  3331. configure:26540: $? = 0
  3332. configure:26575: result: yes
  3333. configure:26585: checking whether cairo's PNG functions feature could be enabled
  3334. configure:26587: result: yes
  3335. configure:26813: checking for cairo's OpenGL surface backend feature
  3336. configure:26831: checking for gl
  3337. configure:26838: $PKG_CONFIG --exists --print-errors "$gl_REQUIRES"
  3338. configure:26841: $? = 0
  3339. configure:26854: $PKG_CONFIG --exists --print-errors "$gl_REQUIRES"
  3340. configure:26857: $? = 0
  3341. configure:26916: result: yes
  3342. configure:26930: checking whether cairo's OpenGL surface backend feature could be enabled
  3343. configure:26932: result: yes
  3344. configure:28353: checking for cairo's EGL functions feature
  3345. configure:28372: checking for egl
  3346. configure:28379: $PKG_CONFIG --exists --print-errors "$egl_REQUIRES"
  3347. configure:28382: $? = 0
  3348. configure:28395: $PKG_CONFIG --exists --print-errors "$egl_REQUIRES"
  3349. configure:28398: $? = 0
  3350. configure:28651: result: yes
  3351. configure:28660: checking whether cairo's EGL functions feature could be enabled
  3352. configure:28662: result: yes
  3353. configure:28879: checking for cairo's GLX functions feature
  3354. configure:28897: checking GL/glx.h usability
  3355. configure:28897: gcc -c -march=x86-64 -mtune=generic -O2 -pipe -fstack-protector --param=ssp-buffer-size=4 -I/usr/include/libdrm    -D_FORTIFY_SOURCE=2 conftest.c >&5
  3356. configure:28897: $? = 0
  3357. configure:28897: result: yes
  3358. configure:28897: checking GL/glx.h presence
  3359. configure:28897: gcc -E -D_FORTIFY_SOURCE=2 conftest.c
  3360. In file included from /usr/include/sys/types.h:25:0,
  3361.                  from /usr/include/X11/Xlib.h:38,
  3362.                  from /usr/include/GL/glx.h:30,
  3363.                  from conftest.c:96:
  3364. /usr/include/features.h:327:4: warning: #warning _FORTIFY_SOURCE requires compiling with optimization (-O) [-Wcpp]
  3365.  #  warning _FORTIFY_SOURCE requires compiling with optimization (-O)
  3366.     ^
  3367. configure:28897: $? = 0
  3368. configure:28897: result: yes
  3369. configure:28897: checking for GL/glx.h
  3370. configure:28897: result: yes
  3371. configure:28913: checking whether cairo's GLX functions feature could be enabled
  3372. configure:28915: result: yes
  3373. configure:29132: checking for cairo's WGL functions feature
  3374. configure:29148: checking for windows.h
  3375. configure:29148: result: no
  3376. configure:29161: checking whether cairo's WGL functions feature could be enabled
  3377. configure:29163: result: no (WGL headers not found)
  3378. configure:29382: checking for cairo's script surface backend feature
  3379. configure:29400: checking whether cairo's script surface backend feature could be enabled
  3380. configure:29402: result: yes
  3381. configure:29649: checking for cairo's FreeType font backend feature
  3382. configure:29667: checking for FREETYPE
  3383. configure:29674: $PKG_CONFIG --exists --print-errors "freetype2 >= $FREETYPE_MIN_VERSION"
  3384. configure:29677: $? = 0
  3385. configure:29690: $PKG_CONFIG --exists --print-errors "freetype2 >= $FREETYPE_MIN_VERSION"
  3386. configure:29693: $? = 0
  3387. configure:29728: result: yes
  3388. configure:29833: checking whether cairo's FreeType font backend feature could be enabled
  3389. configure:29835: result: yes
  3390. configure:30059: checking for cairo's Fontconfig font backend feature
  3391. configure:30079: checking for FONTCONFIG
  3392. configure:30086: $PKG_CONFIG --exists --print-errors "$fc_REQUIRES"
  3393. configure:30089: $? = 0
  3394. configure:30102: $PKG_CONFIG --exists --print-errors "$fc_REQUIRES"
  3395. configure:30105: $? = 0
  3396. configure:30140: result: yes
  3397. configure:30149: checking whether cairo's Fontconfig font backend feature could be enabled
  3398. configure:30151: result: yes
  3399. configure:30371: checking for FT_Get_X11_Font_Format
  3400. configure:30371: gcc -o conftest -march=x86-64 -mtune=generic -O2 -pipe -fstack-protector --param=ssp-buffer-size=4 -I/usr/include/freetype2   -D_FORTIFY_SOURCE=2 -Wl,-O1,--sort-common,--as-needed,-z,relro conftest.c -lrt  -lm -lfreetype   >&5
  3401. configure:30371: $? = 0
  3402. configure:30371: result: yes
  3403. configure:30371: checking for FT_GlyphSlot_Embolden
  3404. configure:30371: gcc -o conftest -march=x86-64 -mtune=generic -O2 -pipe -fstack-protector --param=ssp-buffer-size=4 -I/usr/include/freetype2   -D_FORTIFY_SOURCE=2 -Wl,-O1,--sort-common,--as-needed,-z,relro conftest.c -lrt  -lm -lfreetype   >&5
  3405. configure:30371: $? = 0
  3406. configure:30371: result: yes
  3407. configure:30371: checking for FT_GlyphSlot_Oblique
  3408. configure:30371: gcc -o conftest -march=x86-64 -mtune=generic -O2 -pipe -fstack-protector --param=ssp-buffer-size=4 -I/usr/include/freetype2   -D_FORTIFY_SOURCE=2 -Wl,-O1,--sort-common,--as-needed,-z,relro conftest.c -lrt  -lm -lfreetype   >&5
  3409. configure:30371: $? = 0
  3410. configure:30371: result: yes
  3411. configure:30371: checking for FT_Load_Sfnt_Table
  3412. configure:30371: gcc -o conftest -march=x86-64 -mtune=generic -O2 -pipe -fstack-protector --param=ssp-buffer-size=4 -I/usr/include/freetype2   -D_FORTIFY_SOURCE=2 -Wl,-O1,--sort-common,--as-needed,-z,relro conftest.c -lrt  -lm -lfreetype   >&5
  3413. configure:30371: $? = 0
  3414. configure:30371: result: yes
  3415. configure:30371: checking for FT_Library_SetLcdFilter
  3416. configure:30371: gcc -o conftest -march=x86-64 -mtune=generic -O2 -pipe -fstack-protector --param=ssp-buffer-size=4 -I/usr/include/freetype2   -D_FORTIFY_SOURCE=2 -Wl,-O1,--sort-common,--as-needed,-z,relro conftest.c -lrt  -lm -lfreetype   >&5
  3417. configure:30371: $? = 0
  3418. configure:30371: result: yes
  3419. configure:30393: checking for FcInit
  3420. configure:30393: gcc -o conftest -march=x86-64 -mtune=generic -O2 -pipe -fstack-protector --param=ssp-buffer-size=4 -I/usr/include/freetype2   -D_FORTIFY_SOURCE=2 -Wl,-O1,--sort-common,--as-needed,-z,relro conftest.c -lrt  -lm -lfontconfig -lfreetype   >&5
  3421. configure:30393: $? = 0
  3422. configure:30393: result: yes
  3423. configure:30393: checking for FcFini
  3424. configure:30393: gcc -o conftest -march=x86-64 -mtune=generic -O2 -pipe -fstack-protector --param=ssp-buffer-size=4 -I/usr/include/freetype2   -D_FORTIFY_SOURCE=2 -Wl,-O1,--sort-common,--as-needed,-z,relro conftest.c -lrt  -lm -lfontconfig -lfreetype   >&5
  3425. configure:30393: $? = 0
  3426. configure:30393: result: yes
  3427. configure:30420: checking for cairo's PostScript surface backend feature
  3428. configure:30440: checking whether cairo's PostScript surface backend feature could be enabled
  3429. configure:30442: result: yes
  3430. configure:30663: checking for gs
  3431. configure:30679: found /usr/bin/gs
  3432. configure:30690: result: gs
  3433. configure:30712: checking for LIBSPECTRE
  3434. configure:30719: $PKG_CONFIG --exists --print-errors "$libspectre_DEPENDENCY"
  3435. configure:30722: $? = 0
  3436. configure:30735: $PKG_CONFIG --exists --print-errors "$libspectre_DEPENDENCY"
  3437. configure:30738: $? = 0
  3438. configure:30773: result: yes
  3439. configure:30816: checking for cairo's PDF surface backend feature
  3440. configure:30836: checking whether cairo's PDF surface backend feature could be enabled
  3441. configure:30838: result: yes
  3442. configure:31061: checking for POPPLER
  3443. configure:31068: $PKG_CONFIG --exists --print-errors "$poppler_DEPENDENCY"
  3444. configure:31071: $? = 0
  3445. configure:31084: $PKG_CONFIG --exists --print-errors "$poppler_DEPENDENCY"
  3446. configure:31087: $? = 0
  3447. configure:31122: result: yes
  3448. configure:31130: checking for poppler_page_render
  3449. configure:31130: gcc -o conftest -march=x86-64 -mtune=generic -O2 -pipe -fstack-protector --param=ssp-buffer-size=4 -pthread -I/usr/include/poppler/glib -I/usr/include/poppler -I/usr/include/glib-2.0 -I/usr/lib/glib-2.0/include -I/usr/include/cairo -I/usr/include/pixman-1 -I/usr/include/freetype2 -I/usr/include/libpng16 -I/usr/include/libdrm   -D_FORTIFY_SOURCE=2 -Wl,-O1,--sort-common,--as-needed,-z,relro conftest.c -lrt  -lm -lpoppler-glib -lgio-2.0 -lcairo -lgobject-2.0 -lglib-2.0   >&5
  3450. configure:31130: $? = 0
  3451. configure:31130: result: yes
  3452. configure:31188: checking for cairo's SVG surface backend feature
  3453. configure:31208: checking whether cairo's SVG surface backend feature could be enabled
  3454. configure:31210: result: yes
  3455. configure:31431: checking for LIBRSVG
  3456. configure:31438: $PKG_CONFIG --exists --print-errors "$librsvg_DEPENDENCY gdk-2.0"
  3457. configure:31441: $? = 0
  3458. configure:31454: $PKG_CONFIG --exists --print-errors "$librsvg_DEPENDENCY gdk-2.0"
  3459. configure:31457: $? = 0
  3460. configure:31492: result: yes
  3461. configure:31500: checking for rsvg_pixbuf_from_file
  3462. configure:31500: gcc -o conftest -march=x86-64 -mtune=generic -O2 -pipe -fstack-protector --param=ssp-buffer-size=4 -pthread -I/usr/include/librsvg-2.0 -I/usr/include/glib-2.0 -I/usr/lib/glib-2.0/include -I/usr/include/gdk-pixbuf-2.0 -I/usr/include/cairo -I/usr/include/libpng16 -I/usr/include/pixman-1 -I/usr/include/freetype2 -I/usr/include/libdrm -I/usr/include/gtk-2.0 -I/usr/lib/gtk-2.0/include -I/usr/include/pango-1.0   -D_FORTIFY_SOURCE=2 -Wl,-O1,--sort-common,--as-needed,-z,relro conftest.c -lrt  -lm -lrsvg-2 -lm -lgio-2.0 -lgdk-x11-2.0 -lpangocairo-1.0 -lgdk_pixbuf-2.0 -lpango-1.0 -lcairo -lgobject-2.0 -lglib-2.0   >&5
  3463. configure:31500: $? = 0
  3464. configure:31500: result: yes
  3465. configure:31723: checking for cairo's image surface backend feature
  3466. configure:31741: checking for pixman
  3467. configure:31748: $PKG_CONFIG --exists --print-errors "$pixman_REQUIRES"
  3468. configure:31751: $? = 0
  3469. configure:31764: $PKG_CONFIG --exists --print-errors "$pixman_REQUIRES"
  3470. configure:31767: $? = 0
  3471. configure:31802: result: yes
  3472. configure:31811: checking whether cairo's image surface backend feature could be enabled
  3473. configure:31813: result: yes
  3474. configure:31968: checking for cairo's mime surface backend feature
  3475. configure:31984: checking whether cairo's mime surface backend feature could be enabled
  3476. configure:31986: result: yes
  3477. configure:32132: checking for cairo's recording surface backend feature
  3478. configure:32148: checking whether cairo's recording surface backend feature could be enabled
  3479. configure:32150: result: yes
  3480. configure:32296: checking for cairo's observer surface backend feature
  3481. configure:32312: checking whether cairo's observer surface backend feature could be enabled
  3482. configure:32314: result: yes
  3483. configure:32466: checking for cairo's tee surface backend feature
  3484. configure:32482: checking whether cairo's tee surface backend feature could be enabled
  3485. configure:32484: result: yes
  3486. configure:32937: checking for cairo's user font backend feature
  3487. configure:32953: checking whether cairo's user font backend feature could be enabled
  3488. configure:32955: result: yes
  3489. configure:33110: checking for cairo's pthread feature
  3490. configure:33221: gcc -o conftest -march=x86-64 -mtune=generic -O2 -pipe -fstack-protector --param=ssp-buffer-size=4 -D_REENTRANT -D_FORTIFY_SOURCE=2 -Wl,-O1,--sort-common,--as-needed,-z,relro conftest.c -lrt  -lm -lpthread >&5
  3491. configure:33221: $? = 0
  3492. configure:33421: gcc -o conftest -march=x86-64 -mtune=generic -O2 -pipe -fstack-protector --param=ssp-buffer-size=4 -D_REENTRANT -D_FORTIFY_SOURCE=2 -Wl,-O1,--sort-common,--as-needed,-z,relro conftest.c -lrt  -lm  >&5
  3493. /tmp/ccHPugfF.o: In function `test_mutex_attr':
  3494. conftest.c:(.text+0x7a): undefined reference to `pthread_mutexattr_init'
  3495. conftest.c:(.text+0x89): undefined reference to `pthread_mutexattr_settype'
  3496. conftest.c:(.text+0xc8): undefined reference to `pthread_mutexattr_destroy'
  3497. collect2: error: ld returned 1 exit status
  3498. configure:33421: $? = 1
  3499. configure: failed program was:
  3500. | /* confdefs.h */
  3501. | #define PACKAGE_NAME "cairo"
  3502. | #define PACKAGE_TARNAME "cairo"
  3503. | #define PACKAGE_VERSION "1.12.16"
  3504. | #define PACKAGE_STRING "cairo 1.12.16"
  3505. | #define PACKAGE_BUGREPORT "http://bugs.freedesktop.org/enter_bug.cgi?product=cairo"
  3506. | #define PACKAGE_URL "http://cairographics.org/"
  3507. | #define STDC_HEADERS 1
  3508. | #define HAVE_SYS_TYPES_H 1
  3509. | #define HAVE_SYS_STAT_H 1
  3510. | #define HAVE_STDLIB_H 1
  3511. | #define HAVE_STRING_H 1
  3512. | #define HAVE_MEMORY_H 1
  3513. | #define HAVE_STRINGS_H 1
  3514. | #define HAVE_INTTYPES_H 1
  3515. | #define HAVE_STDINT_H 1
  3516. | #define HAVE_UNISTD_H 1
  3517. | #define __EXTENSIONS__ 1
  3518. | #define _ALL_SOURCE 1
  3519. | #define _GNU_SOURCE 1
  3520. | #define _POSIX_PTHREAD_SEMANTICS 1
  3521. | #define _TANDEM_SOURCE 1
  3522. | #define HAVE_UNISTD_H 1
  3523. | #define HAVE_SYS_IOCTL_H 1
  3524. | #define HAVE_DLFCN_H 1
  3525. | #define LT_OBJDIR ".libs/"
  3526. | #define WARN_UNUSED_RESULT __attribute__((__warn_unused_result__))
  3527. | #define HAVE_INTEL_ATOMIC_PRIMITIVES 1
  3528. | #define SIZEOF_VOID_P 8
  3529. | #define SIZEOF_INT 4
  3530. | #define SIZEOF_LONG 8
  3531. | #define SIZEOF_LONG_LONG 8
  3532. | #define SIZEOF_SIZE_T 8
  3533. | #define HAVE_LIBRT 1
  3534. | #define HAVE_BUILTIN_RETURN_ADDRESS 1
  3535. | #define HAVE_STDINT_H 1
  3536. | #define HAVE_INTTYPES_H 1
  3537. | #define HAVE_UINT64_T 1
  3538. | #define HAVE___UINT128_T 1
  3539. | #define HAVE_FCNTL_H 1
  3540. | #define HAVE_UNISTD_H 1
  3541. | #define HAVE_SIGNAL_H 1
  3542. | #define HAVE_SYS_STAT_H 1
  3543. | #define HAVE_SYS_SOCKET_H 1
  3544. | #define HAVE_SYS_POLL_H 1
  3545. | #define HAVE_SYS_UN_H 1
  3546. | #define HAVE_ALARM 1
  3547. | #define HAVE_SCHED_H 1
  3548. | #define HAVE_SCHED_GETAFFINITY 1
  3549. | #define HAVE_SYS_MMAN_H 1
  3550. | #define HAVE_MMAP 1
  3551. | #define HAVE_TIME_H 1
  3552. | #define HAVE_CLOCK_GETTIME 1
  3553. | #define HAVE_FEENABLEEXCEPT 1
  3554. | #define HAVE_FEDISABLEEXCEPT 1
  3555. | #define HAVE_FECLEAREXCEPT 1
  3556. | #define HAVE_LIBGEN_H 1
  3557. | #define HAVE_BYTESWAP_H 1
  3558. | #define HAVE_SIGNAL_H 1
  3559. | #define HAVE_SETJMP_H 1
  3560. | #define HAVE_FENV_H 1
  3561. | #define HAVE_SYS_WAIT_H 1
  3562. | #define HAVE_CTIME_R 1
  3563. | #define HAVE_DRAND48 1
  3564. | #define HAVE_FLOCKFILE 1
  3565. | #define HAVE_FUNLOCKFILE 1
  3566. | #define HAVE_GETLINE 1
  3567. | #define HAVE_LINK 1
  3568. | #define HAVE_STRNDUP 1
  3569. | #define HAVE_SYS_STAT_H 1
  3570. | #define HAVE_MKDIR 2
  3571. | #define HAVE_FORK 1
  3572. | #define HAVE_WAITPID 1
  3573. | #define HAVE_RAISE 1
  3574. | #define HAVE_VALGRIND 1
  3575. | #undef PACKAGE_VERSION
  3576. | #undef PACKAGE_STRING
  3577. | #undef PACKAGE_NAME
  3578. | #undef PACKAGE_TARNAME
  3579. | #define PACKAGE_VERSION USE_cairo_version_OR_cairo_version_string_INSTEAD
  3580. | #define PACKAGE_STRING USE_cairo_version_OR_cairo_version_string_INSTEAD
  3581. | #define PACKAGE_NAME USE_cairo_INSTEAD
  3582. | #define PACKAGE_TARNAME USE_cairo_INSTEAD
  3583. | #define HAVE_ZLIB 1
  3584. | #define HAVE_LZO 1
  3585. | #define HAVE_DLFCN_H 1
  3586. | #define CAIRO_HAS_DLSYM 1
  3587. | #define IPC_RMID_DEFERRED_RELEASE 1
  3588. | #define HAVE_X11_EXTENSIONS_XSHM_H 1
  3589. | #define HAVE_X11_EXTENSIONS_SHMPROTO_H 1
  3590. | #define HAVE_X11_EXTENSIONS_SHMSTR_H 1
  3591. | #define HAVE_XRENDERCREATELINEARGRADIENT 1
  3592. | #define HAVE_XRENDERCREATERADIALGRADIENT 1
  3593. | #define HAVE_XRENDERCREATECONICALGRADIENT 1
  3594. | #define HAVE_FT_GET_X11_FONT_FORMAT 1
  3595. | #define HAVE_FT_GLYPHSLOT_EMBOLDEN 1
  3596. | #define HAVE_FT_GLYPHSLOT_OBLIQUE 1
  3597. | #define HAVE_FT_LOAD_SFNT_TABLE 1
  3598. | #define HAVE_FT_LIBRARY_SETLCDFILTER 1
  3599. | #define HAVE_FCINIT 1
  3600. | #define HAVE_FCFINI 1
  3601. | #define CAIRO_CAN_TEST_PS_SURFACE 1
  3602. | #define CAIRO_HAS_SPECTRE 1
  3603. | #define HAVE_POPPLER_PAGE_RENDER 1
  3604. | #define CAIRO_CAN_TEST_PDF_SURFACE 1
  3605. | #define HAVE_RSVG_PIXBUF_FROM_FILE 1
  3606. | #define CAIRO_CAN_TEST_SVG_SURFACE 1
  3607. | #define HAS_PIXMAN_GLYPHS 1
  3608. | /* end confdefs.h.  */
  3609. | #ifndef _GNU_SOURCE
  3610. | #define _GNU_SOURCE /* for PTHREAD_MUTEX_INITIALIZER under linux */
  3611. | #endif
  3612. | #include <pthread.h>
  3613. |
  3614. | pthread_mutex_t test_mutex_initializer = PTHREAD_MUTEX_INITIALIZER;
  3615. | int test_mutex (void)
  3616. | {
  3617. |   int x = 0;
  3618. |   pthread_mutex_t mutex;
  3619. |   x |= pthread_mutex_init (&mutex, NULL);
  3620. |   x |= pthread_mutex_lock (&mutex);
  3621. |   x |= pthread_mutex_unlock (&mutex);
  3622. |   x |= pthread_mutex_destroy (&mutex);
  3623. |   return 0;
  3624. | }
  3625. |
  3626. | int test_mutex_attr (void)
  3627. | {
  3628. |   int x = 0;
  3629. |   pthread_mutexattr_t attr;
  3630. |   pthread_mutex_t mutex;
  3631. |   x |= pthread_mutexattr_init (&attr);
  3632. |   x |= pthread_mutexattr_settype (&attr, PTHREAD_MUTEX_RECURSIVE);
  3633. |   x |= pthread_mutex_init (&mutex, &attr);
  3634. |   x |= pthread_mutex_lock (&mutex);
  3635. |   x |= pthread_mutex_unlock (&mutex);
  3636. |   x |= pthread_mutex_destroy (&mutex);
  3637. |   x |= pthread_mutexattr_destroy (&attr);
  3638. |   return x;
  3639. | }
  3640. |       int main(int c, char **v) { (void)c; (void)v; return 0; }
  3641. configure:33476: checking whether cairo's pthread feature could be enabled
  3642. configure:33478: result: yes
  3643. configure:33661: checking for cairo's gobject functions feature
  3644. configure:33679: checking for GOBJECT
  3645. configure:33686: $PKG_CONFIG --exists --print-errors "$gobject_REQUIRES"
  3646. configure:33689: $? = 0
  3647. configure:33702: $PKG_CONFIG --exists --print-errors "$gobject_REQUIRES"
  3648. configure:33705: $? = 0
  3649. configure:33740: result: yes
  3650. configure:33747: checking whether cairo's gobject functions feature could be enabled
  3651. configure:33749: result: yes
  3652. configure:33956: checking for GOBJECT
  3653. configure:34036: result: yes
  3654. configure:34104: checking for cairo's cairo-trace feature
  3655. configure:34127: checking whether cairo's cairo-trace feature could be enabled
  3656. configure:34129: result: yes
  3657. configure:34290: checking for cairo's cairo-script-interpreter feature
  3658. configure:34310: checking whether cairo's cairo-script-interpreter feature could be enabled
  3659. configure:34312: result: yes
  3660. configure:34470: checking for bfd_openr in -lbfd
  3661. configure:34495: gcc -o conftest -march=x86-64 -mtune=generic -O2 -pipe -fstack-protector --param=ssp-buffer-size=4 -D_FORTIFY_SOURCE=2 -Wl,-O1,--sort-common,--as-needed,-z,relro conftest.c -lbfd  -lrt  -lm >&5
  3662. /usr/lib/gcc/x86_64-unknown-linux-gnu/4.8.1/../../../../lib/libbfd.a(elflink.o): In function `bfd_elf_link_add_symbols':
  3663. (.text+0x9371): undefined reference to `objalloc_free_block'
  3664. /usr/lib/gcc/x86_64-unknown-linux-gnu/4.8.1/../../../../lib/libbfd.a(elflink.o): In function `bfd_elf_link_add_symbols':
  3665. (.text+0xb1a0): undefined reference to `_sch_istable'
  3666. /usr/lib/gcc/x86_64-unknown-linux-gnu/4.8.1/../../../../lib/libbfd.a(elflink.o): In function `bfd_elf_size_dynamic_sections':
  3667. (.text+0xc007): undefined reference to `lbasename'
  3668. /usr/lib/gcc/x86_64-unknown-linux-gnu/4.8.1/../../../../lib/libbfd.a(elflink.o): In function `bfd_elf_size_dynamic_sections':
  3669. (.text+0xc844): undefined reference to `lbasename'
  3670. /usr/lib/gcc/x86_64-unknown-linux-gnu/4.8.1/../../../../lib/libbfd.a(pei-x86_64.o): In function `pex64_bfd_print_pdata':
  3671. (.text+0x2cee): undefined reference to `xmalloc'
  3672. /usr/lib/gcc/x86_64-unknown-linux-gnu/4.8.1/../../../../lib/libbfd.a(opncls.o): In function `_bfd_new_bfd':
  3673. (.text+0x1ca): undefined reference to `objalloc_create'
  3674. /usr/lib/gcc/x86_64-unknown-linux-gnu/4.8.1/../../../../lib/libbfd.a(opncls.o): In function `_bfd_delete_bfd':
  3675. (.text+0x37f): undefined reference to `objalloc_free'
  3676. /usr/lib/gcc/x86_64-unknown-linux-gnu/4.8.1/../../../../lib/libbfd.a(opncls.o): In function `_bfd_free_cached_info':
  3677. (.text+0x3af): undefined reference to `objalloc_free'
  3678. /usr/lib/gcc/x86_64-unknown-linux-gnu/4.8.1/../../../../lib/libbfd.a(opncls.o): In function `bfd_alloc':
  3679. (.text+0xae4): undefined reference to `_objalloc_alloc'
  3680. /usr/lib/gcc/x86_64-unknown-linux-gnu/4.8.1/../../../../lib/libbfd.a(opncls.o): In function `bfd_alloc2':
  3681. (.text+0xb9f): undefined reference to `_objalloc_alloc'
  3682. /usr/lib/gcc/x86_64-unknown-linux-gnu/4.8.1/../../../../lib/libbfd.a(opncls.o): In function `bfd_follow_gnu_debuglink':
  3683. (.text+0xf57): undefined reference to `lrealpath'
  3684. /usr/lib/gcc/x86_64-unknown-linux-gnu/4.8.1/../../../../lib/libbfd.a(opncls.o): In function `bfd_create_gnu_debuglink_section':
  3685. (.text+0x1185): undefined reference to `lbasename'
  3686. /usr/lib/gcc/x86_64-unknown-linux-gnu/4.8.1/../../../../lib/libbfd.a(opncls.o): In function `bfd_fill_in_gnu_debuglink_section':
  3687. (.text+0x12a7): undefined reference to `lbasename'
  3688. /usr/lib/gcc/x86_64-unknown-linux-gnu/4.8.1/../../../../lib/libbfd.a(opncls.o): In function `bfd_release':
  3689. (.text+0xd48): undefined reference to `objalloc_free_block'
  3690. /usr/lib/gcc/x86_64-unknown-linux-gnu/4.8.1/../../../../lib/libbfd.a(hash.o): In function `bfd_hash_table_init_n':
  3691. (.text+0x1b): undefined reference to `objalloc_create'
  3692. /usr/lib/gcc/x86_64-unknown-linux-gnu/4.8.1/../../../../lib/libbfd.a(hash.o): In function `bfd_hash_table_init_n':
  3693. (.text+0xa4): undefined reference to `_objalloc_alloc'
  3694. /usr/lib/gcc/x86_64-unknown-linux-gnu/4.8.1/../../../../lib/libbfd.a(hash.o): In function `bfd_hash_table_free':
  3695. (.text+0xc9): undefined reference to `objalloc_free'
  3696. /usr/lib/gcc/x86_64-unknown-linux-gnu/4.8.1/../../../../lib/libbfd.a(hash.o): In function `bfd_hash_insert':
  3697. (.text+0x2d5): undefined reference to `_objalloc_alloc'
  3698. /usr/lib/gcc/x86_64-unknown-linux-gnu/4.8.1/../../../../lib/libbfd.a(hash.o): In function `bfd_hash_lookup':
  3699. (.text+0x443): undefined reference to `_objalloc_alloc'
  3700. /usr/lib/gcc/x86_64-unknown-linux-gnu/4.8.1/../../../../lib/libbfd.a(hash.o): In function `bfd_hash_allocate':
  3701. (.text+0x631): undefined reference to `_objalloc_alloc'
  3702. /usr/lib/gcc/x86_64-unknown-linux-gnu/4.8.1/../../../../lib/libbfd.a(srec.o): In function `srec_mkobject':
  3703. (.text+0x57b): undefined reference to `hex_init'
  3704. /usr/lib/gcc/x86_64-unknown-linux-gnu/4.8.1/../../../../lib/libbfd.a(srec.o): In function `srec_get_section_contents':
  3705. (.text+0x79c): undefined reference to `_hex_value'
  3706. /usr/lib/gcc/x86_64-unknown-linux-gnu/4.8.1/../../../../lib/libbfd.a(srec.o): In function `srec_bad_byte':
  3707. (.text+0xde2): undefined reference to `_sch_istable'
  3708. /usr/lib/gcc/x86_64-unknown-linux-gnu/4.8.1/../../../../lib/libbfd.a(srec.o): In function `srec_scan':
  3709. (.text+0xf59): undefined reference to `_hex_value'
  3710. /usr/lib/gcc/x86_64-unknown-linux-gnu/4.8.1/../../../../lib/libbfd.a(srec.o): In function `srec_scan':
  3711. (.text+0x10c4): undefined reference to `_sch_istable'
  3712. /usr/lib/gcc/x86_64-unknown-linux-gnu/4.8.1/../../../../lib/libbfd.a(srec.o): In function `srec_scan':
  3713. (.text+0x1670): undefined reference to `_hex_value'
  3714. /usr/lib/gcc/x86_64-unknown-linux-gnu/4.8.1/../../../../lib/libbfd.a(srec.o): In function `srec_object_p':
  3715. (.text+0x17e1): undefined reference to `_hex_value'
  3716. /usr/lib/gcc/x86_64-unknown-linux-gnu/4.8.1/../../../../lib/libbfd.a(srec.o): In function `srec_object_p':
  3717. (.text+0x1863): undefined reference to `hex_init'
  3718. /usr/lib/gcc/x86_64-unknown-linux-gnu/4.8.1/../../../../lib/libbfd.a(srec.o): In function `symbolsrec_object_p':
  3719. (.text+0x1953): undefined reference to `hex_init'
  3720. /usr/lib/gcc/x86_64-unknown-linux-gnu/4.8.1/../../../../lib/libbfd.a(binary.o): In function `mangle_name':
  3721. (.text+0x9c): undefined reference to `_sch_istable'
  3722. /usr/lib/gcc/x86_64-unknown-linux-gnu/4.8.1/../../../../lib/libbfd.a(tekhex.o): In function `getvalue':
  3723. (.text+0x6): undefined reference to `_hex_value'
  3724. /usr/lib/gcc/x86_64-unknown-linux-gnu/4.8.1/../../../../lib/libbfd.a(tekhex.o): In function `getsym':
  3725. (.text+0x96): undefined reference to `_hex_value'
  3726. /usr/lib/gcc/x86_64-unknown-linux-gnu/4.8.1/../../../../lib/libbfd.a(tekhex.o): In function `first_phase':
  3727. (.text+0x533): undefined reference to `_hex_value'
  3728. /usr/lib/gcc/x86_64-unknown-linux-gnu/4.8.1/../../../../lib/libbfd.a(tekhex.o): In function `tekhex_init.part.2':
  3729. (.text+0x96f): undefined reference to `hex_init'
  3730. /usr/lib/gcc/x86_64-unknown-linux-gnu/4.8.1/../../../../lib/libbfd.a(tekhex.o): In function `pass_over.constprop.4':
  3731. (.text+0xd8d): undefined reference to `_hex_value'
  3732. /usr/lib/gcc/x86_64-unknown-linux-gnu/4.8.1/../../../../lib/libbfd.a(tekhex.o): In function `tekhex_object_p':
  3733. (.text+0xe66): undefined reference to `_hex_value'
  3734. /usr/lib/gcc/x86_64-unknown-linux-gnu/4.8.1/../../../../lib/libbfd.a(ihex.o): In function `ihex_bad_byte':
  3735. (.text+0x622): undefined reference to `_sch_istable'
  3736. /usr/lib/gcc/x86_64-unknown-linux-gnu/4.8.1/../../../../lib/libbfd.a(ihex.o): In function `ihex_object_p':
  3737. (.text+0x73e): undefined reference to `_hex_value'
  3738. /usr/lib/gcc/x86_64-unknown-linux-gnu/4.8.1/../../../../lib/libbfd.a(ihex.o): In function `ihex_object_p':
  3739. (.text+0x803): undefined reference to `hex_init'
  3740. /usr/lib/gcc/x86_64-unknown-linux-gnu/4.8.1/../../../../lib/libbfd.a(ihex.o): In function `ihex_get_section_contents':
  3741. (.text+0x1119): undefined reference to `_hex_value'
  3742. /usr/lib/gcc/x86_64-unknown-linux-gnu/4.8.1/../../../../lib/libbfd.a(compress.o): In function `bfd_compress_section_contents':
  3743. (.text+0x1c): undefined reference to `compressBound'
  3744. /usr/lib/gcc/x86_64-unknown-linux-gnu/4.8.1/../../../../lib/libbfd.a(compress.o): In function `bfd_compress_section_contents':
  3745. (.text+0x4a): undefined reference to `compress'
  3746. /usr/lib/gcc/x86_64-unknown-linux-gnu/4.8.1/../../../../lib/libbfd.a(compress.o): In function `bfd_get_full_section_contents':
  3747. (.text+0x1c4): undefined reference to `inflateEnd'
  3748. /usr/lib/gcc/x86_64-unknown-linux-gnu/4.8.1/../../../../lib/libbfd.a(compress.o): In function `bfd_get_full_section_contents':
  3749. (.text+0x344): undefined reference to `inflateInit_'
  3750. /usr/lib/gcc/x86_64-unknown-linux-gnu/4.8.1/../../../../lib/libbfd.a(compress.o): In function `bfd_get_full_section_contents':
  3751. (.text+0x378): undefined reference to `inflate'
  3752. /usr/lib/gcc/x86_64-unknown-linux-gnu/4.8.1/../../../../lib/libbfd.a(compress.o): In function `bfd_get_full_section_contents':
  3753. (.text+0x385): undefined reference to `inflateReset'
  3754. /usr/lib/gcc/x86_64-unknown-linux-gnu/4.8.1/../../../../lib/libbfd.a(verilog.o): In function `verilog_mkobject':
  3755. (.text+0x1ab): undefined reference to `hex_init'
  3756. /usr/lib/gcc/x86_64-unknown-linux-gnu/4.8.1/../../../../lib/libbfd.a(elf64-x86-64.o): In function `elf_x86_64_finish_dynamic_sections':
  3757. (.text+0xb79): undefined reference to `htab_traverse'
  3758. /usr/lib/gcc/x86_64-unknown-linux-gnu/4.8.1/../../../../lib/libbfd.a(elf64-x86-64.o): In function `elf_x86_64_size_dynamic_sections':
  3759. (.text+0x19df): undefined reference to `htab_traverse'
  3760. /usr/lib/gcc/x86_64-unknown-linux-gnu/4.8.1/../../../../lib/libbfd.a(elf64-x86-64.o): In function `elf_x86_64_link_hash_table_free':
  3761. (.text+0x2871): undefined reference to `htab_delete'
  3762. /usr/lib/gcc/x86_64-unknown-linux-gnu/4.8.1/../../../../lib/libbfd.a(elf64-x86-64.o): In function `elf_x86_64_link_hash_table_free':
  3763. (.text+0x2882): undefined reference to `objalloc_free'
  3764. /usr/lib/gcc/x86_64-unknown-linux-gnu/4.8.1/../../../../lib/libbfd.a(elf64-x86-64.o): In function `elf_x86_64_link_hash_table_create':
  3765. (.text+0x29bd): undefined reference to `htab_try_create'
  3766. /usr/lib/gcc/x86_64-unknown-linux-gnu/4.8.1/../../../../lib/libbfd.a(elf64-x86-64.o): In function `elf_x86_64_link_hash_table_create':
  3767. (.text+0x29c9): undefined reference to `objalloc_create'
  3768. /usr/lib/gcc/x86_64-unknown-linux-gnu/4.8.1/../../../../lib/libbfd.a(elf64-x86-64.o): In function `elf_x86_64_get_local_sym_hash.isra.4':
  3769. (.text+0x2d53): undefined reference to `htab_find_slot_with_hash'
  3770. /usr/lib/gcc/x86_64-unknown-linux-gnu/4.8.1/../../../../lib/libbfd.a(elf64-x86-64.o): In function `elf_x86_64_get_local_sym_hash.isra.4':
  3771. (.text+0x2e36): undefined reference to `_objalloc_alloc'
  3772. /usr/lib/gcc/x86_64-unknown-linux-gnu/4.8.1/../../../../lib/libbfd.a(elf-eh-frame.o): In function `_bfd_elf_discard_section_eh_frame':
  3773. (.text+0x1aaa): undefined reference to `iterative_hash'
  3774. /usr/lib/gcc/x86_64-unknown-linux-gnu/4.8.1/../../../../lib/libbfd.a(elf-eh-frame.o): In function `_bfd_elf_discard_section_eh_frame':
  3775. (.text+0x1abb): undefined reference to `iterative_hash'
  3776. /usr/lib/gcc/x86_64-unknown-linux-gnu/4.8.1/../../../../lib/libbfd.a(elf-eh-frame.o): In function `_bfd_elf_discard_section_eh_frame':
  3777. (.text+0x1ae6): undefined reference to `iterative_hash'
  3778. /usr/lib/gcc/x86_64-unknown-linux-gnu/4.8.1/../../../../lib/libbfd.a(elf-eh-frame.o): In function `_bfd_elf_discard_section_eh_frame':
  3779. (.text+0x1af7): undefined reference to `iterative_hash'
  3780. /usr/lib/gcc/x86_64-unknown-linux-gnu/4.8.1/../../../../lib/libbfd.a(elf-eh-frame.o): In function `_bfd_elf_discard_section_eh_frame':
  3781. (.text+0x1b08): undefined reference to `iterative_hash'
  3782. /usr/lib/gcc/x86_64-unknown-linux-gnu/4.8.1/../../../../lib/libbfd.a(elf-eh-frame.o):(.text+0x1b19): more undefined references to `iterative_hash' follow
  3783. /usr/lib/gcc/x86_64-unknown-linux-gnu/4.8.1/../../../../lib/libbfd.a(elf-eh-frame.o): In function `_bfd_elf_discard_section_eh_frame':
  3784. (.text+0x1bd0): undefined reference to `htab_find_slot_with_hash'
  3785. /usr/lib/gcc/x86_64-unknown-linux-gnu/4.8.1/../../../../lib/libbfd.a(elf-eh-frame.o): In function `_bfd_elf_discard_section_eh_frame':
  3786. (.text+0x1e97): undefined reference to `htab_try_create'
  3787. /usr/lib/gcc/x86_64-unknown-linux-gnu/4.8.1/../../../../lib/libbfd.a(elf-eh-frame.o): In function `_bfd_elf_discard_section_eh_frame_hdr':
  3788. (.text+0x1f2a): undefined reference to `htab_delete'
  3789. /usr/lib/gcc/x86_64-unknown-linux-gnu/4.8.1/../../../../lib/libbfd.a(elf32-i386.o): In function `elf_i386_finish_dynamic_sections':
  3790. (.text+0xacc): undefined reference to `htab_traverse'
  3791. /usr/lib/gcc/x86_64-unknown-linux-gnu/4.8.1/../../../../lib/libbfd.a(elf32-i386.o): In function `elf_i386_size_dynamic_sections':
  3792. (.text+0x1a2d): undefined reference to `htab_traverse'
  3793. /usr/lib/gcc/x86_64-unknown-linux-gnu/4.8.1/../../../../lib/libbfd.a(elf32-i386.o): In function `elf_i386_link_hash_table_free':
  3794. (.text+0x2951): undefined reference to `htab_delete'
  3795. /usr/lib/gcc/x86_64-unknown-linux-gnu/4.8.1/../../../../lib/libbfd.a(elf32-i386.o): In function `elf_i386_link_hash_table_free':
  3796. (.text+0x2962): undefined reference to `objalloc_free'
  3797. /usr/lib/gcc/x86_64-unknown-linux-gnu/4.8.1/../../../../lib/libbfd.a(elf32-i386.o): In function `elf_i386_link_hash_table_create':
  3798. (.text+0x2a43): undefined reference to `htab_try_create'
  3799. /usr/lib/gcc/x86_64-unknown-linux-gnu/4.8.1/../../../../lib/libbfd.a(elf32-i386.o): In function `elf_i386_link_hash_table_create':
  3800. (.text+0x2a4f): undefined reference to `objalloc_create'
  3801. /usr/lib/gcc/x86_64-unknown-linux-gnu/4.8.1/../../../../lib/libbfd.a(elf32-i386.o): In function `elf_i386_get_local_sym_hash.isra.3':
  3802. (.text+0x2ca9): undefined reference to `htab_find_slot_with_hash'
  3803. /usr/lib/gcc/x86_64-unknown-linux-gnu/4.8.1/../../../../lib/libbfd.a(elf32-i386.o): In function `elf_i386_get_local_sym_hash.isra.3':
  3804. (.text+0x2d8e): undefined reference to `_objalloc_alloc'
  3805. /usr/lib/gcc/x86_64-unknown-linux-gnu/4.8.1/../../../../lib/libbfd.a(aout32.o): In function `aout_32_final_link':
  3806. (.text+0x6eb3): undefined reference to `_sch_istable'
  3807. /usr/lib/gcc/x86_64-unknown-linux-gnu/4.8.1/../../../../lib/libbfd.a(cofflink.o): In function `coff_link_add_symbols':
  3808. (.text+0xa25): undefined reference to `_sch_istable'
  3809. /usr/lib/gcc/x86_64-unknown-linux-gnu/4.8.1/../../../../lib/libbfd.a(plugin.o): In function `try_load_plugin':
  3810. (.text+0x1eb): undefined reference to `dlopen'
  3811. /usr/lib/gcc/x86_64-unknown-linux-gnu/4.8.1/../../../../lib/libbfd.a(plugin.o): In function `try_load_plugin':
  3812. (.text+0x20a): undefined reference to `dlsym'
  3813. /usr/lib/gcc/x86_64-unknown-linux-gnu/4.8.1/../../../../lib/libbfd.a(plugin.o): In function `try_load_plugin':
  3814. (.text+0x2a3): undefined reference to `dlerror'
  3815. /usr/lib/gcc/x86_64-unknown-linux-gnu/4.8.1/../../../../lib/libbfd.a(plugin.o): In function `bfd_plugin_object_p':
  3816. (.text+0x4bc): undefined reference to `concat'
  3817. /usr/lib/gcc/x86_64-unknown-linux-gnu/4.8.1/../../../../lib/libbfd.a(plugin.o): In function `bfd_plugin_object_p':
  3818. (.text+0x4d5): undefined reference to `make_relative_prefix'
  3819. /usr/lib/gcc/x86_64-unknown-linux-gnu/4.8.1/../../../../lib/libbfd.a(plugin.o): In function `bfd_plugin_object_p':
  3820. (.text+0x529): undefined reference to `concat'
  3821. /usr/lib/gcc/x86_64-unknown-linux-gnu/4.8.1/../../../../lib/libbfd.a(archive.o): In function `adjust_relative_path':
  3822. (.text+0x1c5): undefined reference to `getpwd'
  3823. /usr/lib/gcc/x86_64-unknown-linux-gnu/4.8.1/../../../../lib/libbfd.a(archive.o): In function `adjust_relative_path':
  3824. (.text+0x1d2): undefined reference to `lrealpath'
  3825. /usr/lib/gcc/x86_64-unknown-linux-gnu/4.8.1/../../../../lib/libbfd.a(archive.o): In function `adjust_relative_path':
  3826. (.text+0x1e4): undefined reference to `lrealpath'
  3827. /usr/lib/gcc/x86_64-unknown-linux-gnu/4.8.1/../../../../lib/libbfd.a(archive.o): In function `adjust_relative_path':
  3828. (.text+0x26f): undefined reference to `filename_ncmp'
  3829. /usr/lib/gcc/x86_64-unknown-linux-gnu/4.8.1/../../../../lib/libbfd.a(archive.o): In function `_bfd_look_for_bfd_in_cache':
  3830. (.text+0x70c): undefined reference to `htab_find'
  3831. /usr/lib/gcc/x86_64-unknown-linux-gnu/4.8.1/../../../../lib/libbfd.a(archive.o): In function `_bfd_add_bfd_to_archive_cache':
  3832. (.text+0x776): undefined reference to `htab_find_slot'
  3833. /usr/lib/gcc/x86_64-unknown-linux-gnu/4.8.1/../../../../lib/libbfd.a(archive.o): In function `_bfd_add_bfd_to_archive_cache':
  3834. (.text+0x7b4): undefined reference to `htab_create_alloc'
  3835. /usr/lib/gcc/x86_64-unknown-linux-gnu/4.8.1/../../../../lib/libbfd.a(archive.o): In function `_bfd_generic_read_ar_hdr_mag':
  3836. (.text+0x9ce): undefined reference to `_sch_istable'
  3837. /usr/lib/gcc/x86_64-unknown-linux-gnu/4.8.1/../../../../lib/libbfd.a(archive.o): In function `_bfd_append_relative_path':
  3838. (.text+0xbb8): undefined reference to `lbasename'
  3839. /usr/lib/gcc/x86_64-unknown-linux-gnu/4.8.1/../../../../lib/libbfd.a(archive.o): In function `_bfd_get_elt_at_filepos':
  3840. (.text+0xcd8): undefined reference to `filename_cmp'
  3841. /usr/lib/gcc/x86_64-unknown-linux-gnu/4.8.1/../../../../lib/libbfd.a(archive.o): In function `_bfd_construct_extended_name_table':
  3842. (.text+0x1959): undefined reference to `filename_cmp'
  3843. /usr/lib/gcc/x86_64-unknown-linux-gnu/4.8.1/../../../../lib/libbfd.a(archive.o): In function `_bfd_construct_extended_name_table':
  3844. (.text+0x19bb): undefined reference to `lbasename'
  3845. /usr/lib/gcc/x86_64-unknown-linux-gnu/4.8.1/../../../../lib/libbfd.a(archive.o): In function `_bfd_construct_extended_name_table':
  3846. (.text+0x1a01): undefined reference to `filename_ncmp'
  3847. /usr/lib/gcc/x86_64-unknown-linux-gnu/4.8.1/../../../../lib/libbfd.a(archive.o): In function `_bfd_construct_extended_name_table':
  3848. (.text+0x1b68): undefined reference to `filename_cmp'
  3849. /usr/lib/gcc/x86_64-unknown-linux-gnu/4.8.1/../../../../lib/libbfd.a(archive.o): In function `_bfd_construct_extended_name_table':
  3850. (.text+0x1c8d): undefined reference to `lbasename'
  3851. /usr/lib/gcc/x86_64-unknown-linux-gnu/4.8.1/../../../../lib/libbfd.a(archive.o): In function `_bfd_archive_bsd44_construct_extended_name_table':
  3852. (.text+0x1d8e): undefined reference to `lbasename'
  3853. /usr/lib/gcc/x86_64-unknown-linux-gnu/4.8.1/../../../../lib/libbfd.a(archive.o): In function `_bfd_bsd44_write_ar_hdr':
  3854. (.text+0x1ec3): undefined reference to `_sch_istable'
  3855. /usr/lib/gcc/x86_64-unknown-linux-gnu/4.8.1/../../../../lib/libbfd.a(archive.o): In function `_bfd_bsd44_write_ar_hdr':
  3856. (.text+0x1ed2): undefined reference to `lbasename'
  3857. /usr/lib/gcc/x86_64-unknown-linux-gnu/4.8.1/../../../../lib/libbfd.a(archive.o): In function `bfd_bsd_truncate_arname':
  3858. (.text+0x2092): undefined reference to `lbasename'
  3859. /usr/lib/gcc/x86_64-unknown-linux-gnu/4.8.1/../../../../lib/libbfd.a(archive.o): In function `bfd_dont_truncate_arname':
  3860. (.text+0x2120): undefined reference to `lbasename'
  3861. /usr/lib/gcc/x86_64-unknown-linux-gnu/4.8.1/../../../../lib/libbfd.a(archive.o): In function `bfd_gnu_truncate_arname':
  3862. (.text+0x21b2): undefined reference to `lbasename'
  3863. /usr/lib/gcc/x86_64-unknown-linux-gnu/4.8.1/../../../../lib/libbfd.a(archures.o): In function `bfd_default_scan':
  3864. (.text+0xe3): undefined reference to `_sch_istable'
  3865. /usr/lib/gcc/x86_64-unknown-linux-gnu/4.8.1/../../../../lib/libbfd.a(bfd.o): In function `bfd_errmsg':
  3866. (.text+0x118): undefined reference to `xstrerror'
  3867. /usr/lib/gcc/x86_64-unknown-linux-gnu/4.8.1/../../../../lib/libbfd.a(bfd.o): In function `bfd_demangle':
  3868. (.text+0x110f): undefined reference to `cplus_demangle'
  3869. /usr/lib/gcc/x86_64-unknown-linux-gnu/4.8.1/../../../../lib/libbfd.a(bfd.o): In function `bfd_demangle':
  3870. (.text+0x11f7): undefined reference to `cplus_demangle'
  3871. /usr/lib/gcc/x86_64-unknown-linux-gnu/4.8.1/../../../../lib/libbfd.a(cache.o): In function `bfd_open_file':
  3872. (.text+0x355): undefined reference to `unlink_if_ordinary'
  3873. /usr/lib/gcc/x86_64-unknown-linux-gnu/4.8.1/../../../../lib/libbfd.a(corefile.o): In function `generic_core_file_matches_executable_p':
  3874. (.text+0x142): undefined reference to `filename_cmp'
  3875. /usr/lib/gcc/x86_64-unknown-linux-gnu/4.8.1/../../../../lib/libbfd.a(syms.o): In function `bfd_decode_symclass':
  3876. (.text+0x2f4): undefined reference to `_sch_toupper'
  3877. /usr/lib/gcc/x86_64-unknown-linux-gnu/4.8.1/../../../../lib/libbfd.a(syms.o): In function `_bfd_stab_section_find_nearest_line':
  3878. (.text+0x73b): undefined reference to `filename_ncmp'
  3879. /usr/lib/gcc/x86_64-unknown-linux-gnu/4.8.1/../../../../lib/libbfd.a(syms.o): In function `_bfd_stab_section_find_nearest_line':
  3880. (.text+0xb6d): undefined reference to `filename_cmp'
  3881. /usr/lib/gcc/x86_64-unknown-linux-gnu/4.8.1/../../../../lib/libbfd.a(stabs.o): In function `_bfd_link_section_stabs':
  3882. (.text+0x6af): undefined reference to `_sch_istable'
  3883. collect2: error: ld returned 1 exit status
  3884. configure:34495: $? = 1
  3885. configure: failed program was:
  3886. | /* confdefs.h */
  3887. | #define PACKAGE_NAME "cairo"
  3888. | #define PACKAGE_TARNAME "cairo"
  3889. | #define PACKAGE_VERSION "1.12.16"
  3890. | #define PACKAGE_STRING "cairo 1.12.16"
  3891. | #define PACKAGE_BUGREPORT "http://bugs.freedesktop.org/enter_bug.cgi?product=cairo"
  3892. | #define PACKAGE_URL "http://cairographics.org/"
  3893. | #define STDC_HEADERS 1
  3894. | #define HAVE_SYS_TYPES_H 1
  3895. | #define HAVE_SYS_STAT_H 1
  3896. | #define HAVE_STDLIB_H 1
  3897. | #define HAVE_STRING_H 1
  3898. | #define HAVE_MEMORY_H 1
  3899. | #define HAVE_STRINGS_H 1
  3900. | #define HAVE_INTTYPES_H 1
  3901. | #define HAVE_STDINT_H 1
  3902. | #define HAVE_UNISTD_H 1
  3903. | #define __EXTENSIONS__ 1
  3904. | #define _ALL_SOURCE 1
  3905. | #define _GNU_SOURCE 1
  3906. | #define _POSIX_PTHREAD_SEMANTICS 1
  3907. | #define _TANDEM_SOURCE 1
  3908. | #define HAVE_UNISTD_H 1
  3909. | #define HAVE_SYS_IOCTL_H 1
  3910. | #define HAVE_DLFCN_H 1
  3911. | #define LT_OBJDIR ".libs/"
  3912. | #define WARN_UNUSED_RESULT __attribute__((__warn_unused_result__))
  3913. | #define HAVE_INTEL_ATOMIC_PRIMITIVES 1
  3914. | #define SIZEOF_VOID_P 8
  3915. | #define SIZEOF_INT 4
  3916. | #define SIZEOF_LONG 8
  3917. | #define SIZEOF_LONG_LONG 8
  3918. | #define SIZEOF_SIZE_T 8
  3919. | #define HAVE_LIBRT 1
  3920. | #define HAVE_BUILTIN_RETURN_ADDRESS 1
  3921. | #define HAVE_STDINT_H 1
  3922. | #define HAVE_INTTYPES_H 1
  3923. | #define HAVE_UINT64_T 1
  3924. | #define HAVE___UINT128_T 1
  3925. | #define HAVE_FCNTL_H 1
  3926. | #define HAVE_UNISTD_H 1
  3927. | #define HAVE_SIGNAL_H 1
  3928. | #define HAVE_SYS_STAT_H 1
  3929. | #define HAVE_SYS_SOCKET_H 1
  3930. | #define HAVE_SYS_POLL_H 1
  3931. | #define HAVE_SYS_UN_H 1
  3932. | #define HAVE_ALARM 1
  3933. | #define HAVE_SCHED_H 1
  3934. | #define HAVE_SCHED_GETAFFINITY 1
  3935. | #define HAVE_SYS_MMAN_H 1
  3936. | #define HAVE_MMAP 1
  3937. | #define HAVE_TIME_H 1
  3938. | #define HAVE_CLOCK_GETTIME 1
  3939. | #define HAVE_FEENABLEEXCEPT 1
  3940. | #define HAVE_FEDISABLEEXCEPT 1
  3941. | #define HAVE_FECLEAREXCEPT 1
  3942. | #define HAVE_LIBGEN_H 1
  3943. | #define HAVE_BYTESWAP_H 1
  3944. | #define HAVE_SIGNAL_H 1
  3945. | #define HAVE_SETJMP_H 1
  3946. | #define HAVE_FENV_H 1
  3947. | #define HAVE_SYS_WAIT_H 1
  3948. | #define HAVE_CTIME_R 1
  3949. | #define HAVE_DRAND48 1
  3950. | #define HAVE_FLOCKFILE 1
  3951. | #define HAVE_FUNLOCKFILE 1
  3952. | #define HAVE_GETLINE 1
  3953. | #define HAVE_LINK 1
  3954. | #define HAVE_STRNDUP 1
  3955. | #define HAVE_SYS_STAT_H 1
  3956. | #define HAVE_MKDIR 2
  3957. | #define HAVE_FORK 1
  3958. | #define HAVE_WAITPID 1
  3959. | #define HAVE_RAISE 1
  3960. | #define HAVE_VALGRIND 1
  3961. | #undef PACKAGE_VERSION
  3962. | #undef PACKAGE_STRING
  3963. | #undef PACKAGE_NAME
  3964. | #undef PACKAGE_TARNAME
  3965. | #define PACKAGE_VERSION USE_cairo_version_OR_cairo_version_string_INSTEAD
  3966. | #define PACKAGE_STRING USE_cairo_version_OR_cairo_version_string_INSTEAD
  3967. | #define PACKAGE_NAME USE_cairo_INSTEAD
  3968. | #define PACKAGE_TARNAME USE_cairo_INSTEAD
  3969. | #define HAVE_ZLIB 1
  3970. | #define HAVE_LZO 1
  3971. | #define HAVE_DLFCN_H 1
  3972. | #define CAIRO_HAS_DLSYM 1
  3973. | #define IPC_RMID_DEFERRED_RELEASE 1
  3974. | #define HAVE_X11_EXTENSIONS_XSHM_H 1
  3975. | #define HAVE_X11_EXTENSIONS_SHMPROTO_H 1
  3976. | #define HAVE_X11_EXTENSIONS_SHMSTR_H 1
  3977. | #define HAVE_XRENDERCREATELINEARGRADIENT 1
  3978. | #define HAVE_XRENDERCREATERADIALGRADIENT 1
  3979. | #define HAVE_XRENDERCREATECONICALGRADIENT 1
  3980. | #define HAVE_FT_GET_X11_FONT_FORMAT 1
  3981. | #define HAVE_FT_GLYPHSLOT_EMBOLDEN 1
  3982. | #define HAVE_FT_GLYPHSLOT_OBLIQUE 1
  3983. | #define HAVE_FT_LOAD_SFNT_TABLE 1
  3984. | #define HAVE_FT_LIBRARY_SETLCDFILTER 1
  3985. | #define HAVE_FCINIT 1
  3986. | #define HAVE_FCFINI 1
  3987. | #define CAIRO_CAN_TEST_PS_SURFACE 1
  3988. | #define CAIRO_HAS_SPECTRE 1
  3989. | #define HAVE_POPPLER_PAGE_RENDER 1
  3990. | #define CAIRO_CAN_TEST_PDF_SURFACE 1
  3991. | #define HAVE_RSVG_PIXBUF_FROM_FILE 1
  3992. | #define CAIRO_CAN_TEST_SVG_SURFACE 1
  3993. | #define HAS_PIXMAN_GLYPHS 1
  3994. | #define CAIRO_HAS_REAL_PTHREAD 1
  3995. | #define CAIRO_HAS_PTHREAD 1
  3996. | #define CAIRO_HAS_PTHREAD 1
  3997. | #define SHARED_LIB_EXT "so"
  3998. | #define CAIRO_HAS_TRACE 1
  3999. | #define CAIRO_HAS_INTERPRETER 1
  4000. | /* end confdefs.h.  */
  4001. |
  4002. | /* Override any GCC internal prototype to avoid an error.
  4003. |    Use char because int might match the return type of a GCC
  4004. |    builtin and then its argument prototype would still apply.  */
  4005. | #ifdef __cplusplus
  4006. | extern "C"
  4007. | #endif
  4008. | char bfd_openr ();
  4009. | int
  4010. | main ()
  4011. | {
  4012. | return bfd_openr ();
  4013. |   ;
  4014. |   return 0;
  4015. | }
  4016. configure:34504: result: no
  4017. configure:34519: checking libiberty.h usability
  4018. configure:34519: gcc -c -march=x86-64 -mtune=generic -O2 -pipe -fstack-protector --param=ssp-buffer-size=4 -D_FORTIFY_SOURCE=2 conftest.c >&5
  4019. configure:34519: $? = 0
  4020. configure:34519: result: yes
  4021. configure:34519: checking libiberty.h presence
  4022. configure:34519: gcc -E -D_FORTIFY_SOURCE=2 conftest.c
  4023. In file included from /usr/include/stdio.h:27:0,
  4024.                  from /usr/include/libiberty.h:50,
  4025.                  from conftest.c:116:
  4026. /usr/include/features.h:327:4: warning: #warning _FORTIFY_SOURCE requires compiling with optimization (-O) [-Wcpp]
  4027.  #  warning _FORTIFY_SOURCE requires compiling with optimization (-O)
  4028.     ^
  4029. configure:34519: $? = 0
  4030. configure:34519: result: yes
  4031. configure:34519: checking for libiberty.h
  4032. configure:34519: result: yes
  4033. configure:34547: checking for cairo's symbol-lookup feature
  4034. configure:34567: checking whether cairo's symbol-lookup feature could be enabled
  4035. configure:34569: result: no (requires bfd)
  4036. configure:34720: checking for glib
  4037. configure:34727: $PKG_CONFIG --exists --print-errors "glib-2.0"
  4038. configure:34730: $? = 0
  4039. configure:34743: $PKG_CONFIG --exists --print-errors "glib-2.0"
  4040. configure:34746: $? = 0
  4041. configure:34781: result: yes
  4042. configure:34797: checking for shm_open in -lrt
  4043. configure:34831: result: yes
  4044. configure:34894: checking for gtk
  4045. configure:34901: $PKG_CONFIG --exists --print-errors ""gtk+-2.0""
  4046. configure:34904: $? = 0
  4047. configure:34917: $PKG_CONFIG --exists --print-errors ""gtk+-2.0""
  4048. configure:34920: $? = 0
  4049. configure:34955: result: yes
  4050. configure:35575: creating ./config.status
  4051.  
  4052. ## ---------------------- ##
  4053. ## Running config.status. ##
  4054. ## ---------------------- ##
  4055.  
  4056. This file was extended by cairo config.status 1.12.16, which was
  4057. generated by GNU Autoconf 2.69.  Invocation command line was
  4058.  
  4059.   CONFIG_FILES    =
  4060.   CONFIG_HEADERS  =
  4061.   CONFIG_LINKS    =
  4062.   CONFIG_COMMANDS =
  4063.   $ ./config.status
  4064.  
  4065. on chakra-pc
  4066.  
  4067. config.status:4621: creating src/cairo.pc
  4068. config.status:4621: creating cairo-uninstalled.pc
  4069. config.status:4621: creating src/cairo-xlib.pc
  4070. config.status:4621: creating cairo-xlib-uninstalled.pc
  4071. config.status:4621: creating src/cairo-xlib-xrender.pc
  4072. config.status:4621: creating cairo-xlib-xrender-uninstalled.pc
  4073. config.status:4621: creating src/cairo-xcb.pc
  4074. config.status:4621: creating cairo-xcb-uninstalled.pc
  4075. config.status:4621: creating src/cairo-xcb-shm.pc
  4076. config.status:4621: creating cairo-xcb-shm-uninstalled.pc
  4077. config.status:4621: creating src/cairo-png.pc
  4078. config.status:4621: creating cairo-png-uninstalled.pc
  4079. config.status:4621: creating src/cairo-gl.pc
  4080. config.status:4621: creating cairo-gl-uninstalled.pc
  4081. config.status:4621: creating src/cairo-egl.pc
  4082. config.status:4621: creating cairo-egl-uninstalled.pc
  4083. config.status:4621: creating src/cairo-glx.pc
  4084. config.status:4621: creating cairo-glx-uninstalled.pc
  4085. config.status:4621: creating src/cairo-script.pc
  4086. config.status:4621: creating cairo-script-uninstalled.pc
  4087. config.status:4621: creating src/cairo-ft.pc
  4088. config.status:4621: creating cairo-ft-uninstalled.pc
  4089. config.status:4621: creating src/cairo-fc.pc
  4090. config.status:4621: creating cairo-fc-uninstalled.pc
  4091. config.status:4621: creating src/cairo-ps.pc
  4092. config.status:4621: creating cairo-ps-uninstalled.pc
  4093. config.status:4621: creating src/cairo-pdf.pc
  4094. config.status:4621: creating cairo-pdf-uninstalled.pc
  4095. config.status:4621: creating src/cairo-svg.pc
  4096. config.status:4621: creating cairo-svg-uninstalled.pc
  4097. config.status:4621: creating src/cairo-tee.pc
  4098. config.status:4621: creating cairo-tee-uninstalled.pc
  4099. config.status:4621: creating src/cairo-gobject.pc
  4100. config.status:4621: creating cairo-gobject-uninstalled.pc
  4101. config.status:4621: creating Makefile
  4102. config.status:4621: creating boilerplate/Makefile
  4103. config.status:4621: creating src/Makefile
  4104. config.status:4621: creating test/Makefile
  4105. config.status:4621: creating test/pdiff/Makefile
  4106. config.status:4621: creating perf/Makefile
  4107. config.status:4621: creating perf/micro/Makefile
  4108. config.status:4621: creating util/Makefile
  4109. config.status:4621: creating util/cairo-fdr/Makefile
  4110. config.status:4621: creating util/cairo-gobject/Makefile
  4111. config.status:4621: creating util/cairo-missing/Makefile
  4112. config.status:4621: creating util/cairo-script/Makefile
  4113. config.status:4621: creating util/cairo-script/examples/Makefile
  4114. config.status:4621: creating util/cairo-sphinx/Makefile
  4115. config.status:4621: creating util/cairo-trace/Makefile
  4116. config.status:4621: creating util/cairo-trace/cairo-trace
  4117. config.status:4621: creating doc/Makefile
  4118. config.status:4621: creating doc/public/Makefile
  4119. config.status:4621: creating config.h
  4120. config.status:4850: executing depfiles commands
  4121. config.status:4850: executing libtool commands
  4122. config.status:4850: executing ./build/Makefile.win32.features commands
  4123. config.status:5755: creating ./build/Makefile.win32.features
  4124. config.status:4850: executing ./src/Makefile.am.features commands
  4125. config.status:5774: creating ./src/Makefile.am.features
  4126. config.status:4850: executing ./src/Makefile.win32.features commands
  4127. config.status:5793: creating ./src/Makefile.win32.features
  4128. config.status:4850: executing ./boilerplate/Makefile.am.features commands
  4129. config.status:5812: creating ./boilerplate/Makefile.am.features
  4130. config.status:4850: executing ./boilerplate/Makefile.win32.features commands
  4131. config.status:5831: creating ./boilerplate/Makefile.win32.features
  4132. config.status:4850: executing src/cairo-features.h commands
  4133. config.status:5850: creating src/cairo-features.h
  4134. config.status:4850: executing src/cairo-supported-features.h commands
  4135. config.status:5882: creating src/cairo-supported-features.h
  4136. config.status:4850: executing ./build/Makefile.win32.features-h commands
  4137. config.status:5912: creating ./build/Makefile.win32.features-h
  4138.  
  4139. ## ---------------- ##
  4140. ## Cache variables. ##
  4141. ## ---------------- ##
  4142.  
  4143. ac_cv_build=x86_64-unknown-linux-gnu
  4144. ac_cv_c_bigendian=no
  4145. ac_cv_c_compiler_gnu=yes
  4146. ac_cv_c_inline=inline
  4147. ac_cv_cxx_compiler_gnu=yes
  4148. ac_cv_env_CCC_set=
  4149. ac_cv_env_CCC_value=
  4150. ac_cv_env_CC_set=
  4151. ac_cv_env_CC_value=
  4152. ac_cv_env_CFLAGS_set=set
  4153. ac_cv_env_CFLAGS_value='-march=x86-64 -mtune=generic -O2 -pipe -fstack-protector --param=ssp-buffer-size=4'
  4154. ac_cv_env_CPPFLAGS_set=set
  4155. ac_cv_env_CPPFLAGS_value=-D_FORTIFY_SOURCE=2
  4156. ac_cv_env_CPP_set=
  4157. ac_cv_env_CPP_value=
  4158. ac_cv_env_CXXCPP_set=
  4159. ac_cv_env_CXXCPP_value=
  4160. ac_cv_env_CXXFLAGS_set=set
  4161. ac_cv_env_CXXFLAGS_value='-march=x86-64 -mtune=generic -O2 -pipe -fstack-protector --param=ssp-buffer-size=4'
  4162. ac_cv_env_CXX_set=
  4163. ac_cv_env_CXX_value=
  4164. ac_cv_env_FONTCONFIG_CFLAGS_set=
  4165. ac_cv_env_FONTCONFIG_CFLAGS_value=
  4166. ac_cv_env_FONTCONFIG_LIBS_set=
  4167. ac_cv_env_FONTCONFIG_LIBS_value=
  4168. ac_cv_env_FREETYPE_CFLAGS_set=
  4169. ac_cv_env_FREETYPE_CFLAGS_value=
  4170. ac_cv_env_FREETYPE_LIBS_set=
  4171. ac_cv_env_FREETYPE_LIBS_value=
  4172. ac_cv_env_GOBJECT_CFLAGS_set=
  4173. ac_cv_env_GOBJECT_CFLAGS_value=
  4174. ac_cv_env_GOBJECT_LIBS_set=
  4175. ac_cv_env_GOBJECT_LIBS_value=
  4176. ac_cv_env_GTKDOC_DEPS_CFLAGS_set=
  4177. ac_cv_env_GTKDOC_DEPS_CFLAGS_value=
  4178. ac_cv_env_GTKDOC_DEPS_LIBS_set=
  4179. ac_cv_env_GTKDOC_DEPS_LIBS_value=
  4180. ac_cv_env_LDFLAGS_set=set
  4181. ac_cv_env_LDFLAGS_value=-Wl,-O1,--sort-common,--as-needed,-z,relro
  4182. ac_cv_env_LIBRSVG_CFLAGS_set=
  4183. ac_cv_env_LIBRSVG_CFLAGS_value=
  4184. ac_cv_env_LIBRSVG_LIBS_set=
  4185. ac_cv_env_LIBRSVG_LIBS_value=
  4186. ac_cv_env_LIBSPECTRE_CFLAGS_set=
  4187. ac_cv_env_LIBSPECTRE_CFLAGS_value=
  4188. ac_cv_env_LIBSPECTRE_LIBS_set=
  4189. ac_cv_env_LIBSPECTRE_LIBS_value=
  4190. ac_cv_env_LIBS_set=
  4191. ac_cv_env_LIBS_value=
  4192. ac_cv_env_PKG_CONFIG_set=
  4193. ac_cv_env_PKG_CONFIG_value=
  4194. ac_cv_env_POPPLER_CFLAGS_set=
  4195. ac_cv_env_POPPLER_CFLAGS_value=
  4196. ac_cv_env_POPPLER_LIBS_set=
  4197. ac_cv_env_POPPLER_LIBS_value=
  4198. ac_cv_env_VALGRIND_CFLAGS_set=
  4199. ac_cv_env_VALGRIND_CFLAGS_value=
  4200. ac_cv_env_VALGRIND_LIBS_set=
  4201. ac_cv_env_VALGRIND_LIBS_value=
  4202. ac_cv_env_XMKMF_set=
  4203. ac_cv_env_XMKMF_value=
  4204. ac_cv_env_build_alias_set=
  4205. ac_cv_env_build_alias_value=
  4206. ac_cv_env_cogl_CFLAGS_set=
  4207. ac_cv_env_cogl_CFLAGS_value=
  4208. ac_cv_env_cogl_LIBS_set=
  4209. ac_cv_env_cogl_LIBS_value=
  4210. ac_cv_env_directfb_CFLAGS_set=
  4211. ac_cv_env_directfb_CFLAGS_value=
  4212. ac_cv_env_directfb_LIBS_set=
  4213. ac_cv_env_directfb_LIBS_value=
  4214. ac_cv_env_drm_CFLAGS_set=
  4215. ac_cv_env_drm_CFLAGS_value=
  4216. ac_cv_env_drm_LIBS_set=
  4217. ac_cv_env_drm_LIBS_value=
  4218. ac_cv_env_egl_CFLAGS_set=
  4219. ac_cv_env_egl_CFLAGS_value=
  4220. ac_cv_env_egl_LIBS_set=
  4221. ac_cv_env_egl_LIBS_value=
  4222. ac_cv_env_gl_CFLAGS_set=
  4223. ac_cv_env_gl_CFLAGS_value=
  4224. ac_cv_env_gl_LIBS_set=
  4225. ac_cv_env_gl_LIBS_value=
  4226. ac_cv_env_glesv2_CFLAGS_set=
  4227. ac_cv_env_glesv2_CFLAGS_value=
  4228. ac_cv_env_glesv2_LIBS_set=
  4229. ac_cv_env_glesv2_LIBS_value=
  4230. ac_cv_env_glib_CFLAGS_set=
  4231. ac_cv_env_glib_CFLAGS_value=
  4232. ac_cv_env_glib_LIBS_set=
  4233. ac_cv_env_glib_LIBS_value=
  4234. ac_cv_env_gtk_CFLAGS_set=
  4235. ac_cv_env_gtk_CFLAGS_value=
  4236. ac_cv_env_gtk_LIBS_set=
  4237. ac_cv_env_gtk_LIBS_value=
  4238. ac_cv_env_host_alias_set=
  4239. ac_cv_env_host_alias_value=
  4240. ac_cv_env_pixman_CFLAGS_set=
  4241. ac_cv_env_pixman_CFLAGS_value=
  4242. ac_cv_env_pixman_LIBS_set=
  4243. ac_cv_env_pixman_LIBS_value=
  4244. ac_cv_env_png_CFLAGS_set=
  4245. ac_cv_env_png_CFLAGS_value=
  4246. ac_cv_env_png_LIBS_set=
  4247. ac_cv_env_png_LIBS_value=
  4248. ac_cv_env_png_REQUIRES_set=
  4249. ac_cv_env_png_REQUIRES_value=
  4250. ac_cv_env_qt_CFLAGS_set=
  4251. ac_cv_env_qt_CFLAGS_value=
  4252. ac_cv_env_qt_LIBS_set=
  4253. ac_cv_env_qt_LIBS_value=
  4254. ac_cv_env_target_alias_set=
  4255. ac_cv_env_target_alias_value=
  4256. ac_cv_env_xcb_CFLAGS_set=
  4257. ac_cv_env_xcb_CFLAGS_value=
  4258. ac_cv_env_xcb_LIBS_set=
  4259. ac_cv_env_xcb_LIBS_value=
  4260. ac_cv_env_xcb_shm_CFLAGS_set=
  4261. ac_cv_env_xcb_shm_CFLAGS_value=
  4262. ac_cv_env_xcb_shm_LIBS_set=
  4263. ac_cv_env_xcb_shm_LIBS_value=
  4264. ac_cv_env_xlib_CFLAGS_set=
  4265. ac_cv_env_xlib_CFLAGS_value=
  4266. ac_cv_env_xlib_LIBS_set=
  4267. ac_cv_env_xlib_LIBS_value=
  4268. ac_cv_env_xlib_xcb_CFLAGS_set=
  4269. ac_cv_env_xlib_xcb_CFLAGS_value=
  4270. ac_cv_env_xlib_xcb_LIBS_set=
  4271. ac_cv_env_xlib_xcb_LIBS_value=
  4272. ac_cv_env_xlib_xrender_CFLAGS_set=
  4273. ac_cv_env_xlib_xrender_CFLAGS_value=
  4274. ac_cv_env_xlib_xrender_LIBS_set=
  4275. ac_cv_env_xlib_xrender_LIBS_value=
  4276. ac_cv_func_FT_Get_X11_Font_Format=yes
  4277. ac_cv_func_FT_GlyphSlot_Embolden=yes
  4278. ac_cv_func_FT_GlyphSlot_Oblique=yes
  4279. ac_cv_func_FT_Library_SetLcdFilter=yes
  4280. ac_cv_func_FT_Load_Sfnt_Table=yes
  4281. ac_cv_func_FcFini=yes
  4282. ac_cv_func_FcInit=yes
  4283. ac_cv_func_XRenderCreateConicalGradient=yes
  4284. ac_cv_func_XRenderCreateLinearGradient=yes
  4285. ac_cv_func_XRenderCreateRadialGradient=yes
  4286. ac_cv_func_alarm=yes
  4287. ac_cv_func_clock_gettime=yes
  4288. ac_cv_func_ctime_r=yes
  4289. ac_cv_func_drand48=yes
  4290. ac_cv_func_feclearexcept=yes
  4291. ac_cv_func_fedisableexcept=yes
  4292. ac_cv_func_feenableexcept=yes
  4293. ac_cv_func_flockfile=yes
  4294. ac_cv_func_fork=yes
  4295. ac_cv_func_funlockfile=yes
  4296. ac_cv_func_getline=yes
  4297. ac_cv_func_link=yes
  4298. ac_cv_func_mkdir=yes
  4299. ac_cv_func_mmap=yes
  4300. ac_cv_func_poppler_page_render=yes
  4301. ac_cv_func_raise=yes
  4302. ac_cv_func_rsvg_pixbuf_from_file=yes
  4303. ac_cv_func_sched_getaffinity=yes
  4304. ac_cv_func_strndup=yes
  4305. ac_cv_func_waitpid=yes
  4306. ac_cv_have_x='have_x=yes    ac_x_includes='\'''\''  ac_x_libraries='\'''\'''
  4307. ac_cv_header_ApplicationServices_ApplicationServices_h=no
  4308. ac_cv_header_CoreGraphics_CoreGraphics_h=no
  4309. ac_cv_header_GL_glx_h=yes
  4310. ac_cv_header_X11_extensions_XShm_h=yes
  4311. ac_cv_header_X11_extensions_shmproto_h=yes
  4312. ac_cv_header_X11_extensions_shmstr_h=yes
  4313. ac_cv_header_byteswap_h=yes
  4314. ac_cv_header_dlfcn_h=yes
  4315. ac_cv_header_fcntl_h=yes
  4316. ac_cv_header_fenv_h=yes
  4317. ac_cv_header_inttypes_h=yes
  4318. ac_cv_header_io_h=no
  4319. ac_cv_header_libgen_h=yes
  4320. ac_cv_header_libiberty_h=yes
  4321. ac_cv_header_lockdep_h=no
  4322. ac_cv_header_lzo_lzo2a_h=yes
  4323. ac_cv_header_memfault_h=no
  4324. ac_cv_header_memory_h=yes
  4325. ac_cv_header_minix_config_h=no
  4326. ac_cv_header_sched_h=yes
  4327. ac_cv_header_setjmp_h=yes
  4328. ac_cv_header_signal_h=yes
  4329. ac_cv_header_stdc=yes
  4330. ac_cv_header_stdint_h=yes
  4331. ac_cv_header_stdlib_h=yes
  4332. ac_cv_header_string_h=yes
  4333. ac_cv_header_strings_h=yes
  4334. ac_cv_header_sys_int_types_h=no
  4335. ac_cv_header_sys_ioctl_h=yes
  4336. ac_cv_header_sys_ipc_h=yes
  4337. ac_cv_header_sys_mman_h=yes
  4338. ac_cv_header_sys_poll_h=yes
  4339. ac_cv_header_sys_shm_h=yes
  4340. ac_cv_header_sys_socket_h=yes
  4341. ac_cv_header_sys_stat_h=yes
  4342. ac_cv_header_sys_types_h=yes
  4343. ac_cv_header_sys_un_h=yes
  4344. ac_cv_header_sys_wait_h=yes
  4345. ac_cv_header_time_h=yes
  4346. ac_cv_header_unistd_h=yes
  4347. ac_cv_header_valgrind_h=yes
  4348. ac_cv_header_windows_h=no
  4349. ac_cv_header_zlib_h=yes
  4350. ac_cv_host=x86_64-unknown-linux-gnu
  4351. ac_cv_lib_bfd_bfd_openr=no
  4352. ac_cv_lib_dl_dlsym=yes
  4353. ac_cv_lib_lzo2_lzo2a_decompress=yes
  4354. ac_cv_lib_m_cos=yes
  4355. ac_cv_lib_rt_sched_yield=yes
  4356. ac_cv_lib_rt_shm_open=yes
  4357. ac_cv_lib_socket_connect=no
  4358. ac_cv_lib_z_compress=yes
  4359. ac_cv_objext=o
  4360. ac_cv_path_EGREP='/usr/bin/grep -E'
  4361. ac_cv_path_FGREP='/usr/bin/grep -F'
  4362. ac_cv_path_FIND=/usr/bin/find
  4363. ac_cv_path_GREP=/usr/bin/grep
  4364. ac_cv_path_GTKDOC_CHECK=/usr/bin/gtkdoc-check
  4365. ac_cv_path_GTKDOC_MKPDF=/usr/bin/gtkdoc-mkpdf
  4366. ac_cv_path_GTKDOC_REBASE=/usr/bin/gtkdoc-rebase
  4367. ac_cv_path_SED=/bin/sed
  4368. ac_cv_path_XARGS=/usr/bin/xargs
  4369. ac_cv_path_ac_pt_PKG_CONFIG=/usr/bin/pkg-config
  4370. ac_cv_path_install='/usr/bin/install -c'
  4371. ac_cv_path_mkdir=/usr/bin/mkdir
  4372. ac_cv_prog_AWK=gawk
  4373. ac_cv_prog_CPP='gcc -E'
  4374. ac_cv_prog_CXXCPP='g++ -E'
  4375. ac_cv_prog_GS=gs
  4376. ac_cv_prog_ac_ct_AR=ar
  4377. ac_cv_prog_ac_ct_CC=gcc
  4378. ac_cv_prog_ac_ct_CXX=g++
  4379. ac_cv_prog_ac_ct_OBJDUMP=objdump
  4380. ac_cv_prog_ac_ct_RANLIB=ranlib
  4381. ac_cv_prog_ac_ct_STRIP=strip
  4382. ac_cv_prog_cc_c89=
  4383. ac_cv_prog_cc_g=yes
  4384. ac_cv_prog_cc_gcc_c_o=yes
  4385. ac_cv_prog_cxx_g=yes
  4386. ac_cv_prog_make_make_set=yes
  4387. ac_cv_safe_to_define___extensions__=yes
  4388. ac_cv_sizeof_int=4
  4389. ac_cv_sizeof_long=8
  4390. ac_cv_sizeof_long_long=8
  4391. ac_cv_sizeof_size_t=8
  4392. ac_cv_sizeof_void_p=8
  4393. ac_cv_sys_file_offset_bits=no
  4394. ac_cv_sys_largefile_CC=no
  4395. ac_cv_type___uint128_t=yes
  4396. ac_cv_type_uint128_t=no
  4397. ac_cv_type_uint64_t=yes
  4398. am_cv_CC_dependencies_compiler_type=gcc3
  4399. am_cv_CXX_dependencies_compiler_type=gcc3
  4400. am_cv_ar_interface=ar
  4401. am_cv_make_support_nested_variables=yes
  4402. ax_cv_c_float_words_bigendian=no
  4403. cairo_cv_atomic_op_needs_memory_barrier=no
  4404. cairo_cv_atomic_primitives=Intel
  4405. cairo_cv_test_undefined_ldflags=-Wl,--allow-shlib-undefined
  4406. cairo_cv_warn_cflags=' -Wall -Wextra -Wold-style-definition -Wdeclaration-after-statement -Wmissing-declarations -Werror-implicit-function-declaration -Wnested-externs -Wpointer-arith -Wwrite-strings -Wsign-compare -Wstrict-prototypes -Wmissing-prototypes -Wpacked -Wswitch-enum -Wmissing-format-attribute -Wbad-function-cast -Wvolatile-register-var -Wstrict-aliasing=2 -Winit-self -Wunsafe-loop-optimizations -Wno-missing-field-initializers -Wno-unused-parameter -Wno-attributes -Wno-long-long -Winline -fno-strict-aliasing -fno-common -Wp,-D_FORTIFY_SOURCE=2 -Wno-unused-but-set-variable'
  4407. cairo_cv_warn_maybe='-Wall -Wextra -Wold-style-definition -Wdeclaration-after-statement -Wmissing-declarations -Werror-implicit-function-declaration -Wnested-externs -Wpointer-arith -Wwrite-strings -Wsign-compare -Wstrict-prototypes -Wmissing-prototypes -Wpacked -Wswitch-enum -Wmissing-format-attribute -Wbad-function-cast -Wvolatile-register-var -Wstrict-aliasing=2 -Winit-self -Wunsafe-loop-optimizations -Wno-missing-field-initializers -Wno-unused-parameter -Wno-attributes -Wno-long-long -Winline -erroff=E_ENUM_TYPE_MISMATCH_ARG          -erroff=E_ENUM_TYPE_MISMATCH_OP -fno-strict-aliasing -fno-common -Wp,-D_FORTIFY_SOURCE=2'
  4408. cairo_cv_warn_unused_result='__attribute__((__warn_unused_result__))'
  4409. lt_cv_ar_at_file=@
  4410. lt_cv_archive_cmds_need_lc=no
  4411. lt_cv_deplibs_check_method=pass_all
  4412. lt_cv_file_magic_cmd='$MAGIC_CMD'
  4413. lt_cv_file_magic_test_file=
  4414. lt_cv_ld_reload_flag=-r
  4415. lt_cv_nm_interface='BSD nm'
  4416. lt_cv_objdir=.libs
  4417. lt_cv_path_LD=/usr/bin/ld
  4418. lt_cv_path_LDCXX='/usr/bin/ld -m elf_x86_64'
  4419. lt_cv_path_NM='/usr/bin/nm -B'
  4420. lt_cv_path_mainfest_tool=no
  4421. lt_cv_prog_compiler_c_o=yes
  4422. lt_cv_prog_compiler_c_o_CXX=yes
  4423. lt_cv_prog_compiler_pic='-fPIC -DPIC'
  4424. lt_cv_prog_compiler_pic_CXX='-fPIC -DPIC'
  4425. lt_cv_prog_compiler_pic_works=yes
  4426. lt_cv_prog_compiler_pic_works_CXX=yes
  4427. lt_cv_prog_compiler_rtti_exceptions=no
  4428. lt_cv_prog_compiler_static_works=yes
  4429. lt_cv_prog_compiler_static_works_CXX=yes
  4430. lt_cv_prog_gnu_ld=yes
  4431. lt_cv_prog_gnu_ldcxx=yes
  4432. lt_cv_sharedlib_from_linklib_cmd='printf %s\n'
  4433. lt_cv_shlibpath_overrides_runpath=no
  4434. lt_cv_sys_global_symbol_pipe='sed -n -e '\''s/^.*[   ]\([ABCDGIRSTW][ABCDGIRSTW]*\)[     ][  ]*\([_A-Za-z][_A-Za-z0-9]*\)$/\1 \2 \2/p'\'' | sed '\''/ __gnu_lto/d'\'''
  4435. lt_cv_sys_global_symbol_to_c_name_address='sed -n -e '\''s/^: \([^ ]*\)[ ]*$/  {\"\1\", (void *) 0},/p'\'' -e '\''s/^[ABCDGIRSTW]* \([^ ]*\) \([^ ]*\)$/  {"\2", (void *) \&\2},/p'\'''
  4436. lt_cv_sys_global_symbol_to_c_name_address_lib_prefix='sed -n -e '\''s/^: \([^ ]*\)[ ]*$/  {\"\1\", (void *) 0},/p'\'' -e '\''s/^[ABCDGIRSTW]* \([^ ]*\) \(lib[^ ]*\)$/  {"\2", (void *) \&\2},/p'\'' -e '\''s/^[ABCDGIRSTW]* \([^ ]*\) \([^ ]*\)$/  {"lib\2", (void *) \&\2},/p'\'''
  4437. lt_cv_sys_global_symbol_to_cdecl='sed -n -e '\''s/^T .* \(.*\)$/extern int \1();/p'\'' -e '\''s/^[ABCDGIRSTW]* .* \(.*\)$/extern char \1;/p'\'''
  4438. lt_cv_sys_max_cmd_len=1572864
  4439. lt_cv_to_host_file_cmd=func_convert_file_noop
  4440. lt_cv_to_tool_file_cmd=func_convert_file_noop
  4441. pkg_cv_FONTCONFIG_CFLAGS='-I/usr/include/freetype2  '
  4442. pkg_cv_FONTCONFIG_LIBS='-lfontconfig -lfreetype  '
  4443. pkg_cv_FREETYPE_CFLAGS='-I/usr/include/freetype2  '
  4444. pkg_cv_FREETYPE_LIBS='-lfreetype  '
  4445. pkg_cv_GOBJECT_CFLAGS='-I/usr/include/glib-2.0 -I/usr/lib/glib-2.0/include  '
  4446. pkg_cv_GOBJECT_LIBS='-lgobject-2.0 -lglib-2.0  '
  4447. pkg_cv_LIBRSVG_CFLAGS='-pthread -I/usr/include/librsvg-2.0 -I/usr/include/glib-2.0 -I/usr/lib/glib-2.0/include -I/usr/include/gdk-pixbuf-2.0 -I/usr/include/cairo -I/usr/include/libpng16 -I/usr/include/pixman-1 -I/usr/include/freetype2 -I/usr/include/libdrm -I/usr/include/gtk-2.0 -I/usr/lib/gtk-2.0/include -I/usr/include/pango-1.0  '
  4448. pkg_cv_LIBRSVG_LIBS='-lrsvg-2 -lm -lgio-2.0 -lgdk-x11-2.0 -lpangocairo-1.0 -lgdk_pixbuf-2.0 -lpango-1.0 -lcairo -lgobject-2.0 -lglib-2.0  '
  4449. pkg_cv_LIBSPECTRE_CFLAGS=' '
  4450. pkg_cv_LIBSPECTRE_LIBS='-lspectre  '
  4451. pkg_cv_POPPLER_CFLAGS='-pthread -I/usr/include/poppler/glib -I/usr/include/poppler -I/usr/include/glib-2.0 -I/usr/lib/glib-2.0/include -I/usr/include/cairo -I/usr/include/pixman-1 -I/usr/include/freetype2 -I/usr/include/libpng16 -I/usr/include/libdrm  '
  4452. pkg_cv_POPPLER_LIBS='-lpoppler-glib -lgio-2.0 -lcairo -lgobject-2.0 -lglib-2.0  '
  4453. pkg_cv_VALGRIND_CFLAGS='-I/usr/include/valgrind  '
  4454. pkg_cv_VALGRIND_LIBS='-L/usr/lib/valgrind -lcoregrind-amd64-linux -lvex-amd64-linux -lgcc  '
  4455. pkg_cv_egl_CFLAGS='-I/usr/include/libdrm  '
  4456. pkg_cv_egl_LIBS='-lEGL  '
  4457. pkg_cv_gl_CFLAGS='-I/usr/include/libdrm  '
  4458. pkg_cv_gl_LIBS='-lGL  '
  4459. pkg_cv_glib_CFLAGS='-I/usr/include/glib-2.0 -I/usr/lib/glib-2.0/include  '
  4460. pkg_cv_glib_LIBS='-lglib-2.0  '
  4461. pkg_cv_gtk_CFLAGS='-pthread -I/usr/include/gtk-2.0 -I/usr/lib/gtk-2.0/include -I/usr/include/atk-1.0 -I/usr/include/cairo -I/usr/include/gdk-pixbuf-2.0 -I/usr/include/pango-1.0 -I/usr/include/glib-2.0 -I/usr/lib/glib-2.0/include -I/usr/include/pixman-1 -I/usr/include/freetype2 -I/usr/include/libpng16 -I/usr/include/libdrm -I/usr/include/harfbuzz  '
  4462. pkg_cv_gtk_LIBS='-lgtk-x11-2.0 -lgdk-x11-2.0 -latk-1.0 -lgio-2.0 -lpangoft2-1.0 -lpangocairo-1.0 -lgdk_pixbuf-2.0 -lcairo -lpango-1.0 -lfontconfig -lgobject-2.0 -lglib-2.0 -lfreetype  '
  4463. pkg_cv_pixman_CFLAGS='-I/usr/include/pixman-1  '
  4464. pkg_cv_pixman_LIBS='-lpixman-1  '
  4465. pkg_cv_png_CFLAGS='-I/usr/include/libpng16  '
  4466. pkg_cv_png_LIBS='-lpng16  '
  4467. pkg_cv_xcb_CFLAGS=' '
  4468. pkg_cv_xcb_LIBS='-lxcb-render -lxcb  '
  4469. pkg_cv_xcb_shm_CFLAGS=' '
  4470. pkg_cv_xcb_shm_LIBS='-lxcb-shm -lxcb  '
  4471. pkg_cv_xlib_CFLAGS=' '
  4472. pkg_cv_xlib_LIBS='-lX11 -lXext  '
  4473. pkg_cv_xlib_xrender_CFLAGS=' '
  4474. pkg_cv_xlib_xrender_LIBS='-lXrender -lX11  '
  4475.  
  4476. ## ----------------- ##
  4477. ## Output variables. ##
  4478. ## ----------------- ##
  4479.  
  4480. ACLOCAL='${SHELL} "/home/manu2/Build/prova/cairo-official chakra/src/cairo-1.12.16/build/missing" --run aclocal-1.11'
  4481. AMDEPBACKSLASH='\'
  4482. AMDEP_FALSE='#'
  4483. AMDEP_TRUE=''
  4484. AMTAR='$${TAR-tar}'
  4485. AM_BACKSLASH='\'
  4486. AM_DEFAULT_V='$(AM_DEFAULT_VERBOSITY)'
  4487. AM_DEFAULT_VERBOSITY='0'
  4488. AM_V='$(V)'
  4489. AR='ar'
  4490. AS='as'
  4491. AUTOCONF='${SHELL} "/home/manu2/Build/prova/cairo-official chakra/src/cairo-1.12.16/build/missing" --run autoconf'
  4492. AUTOHEADER='${SHELL} "/home/manu2/Build/prova/cairo-official chakra/src/cairo-1.12.16/build/missing" --run autoheader'
  4493. AUTOMAKE='${SHELL} "/home/manu2/Build/prova/cairo-official chakra/src/cairo-1.12.16/build/missing" --run automake-1.11'
  4494. AWK='gawk'
  4495. BFD_LIBS=''
  4496. BUILD_ANY2PPM_FALSE='#'
  4497. BUILD_ANY2PPM_TRUE=''
  4498. BUILD_CXX_FALSE=''
  4499. BUILD_CXX_TRUE='#'
  4500. BUILD_SPHINX_FALSE='#'
  4501. BUILD_SPHINX_TRUE=''
  4502. CAIROBOILERPLATE_LIBS=''
  4503. CAIRO_CAN_TEST_PDF_SURFACE_FALSE='#'
  4504. CAIRO_CAN_TEST_PDF_SURFACE_TRUE=''
  4505. CAIRO_CAN_TEST_PS_SURFACE_FALSE='#'
  4506. CAIRO_CAN_TEST_PS_SURFACE_TRUE=''
  4507. CAIRO_CAN_TEST_SVG_SURFACE_FALSE='#'
  4508. CAIRO_CAN_TEST_SVG_SURFACE_TRUE=''
  4509. CAIRO_CAN_TEST_WIN32_PRINTING_SURFACE_FALSE=''
  4510. CAIRO_CAN_TEST_WIN32_PRINTING_SURFACE_TRUE='#'
  4511. CAIRO_CFLAGS='   -D_REENTRANT      -I/usr/include/pixman-1      -I/usr/include/freetype2   -I/usr/include/freetype2     -I/usr/include/libdrm   -I/usr/include/libdrm   -I/usr/include/libpng16           -I/usr/include/valgrind     -Wall -Wextra -Wold-style-definition -Wdeclaration-after-statement -Wmissing-declarations -Werror-implicit-function-declaration -Wnested-externs -Wpointer-arith -Wwrite-strings -Wsign-compare -Wstrict-prototypes -Wmissing-prototypes -Wpacked -Wswitch-enum -Wmissing-format-attribute -Wbad-function-cast -Wvolatile-register-var -Wstrict-aliasing=2 -Winit-self -Wunsafe-loop-optimizations -Wno-missing-field-initializers -Wno-unused-parameter -Wno-attributes -Wno-long-long -Winline -fno-strict-aliasing -fno-common -Wp,-D_FORTIFY_SOURCE=2 -Wno-unused-but-set-variable                         '
  4512. CAIRO_HAS_BEOS_SURFACE_FALSE=''
  4513. CAIRO_HAS_BEOS_SURFACE_TRUE='#'
  4514. CAIRO_HAS_COGL_SURFACE_FALSE=''
  4515. CAIRO_HAS_COGL_SURFACE_TRUE='#'
  4516. CAIRO_HAS_DIRECTFB_SURFACE_FALSE=''
  4517. CAIRO_HAS_DIRECTFB_SURFACE_TRUE='#'
  4518. CAIRO_HAS_DLSYM_FALSE='#'
  4519. CAIRO_HAS_DLSYM_TRUE=''
  4520. CAIRO_HAS_DL_FALSE='#'
  4521. CAIRO_HAS_DL_TRUE=''
  4522. CAIRO_HAS_DRM_SURFACE_FALSE=''
  4523. CAIRO_HAS_DRM_SURFACE_TRUE='#'
  4524. CAIRO_HAS_EGL_FUNCTIONS_FALSE='#'
  4525. CAIRO_HAS_EGL_FUNCTIONS_TRUE=''
  4526. CAIRO_HAS_FC_FONT_FALSE='#'
  4527. CAIRO_HAS_FC_FONT_TRUE=''
  4528. CAIRO_HAS_FT_FONT_FALSE='#'
  4529. CAIRO_HAS_FT_FONT_TRUE=''
  4530. CAIRO_HAS_GALLIUM_SURFACE_FALSE=''
  4531. CAIRO_HAS_GALLIUM_SURFACE_TRUE='#'
  4532. CAIRO_HAS_GLESV2_SURFACE_FALSE=''
  4533. CAIRO_HAS_GLESV2_SURFACE_TRUE='#'
  4534. CAIRO_HAS_GLX_FUNCTIONS_FALSE='#'
  4535. CAIRO_HAS_GLX_FUNCTIONS_TRUE=''
  4536. CAIRO_HAS_GL_SURFACE_FALSE='#'
  4537. CAIRO_HAS_GL_SURFACE_TRUE=''
  4538. CAIRO_HAS_GOBJECT_FUNCTIONS_FALSE='#'
  4539. CAIRO_HAS_GOBJECT_FUNCTIONS_TRUE=''
  4540. CAIRO_HAS_INTERPRETER_FALSE='#'
  4541. CAIRO_HAS_INTERPRETER_TRUE=''
  4542. CAIRO_HAS_LCOV_FALSE=''
  4543. CAIRO_HAS_LCOV_TRUE='#'
  4544. CAIRO_HAS_MULTI_PAGE_SURFACES_FALSE='#'
  4545. CAIRO_HAS_MULTI_PAGE_SURFACES_TRUE=''
  4546. CAIRO_HAS_OS2_SURFACE_FALSE=''
  4547. CAIRO_HAS_OS2_SURFACE_TRUE='#'
  4548. CAIRO_HAS_PDF_SURFACE_FALSE='#'
  4549. CAIRO_HAS_PDF_SURFACE_TRUE=''
  4550. CAIRO_HAS_PERF_UTILS_FALSE=''
  4551. CAIRO_HAS_PERF_UTILS_TRUE='#'
  4552. CAIRO_HAS_PNG_FUNCTIONS_FALSE='#'
  4553. CAIRO_HAS_PNG_FUNCTIONS_TRUE=''
  4554. CAIRO_HAS_PS_SURFACE_FALSE='#'
  4555. CAIRO_HAS_PS_SURFACE_TRUE=''
  4556. CAIRO_HAS_PTHREAD_FALSE='#'
  4557. CAIRO_HAS_PTHREAD_TRUE=''
  4558. CAIRO_HAS_QT_SURFACE_FALSE=''
  4559. CAIRO_HAS_QT_SURFACE_TRUE='#'
  4560. CAIRO_HAS_QUARTZ_FONT_FALSE=''
  4561. CAIRO_HAS_QUARTZ_FONT_TRUE='#'
  4562. CAIRO_HAS_QUARTZ_IMAGE_SURFACE_FALSE=''
  4563. CAIRO_HAS_QUARTZ_IMAGE_SURFACE_TRUE='#'
  4564. CAIRO_HAS_QUARTZ_SURFACE_FALSE=''
  4565. CAIRO_HAS_QUARTZ_SURFACE_TRUE='#'
  4566. CAIRO_HAS_SCRIPT_SURFACE_FALSE='#'
  4567. CAIRO_HAS_SCRIPT_SURFACE_TRUE=''
  4568. CAIRO_HAS_SKIA_SURFACE_FALSE=''
  4569. CAIRO_HAS_SKIA_SURFACE_TRUE='#'
  4570. CAIRO_HAS_SPECTRE_FALSE='#'
  4571. CAIRO_HAS_SPECTRE_TRUE=''
  4572. CAIRO_HAS_SVG_SURFACE_FALSE='#'
  4573. CAIRO_HAS_SVG_SURFACE_TRUE=''
  4574. CAIRO_HAS_SYMBOL_LOOKUP_FALSE=''
  4575. CAIRO_HAS_SYMBOL_LOOKUP_TRUE='#'
  4576. CAIRO_HAS_TEE_SURFACE_FALSE='#'
  4577. CAIRO_HAS_TEE_SURFACE_TRUE=''
  4578. CAIRO_HAS_TEST_SURFACES_FALSE=''
  4579. CAIRO_HAS_TEST_SURFACES_TRUE='#'
  4580. CAIRO_HAS_TRACE_FALSE='#'
  4581. CAIRO_HAS_TRACE_TRUE=''
  4582. CAIRO_HAS_VG_SURFACE_FALSE=''
  4583. CAIRO_HAS_VG_SURFACE_TRUE='#'
  4584. CAIRO_HAS_WGL_FUNCTIONS_FALSE=''
  4585. CAIRO_HAS_WGL_FUNCTIONS_TRUE='#'
  4586. CAIRO_HAS_WIN32_FONT_FALSE=''
  4587. CAIRO_HAS_WIN32_FONT_TRUE='#'
  4588. CAIRO_HAS_WIN32_SURFACE_FALSE=''
  4589. CAIRO_HAS_WIN32_SURFACE_TRUE='#'
  4590. CAIRO_HAS_XCB_SHM_FUNCTIONS_FALSE='#'
  4591. CAIRO_HAS_XCB_SHM_FUNCTIONS_TRUE=''
  4592. CAIRO_HAS_XCB_SURFACE_FALSE='#'
  4593. CAIRO_HAS_XCB_SURFACE_TRUE=''
  4594. CAIRO_HAS_XLIB_SURFACE_FALSE='#'
  4595. CAIRO_HAS_XLIB_SURFACE_TRUE=''
  4596. CAIRO_HAS_XLIB_XCB_FUNCTIONS_FALSE=''
  4597. CAIRO_HAS_XLIB_XCB_FUNCTIONS_TRUE='#'
  4598. CAIRO_HAS_XLIB_XRENDER_SURFACE_FALSE='#'
  4599. CAIRO_HAS_XLIB_XRENDER_SURFACE_TRUE=''
  4600. CAIRO_HAS_XML_SURFACE_FALSE=''
  4601. CAIRO_HAS_XML_SURFACE_TRUE='#'
  4602. CAIRO_LDFLAGS=''
  4603. CAIRO_LIBS='   -lpthread      -lpixman-1      -lfontconfig -lfreetype   -lfreetype     -lEGL   -lGL   -ldl -lpng16   -lxcb-shm -lxcb   -lxcb-render -lxcb   -lXrender -lX11   -lX11 -lXext               -lz -lz    -lGL        '
  4604. CAIRO_LIBTOOL_VERSION_INFO='11202:16:11200'
  4605. CAIRO_NONPKGCONFIG_CFLAGS='                        '
  4606. CAIRO_NONPKGCONFIG_LIBS='           -lz -lz    -lGL        '
  4607. CAIRO_RELEASE_STATUS='release'
  4608. CAIRO_REQUIRES='  gobject-2.0 glib-2.0       pixman-1 >= 0.16.0    fontconfig >= 2.2.95 freetype2 >= 9.7.3    egl gl libpng xcb-shm xcb >= 1.6 xcb-render >= 1.6 xrender >= 0.6 x11 xext '
  4609. CAIRO_TEST_MODE=''
  4610. CAIRO_TEST_UNDEFINED_LDFLAGS='-Wl,--allow-shlib-undefined'
  4611. CAIRO_VERSION_MAJOR='1'
  4612. CAIRO_VERSION_MICRO='16'
  4613. CAIRO_VERSION_MINOR='12'
  4614. CAIRO_VERSION_SONUM='2'
  4615. CC='gcc'
  4616. CCDEPMODE='depmode=gcc3'
  4617. CFLAGS='-march=x86-64 -mtune=generic -O2 -pipe -fstack-protector --param=ssp-buffer-size=4'
  4618. CPP='gcc -E'
  4619. CPPFLAGS='-D_FORTIFY_SOURCE=2'
  4620. CROSS_COMPILING_FALSE=''
  4621. CROSS_COMPILING_TRUE='#'
  4622. CXX='g++'
  4623. CXXCPP='g++ -E'
  4624. CXXDEPMODE='depmode=gcc3'
  4625. CXXFLAGS='-march=x86-64 -mtune=generic -O2 -pipe -fstack-protector --param=ssp-buffer-size=4'
  4626. CYGPATH_W='echo'
  4627. DEFS='-DHAVE_CONFIG_H'
  4628. DEPDIR='.deps'
  4629. DISABLE_SOME_FLOATING_POINT_FALSE=''
  4630. DISABLE_SOME_FLOATING_POINT_TRUE='#'
  4631. DLLTOOL='false'
  4632. DSYMUTIL=''
  4633. DUMPBIN=''
  4634. ECHO_C=''
  4635. ECHO_N='-n'
  4636. ECHO_T=''
  4637. EGREP='/usr/bin/grep -E'
  4638. ENABLE_GTK_DOC_FALSE=''
  4639. ENABLE_GTK_DOC_TRUE='#'
  4640. EXEEXT=''
  4641. FGREP='/usr/bin/grep -F'
  4642. FIND='/usr/bin/find'
  4643. FONTCONFIG_CFLAGS='-I/usr/include/freetype2  '
  4644. FONTCONFIG_LIBS='-lfontconfig -lfreetype  '
  4645. FREETYPE_CFLAGS='-I/usr/include/freetype2  '
  4646. FREETYPE_CONFIG=''
  4647. FREETYPE_LIBS='-lfreetype  '
  4648. GOBJECT_CFLAGS='-I/usr/include/glib-2.0 -I/usr/lib/glib-2.0/include  '
  4649. GOBJECT_LIBS='-lgobject-2.0 -lglib-2.0  '
  4650. GREP='/usr/bin/grep'
  4651. GS='gs'
  4652. GTKDOC_CHECK='/usr/bin/gtkdoc-check'
  4653. GTKDOC_DEPS_CFLAGS=''
  4654. GTKDOC_DEPS_LIBS=''
  4655. GTKDOC_MKPDF='/usr/bin/gtkdoc-mkpdf'
  4656. GTKDOC_REBASE='/usr/bin/gtkdoc-rebase'
  4657. GTK_DOC_BUILD_HTML_FALSE='#'
  4658. GTK_DOC_BUILD_HTML_TRUE=''
  4659. GTK_DOC_BUILD_PDF_FALSE=''
  4660. GTK_DOC_BUILD_PDF_TRUE='#'
  4661. GTK_DOC_USE_LIBTOOL_FALSE='#'
  4662. GTK_DOC_USE_LIBTOOL_TRUE=''
  4663. GTK_DOC_USE_REBASE_FALSE='#'
  4664. GTK_DOC_USE_REBASE_TRUE=''
  4665. HAVE_GTK_FALSE='#'
  4666. HAVE_GTK_TRUE=''
  4667. HAVE_PTHREAD_FALSE='#'
  4668. HAVE_PTHREAD_TRUE=''
  4669. HAVE_REAL_PTHREAD_FALSE='#'
  4670. HAVE_REAL_PTHREAD_TRUE=''
  4671. HAVE_SHM_FALSE='#'
  4672. HAVE_SHM_TRUE=''
  4673. HTML_DIR='${datadir}/gtk-doc/html'
  4674. INSTALL_DATA='${INSTALL} -m 644'
  4675. INSTALL_PROGRAM='${INSTALL}'
  4676. INSTALL_SCRIPT='${INSTALL}'
  4677. INSTALL_STRIP_PROGRAM='$(install_sh) -c -s'
  4678. LD='/usr/bin/ld -m elf_x86_64'
  4679. LDFLAGS='-Wl,-O1,--sort-common,--as-needed,-z,relro'
  4680. LIBM='-lm'
  4681. LIBOBJS=''
  4682. LIBRSVG_CFLAGS='-pthread -I/usr/include/librsvg-2.0 -I/usr/include/glib-2.0 -I/usr/lib/glib-2.0/include -I/usr/include/gdk-pixbuf-2.0 -I/usr/include/cairo -I/usr/include/libpng16 -I/usr/include/pixman-1 -I/usr/include/freetype2 -I/usr/include/libdrm -I/usr/include/gtk-2.0 -I/usr/lib/gtk-2.0/include -I/usr/include/pango-1.0  '
  4683. LIBRSVG_LIBS='-lrsvg-2 -lm -lgio-2.0 -lgdk-x11-2.0 -lpangocairo-1.0 -lgdk_pixbuf-2.0 -lpango-1.0 -lcairo -lgobject-2.0 -lglib-2.0  '
  4684. LIBS='-lrt  -lm'
  4685. LIBSPECTRE_CFLAGS=' '
  4686. LIBSPECTRE_LIBS='-lspectre  '
  4687. LIBTOOL='$(SHELL) $(top_builddir)/libtool'
  4688. LIPO=''
  4689. LN_S='ln -s'
  4690. LTLIBOBJS=''
  4691. LTP=''
  4692. LTP_GENHTML=''
  4693. MAINT='#'
  4694. MAINTAINER_MODE_FALSE=''
  4695. MAINTAINER_MODE_TRUE='#'
  4696. MAKEINFO='${SHELL} "/home/manu2/Build/prova/cairo-official chakra/src/cairo-1.12.16/build/missing" --run makeinfo'
  4697. MANIFEST_TOOL=':'
  4698. MKDIR_P='/usr/bin/mkdir -p'
  4699. NM='/usr/bin/nm -B'
  4700. NMEDIT=''
  4701. OBJDUMP='objdump'
  4702. OBJEXT='o'
  4703. OS_WIN32_FALSE=''
  4704. OS_WIN32_TRUE='#'
  4705. OTOOL64=''
  4706. OTOOL=''
  4707. PACKAGE='cairo'
  4708. PACKAGE_BUGREPORT='http://bugs.freedesktop.org/enter_bug.cgi?product=cairo'
  4709. PACKAGE_NAME='cairo'
  4710. PACKAGE_STRING='cairo 1.12.16'
  4711. PACKAGE_TARNAME='cairo'
  4712. PACKAGE_URL='http://cairographics.org/'
  4713. PACKAGE_VERSION='1.12.16'
  4714. PATH_SEPARATOR=':'
  4715. PKGCONFIG_REQUIRES='Requires.private'
  4716. PKG_CONFIG='/usr/bin/pkg-config'
  4717. POPPLER_CFLAGS='-pthread -I/usr/include/poppler/glib -I/usr/include/poppler -I/usr/include/glib-2.0 -I/usr/lib/glib-2.0/include -I/usr/include/cairo -I/usr/include/pixman-1 -I/usr/include/freetype2 -I/usr/include/libpng16 -I/usr/include/libdrm  '
  4718. POPPLER_LIBS='-lpoppler-glib -lgio-2.0 -lcairo -lgobject-2.0 -lglib-2.0  '
  4719. RANLIB='ranlib'
  4720. SED='/bin/sed'
  4721. SET_MAKE=''
  4722. SHELL='/bin/sh'
  4723. SHLIB_EXT='so'
  4724. SHM_LIBS='-lrt'
  4725. SHTOOL=''
  4726. STRIP='strip'
  4727. VALGRIND_CFLAGS='-I/usr/include/valgrind  '
  4728. VALGRIND_LIBS='-L/usr/lib/valgrind -lcoregrind-amd64-linux -lvex-amd64-linux -lgcc  '
  4729. VERSION='1.12.16'
  4730. XARGS='/usr/bin/xargs'
  4731. XMKMF=''
  4732. X_CFLAGS=''
  4733. X_EXTRA_LIBS=''
  4734. X_LIBS=''
  4735. X_PRE_LIBS=''
  4736. ac_ct_AR='ar'
  4737. ac_ct_CC='gcc'
  4738. ac_ct_CXX='g++'
  4739. ac_ct_DUMPBIN=''
  4740. am__EXEEXT_FALSE=''
  4741. am__EXEEXT_TRUE='#'
  4742. am__fastdepCC_FALSE='#'
  4743. am__fastdepCC_TRUE=''
  4744. am__fastdepCXX_FALSE='#'
  4745. am__fastdepCXX_TRUE=''
  4746. am__include='include'
  4747. am__isrc=''
  4748. am__leading_dot='.'
  4749. am__nodep='_no'
  4750. am__quote=''
  4751. am__tar='$${TAR-tar} chof - "$$tardir"'
  4752. am__untar='$${TAR-tar} xf -'
  4753. bindir='${exec_prefix}/bin'
  4754. build='x86_64-unknown-linux-gnu'
  4755. build_alias=''
  4756. build_cpu='x86_64'
  4757. build_os='linux-gnu'
  4758. build_vendor='unknown'
  4759. cogl_CFLAGS=''
  4760. cogl_LIBS=''
  4761. datadir='${datarootdir}'
  4762. datarootdir='${prefix}/share'
  4763. directfb_CFLAGS=''
  4764. directfb_LIBS=''
  4765. docdir='${datarootdir}/doc/${PACKAGE_TARNAME}'
  4766. drm_CFLAGS=''
  4767. drm_LIBS=''
  4768. dvidir='${docdir}'
  4769. egl_CFLAGS='-I/usr/include/libdrm  '
  4770. egl_LIBS='-lEGL  '
  4771. exec_prefix='${prefix}'
  4772. gallium_DIR=''
  4773. gl_CFLAGS='-I/usr/include/libdrm  '
  4774. gl_LIBS='-lGL   -ldl'
  4775. glesv2_CFLAGS=''
  4776. glesv2_LIBS=''
  4777. glib_CFLAGS='-I/usr/include/glib-2.0 -I/usr/lib/glib-2.0/include  '
  4778. glib_LIBS='-lglib-2.0  '
  4779. gtk_CFLAGS='-pthread -I/usr/include/gtk-2.0 -I/usr/lib/gtk-2.0/include -I/usr/include/atk-1.0 -I/usr/include/cairo -I/usr/include/gdk-pixbuf-2.0 -I/usr/include/pango-1.0 -I/usr/include/glib-2.0 -I/usr/lib/glib-2.0/include -I/usr/include/pixman-1 -I/usr/include/freetype2 -I/usr/include/libpng16 -I/usr/include/libdrm -I/usr/include/harfbuzz  '
  4780. gtk_LIBS='-lgtk-x11-2.0 -lgdk-x11-2.0 -latk-1.0 -lgio-2.0 -lpangoft2-1.0 -lpangocairo-1.0 -lgdk_pixbuf-2.0 -lcairo -lpango-1.0 -lfontconfig -lgobject-2.0 -lglib-2.0 -lfreetype  '
  4781. host='x86_64-unknown-linux-gnu'
  4782. host_alias=''
  4783. host_cpu='x86_64'
  4784. host_os='linux-gnu'
  4785. host_vendor='unknown'
  4786. htmldir='${docdir}'
  4787. includedir='${prefix}/include'
  4788. infodir='${datarootdir}/info'
  4789. install_sh='${SHELL} '\''/home/manu2/Build/prova/cairo-official chakra/src/cairo-1.12.16/build/install-sh'\'''
  4790. libdir='${exec_prefix}/lib'
  4791. libexecdir='${exec_prefix}/libexec'
  4792. localedir='${datarootdir}/locale'
  4793. localstatedir='/var'
  4794. lzo_LIBS='-llzo2'
  4795. mandir='${datarootdir}/man'
  4796. mesa_DIR=''
  4797. mkdir_p='/usr/bin/mkdir -p'
  4798. oldincludedir='/usr/include'
  4799. pdfdir='${docdir}'
  4800. pixman_CFLAGS='-I/usr/include/pixman-1  '
  4801. pixman_LIBS='-lpixman-1  '
  4802. png_CFLAGS='-I/usr/include/libpng16  '
  4803. png_LIBS='-lpng16  '
  4804. png_REQUIRES='libpng'
  4805. prefix='/usr'
  4806. program_transform_name='s,x,x,'
  4807. psdir='${docdir}'
  4808. pthread_CFLAGS='-D_REENTRANT'
  4809. pthread_LIBS='-lpthread'
  4810. qt_CFLAGS=''
  4811. qt_LIBS=''
  4812. real_pthread_CFLAGS='-D_REENTRANT'
  4813. real_pthread_LIBS='-lpthread'
  4814. sbindir='${exec_prefix}/sbin'
  4815. sharedstatedir='${prefix}/com'
  4816. shm_LIBS='-lrt'
  4817. skia_DIR=''
  4818. sysconfdir='/etc'
  4819. target_alias=''
  4820. xcb_CFLAGS=' '
  4821. xcb_LIBS='-lxcb-render -lxcb  '
  4822. xcb_shm_CFLAGS=' '
  4823. xcb_shm_LIBS='-lxcb-shm -lxcb  '
  4824. xlib_CFLAGS=' '
  4825. xlib_LIBS='-lX11 -lXext  '
  4826. xlib_xcb_CFLAGS=''
  4827. xlib_xcb_LIBS=''
  4828. xlib_xrender_CFLAGS=' '
  4829. xlib_xrender_LIBS='-lXrender -lX11  '
  4830.  
  4831. ## ----------- ##
  4832. ## confdefs.h. ##
  4833. ## ----------- ##
  4834.  
  4835. /* confdefs.h */
  4836. #define PACKAGE_NAME "cairo"
  4837. #define PACKAGE_TARNAME "cairo"
  4838. #define PACKAGE_VERSION "1.12.16"
  4839. #define PACKAGE_STRING "cairo 1.12.16"
  4840. #define PACKAGE_BUGREPORT "http://bugs.freedesktop.org/enter_bug.cgi?product=cairo"
  4841. #define PACKAGE_URL "http://cairographics.org/"
  4842. #define STDC_HEADERS 1
  4843. #define HAVE_SYS_TYPES_H 1
  4844. #define HAVE_SYS_STAT_H 1
  4845. #define HAVE_STDLIB_H 1
  4846. #define HAVE_STRING_H 1
  4847. #define HAVE_MEMORY_H 1
  4848. #define HAVE_STRINGS_H 1
  4849. #define HAVE_INTTYPES_H 1
  4850. #define HAVE_STDINT_H 1
  4851. #define HAVE_UNISTD_H 1
  4852. #define __EXTENSIONS__ 1
  4853. #define _ALL_SOURCE 1
  4854. #define _GNU_SOURCE 1
  4855. #define _POSIX_PTHREAD_SEMANTICS 1
  4856. #define _TANDEM_SOURCE 1
  4857. #define HAVE_UNISTD_H 1
  4858. #define HAVE_SYS_IOCTL_H 1
  4859. #define HAVE_DLFCN_H 1
  4860. #define LT_OBJDIR ".libs/"
  4861. #define WARN_UNUSED_RESULT __attribute__((__warn_unused_result__))
  4862. #define HAVE_INTEL_ATOMIC_PRIMITIVES 1
  4863. #define SIZEOF_VOID_P 8
  4864. #define SIZEOF_INT 4
  4865. #define SIZEOF_LONG 8
  4866. #define SIZEOF_LONG_LONG 8
  4867. #define SIZEOF_SIZE_T 8
  4868. #define HAVE_LIBRT 1
  4869. #define HAVE_BUILTIN_RETURN_ADDRESS 1
  4870. #define HAVE_STDINT_H 1
  4871. #define HAVE_INTTYPES_H 1
  4872. #define HAVE_UINT64_T 1
  4873. #define HAVE___UINT128_T 1
  4874. #define HAVE_FCNTL_H 1
  4875. #define HAVE_UNISTD_H 1
  4876. #define HAVE_SIGNAL_H 1
  4877. #define HAVE_SYS_STAT_H 1
  4878. #define HAVE_SYS_SOCKET_H 1
  4879. #define HAVE_SYS_POLL_H 1
  4880. #define HAVE_SYS_UN_H 1
  4881. #define HAVE_ALARM 1
  4882. #define HAVE_SCHED_H 1
  4883. #define HAVE_SCHED_GETAFFINITY 1
  4884. #define HAVE_SYS_MMAN_H 1
  4885. #define HAVE_MMAP 1
  4886. #define HAVE_TIME_H 1
  4887. #define HAVE_CLOCK_GETTIME 1
  4888. #define HAVE_FEENABLEEXCEPT 1
  4889. #define HAVE_FEDISABLEEXCEPT 1
  4890. #define HAVE_FECLEAREXCEPT 1
  4891. #define HAVE_LIBGEN_H 1
  4892. #define HAVE_BYTESWAP_H 1
  4893. #define HAVE_SIGNAL_H 1
  4894. #define HAVE_SETJMP_H 1
  4895. #define HAVE_FENV_H 1
  4896. #define HAVE_SYS_WAIT_H 1
  4897. #define HAVE_CTIME_R 1
  4898. #define HAVE_DRAND48 1
  4899. #define HAVE_FLOCKFILE 1
  4900. #define HAVE_FUNLOCKFILE 1
  4901. #define HAVE_GETLINE 1
  4902. #define HAVE_LINK 1
  4903. #define HAVE_STRNDUP 1
  4904. #define HAVE_SYS_STAT_H 1
  4905. #define HAVE_MKDIR 2
  4906. #define HAVE_FORK 1
  4907. #define HAVE_WAITPID 1
  4908. #define HAVE_RAISE 1
  4909. #define HAVE_VALGRIND 1
  4910. #undef PACKAGE_VERSION
  4911. #undef PACKAGE_STRING
  4912. #undef PACKAGE_NAME
  4913. #undef PACKAGE_TARNAME
  4914. #define PACKAGE_VERSION USE_cairo_version_OR_cairo_version_string_INSTEAD
  4915. #define PACKAGE_STRING USE_cairo_version_OR_cairo_version_string_INSTEAD
  4916. #define PACKAGE_NAME USE_cairo_INSTEAD
  4917. #define PACKAGE_TARNAME USE_cairo_INSTEAD
  4918. #define HAVE_ZLIB 1
  4919. #define HAVE_LZO 1
  4920. #define HAVE_DLFCN_H 1
  4921. #define CAIRO_HAS_DLSYM 1
  4922. #define IPC_RMID_DEFERRED_RELEASE 1
  4923. #define HAVE_X11_EXTENSIONS_XSHM_H 1
  4924. #define HAVE_X11_EXTENSIONS_SHMPROTO_H 1
  4925. #define HAVE_X11_EXTENSIONS_SHMSTR_H 1
  4926. #define HAVE_XRENDERCREATELINEARGRADIENT 1
  4927. #define HAVE_XRENDERCREATERADIALGRADIENT 1
  4928. #define HAVE_XRENDERCREATECONICALGRADIENT 1
  4929. #define HAVE_FT_GET_X11_FONT_FORMAT 1
  4930. #define HAVE_FT_GLYPHSLOT_EMBOLDEN 1
  4931. #define HAVE_FT_GLYPHSLOT_OBLIQUE 1
  4932. #define HAVE_FT_LOAD_SFNT_TABLE 1
  4933. #define HAVE_FT_LIBRARY_SETLCDFILTER 1
  4934. #define HAVE_FCINIT 1
  4935. #define HAVE_FCFINI 1
  4936. #define CAIRO_CAN_TEST_PS_SURFACE 1
  4937. #define CAIRO_HAS_SPECTRE 1
  4938. #define HAVE_POPPLER_PAGE_RENDER 1
  4939. #define CAIRO_CAN_TEST_PDF_SURFACE 1
  4940. #define HAVE_RSVG_PIXBUF_FROM_FILE 1
  4941. #define CAIRO_CAN_TEST_SVG_SURFACE 1
  4942. #define HAS_PIXMAN_GLYPHS 1
  4943. #define CAIRO_HAS_REAL_PTHREAD 1
  4944. #define CAIRO_HAS_PTHREAD 1
  4945. #define CAIRO_HAS_PTHREAD 1
  4946. #define SHARED_LIB_EXT "so"
  4947. #define CAIRO_HAS_TRACE 1
  4948. #define CAIRO_HAS_INTERPRETER 1
  4949.  
  4950. configure: exit 0
RAW Paste Data