Guest User

MT7601 dkms pine64

a guest
Jul 3rd, 2016
329
Never
Not a member of Pastebin yet? Sign Up, it unlocks many cool features!
  1. DKMS make.log for mt7601-3.0.0.4 for kernel 3.10.102-0-pine64-longsleep (arm64)
  2. Sun Jul 3 12:52:32 UTC 2016
  3. make -C tools
  4. make[1]: Entering directory '/var/lib/dkms/mt7601/3.0.0.4/build/tools'
  5. gcc -g bin2h.c -o bin2h
  6. make[1]: Leaving directory '/var/lib/dkms/mt7601/3.0.0.4/build/tools'
  7. /var/lib/dkms/mt7601/3.0.0.4/build/tools/bin2h
  8. cp -f os/linux/Makefile.6 /var/lib/dkms/mt7601/3.0.0.4/build/os/linux/Makefile
  9. make -C /lib/modules/3.10.102-0-pine64-longsleep/build SUBDIRS=/var/lib/dkms/mt7601/3.0.0.4/build/os/linux modules
  10. make[1]: Entering directory '/home/ubuntu/Desktop/sources/linux-pine64'
  11.  
  12. WARNING: Symbol version dump /home/ubuntu/Desktop/sources/linux-pine64/Module.symvers
  13. is missing; modules will have no dependencies and modversions.
  14.  
  15. CC [M] /var/lib/dkms/mt7601/3.0.0.4/build/os/linux/../../os/linux/rt_profile.o
  16. In file included from include/net/netprio_cgroup.h:16:0,
  17. from include/linux/netdevice.h:48,
  18. from /var/lib/dkms/mt7601/3.0.0.4/build/include/os/rt_linux.h:42,
  19. from /var/lib/dkms/mt7601/3.0.0.4/build/include/rtmp_os.h:44,
  20. from /var/lib/dkms/mt7601/3.0.0.4/build/include/rtmp_comm.h:75,
  21. from /var/lib/dkms/mt7601/3.0.0.4/build/include/rt_config.h:33,
  22. from /var/lib/dkms/mt7601/3.0.0.4/build/os/linux/../../os/linux/rt_profile.c:28:
  23. include/linux/cgroup.h:907:18: warning: 'struct cgroup_taskset' declared inside parameter list
  24. struct cgroup_taskset *tset)
  25. ^
  26. include/linux/cgroup.h:907:18: warning: its scope is only this definition or declaration, which is probably not what you want
  27. include/linux/cgroup.h:907:18: warning: 'struct cgroup' declared inside parameter list
  28. CC [M] /var/lib/dkms/mt7601/3.0.0.4/build/os/linux/../../sta/assoc.o
  29. In file included from include/net/netprio_cgroup.h:16:0,
  30. from include/linux/netdevice.h:48,
  31. from /var/lib/dkms/mt7601/3.0.0.4/build/include/os/rt_linux.h:42,
  32. from /var/lib/dkms/mt7601/3.0.0.4/build/include/rtmp_os.h:44,
  33. from /var/lib/dkms/mt7601/3.0.0.4/build/include/rtmp_comm.h:75,
  34. from /var/lib/dkms/mt7601/3.0.0.4/build/include/rt_config.h:33,
  35. from /var/lib/dkms/mt7601/3.0.0.4/build/os/linux/../../sta/assoc.c:28:
  36. include/linux/cgroup.h:907:18: warning: 'struct cgroup_taskset' declared inside parameter list
  37. struct cgroup_taskset *tset)
  38. ^
  39. include/linux/cgroup.h:907:18: warning: its scope is only this definition or declaration, which is probably not what you want
  40. include/linux/cgroup.h:907:18: warning: 'struct cgroup' declared inside parameter list
  41. CC [M] /var/lib/dkms/mt7601/3.0.0.4/build/os/linux/../../sta/auth.o
  42. In file included from include/net/netprio_cgroup.h:16:0,
  43. from include/linux/netdevice.h:48,
  44. from /var/lib/dkms/mt7601/3.0.0.4/build/include/os/rt_linux.h:42,
  45. from /var/lib/dkms/mt7601/3.0.0.4/build/include/rtmp_os.h:44,
  46. from /var/lib/dkms/mt7601/3.0.0.4/build/include/rtmp_comm.h:75,
  47. from /var/lib/dkms/mt7601/3.0.0.4/build/include/rt_config.h:33,
  48. from /var/lib/dkms/mt7601/3.0.0.4/build/os/linux/../../sta/auth.c:28:
  49. include/linux/cgroup.h:907:18: warning: 'struct cgroup_taskset' declared inside parameter list
  50. struct cgroup_taskset *tset)
  51. ^
  52. include/linux/cgroup.h:907:18: warning: its scope is only this definition or declaration, which is probably not what you want
  53. include/linux/cgroup.h:907:18: warning: 'struct cgroup' declared inside parameter list
  54. CC [M] /var/lib/dkms/mt7601/3.0.0.4/build/os/linux/../../sta/auth_rsp.o
  55. In file included from include/net/netprio_cgroup.h:16:0,
  56. from include/linux/netdevice.h:48,
  57. from /var/lib/dkms/mt7601/3.0.0.4/build/include/os/rt_linux.h:42,
  58. from /var/lib/dkms/mt7601/3.0.0.4/build/include/rtmp_os.h:44,
  59. from /var/lib/dkms/mt7601/3.0.0.4/build/include/rtmp_comm.h:75,
  60. from /var/lib/dkms/mt7601/3.0.0.4/build/include/rt_config.h:33,
  61. from /var/lib/dkms/mt7601/3.0.0.4/build/os/linux/../../sta/auth_rsp.c:28:
  62. include/linux/cgroup.h:907:18: warning: 'struct cgroup_taskset' declared inside parameter list
  63. struct cgroup_taskset *tset)
  64. ^
  65. include/linux/cgroup.h:907:18: warning: its scope is only this definition or declaration, which is probably not what you want
  66. include/linux/cgroup.h:907:18: warning: 'struct cgroup' declared inside parameter list
  67. CC [M] /var/lib/dkms/mt7601/3.0.0.4/build/os/linux/../../sta/sync.o
  68. In file included from include/net/netprio_cgroup.h:16:0,
  69. from include/linux/netdevice.h:48,
  70. from /var/lib/dkms/mt7601/3.0.0.4/build/include/os/rt_linux.h:42,
  71. from /var/lib/dkms/mt7601/3.0.0.4/build/include/rtmp_os.h:44,
  72. from /var/lib/dkms/mt7601/3.0.0.4/build/include/rtmp_comm.h:75,
  73. from /var/lib/dkms/mt7601/3.0.0.4/build/include/rt_config.h:33,
  74. from /var/lib/dkms/mt7601/3.0.0.4/build/os/linux/../../sta/sync.c:28:
  75. include/linux/cgroup.h:907:18: warning: 'struct cgroup_taskset' declared inside parameter list
  76. struct cgroup_taskset *tset)
  77. ^
  78. include/linux/cgroup.h:907:18: warning: its scope is only this definition or declaration, which is probably not what you want
  79. include/linux/cgroup.h:907:18: warning: 'struct cgroup' declared inside parameter list
  80. /var/lib/dkms/mt7601/3.0.0.4/build/os/linux/../../sta/sync.c: In function 'PeerBeacon':
  81. /var/lib/dkms/mt7601/3.0.0.4/build/os/linux/../../sta/sync.c:2182:12: warning: passing argument 8 of 'StaAddMacTableEntry' from incompatible pointer type [-Wincompatible-pointer-types]
  82. &ie_list,
  83. ^
  84. In file included from /var/lib/dkms/mt7601/3.0.0.4/build/include/rt_config.h:59:0,
  85. from /var/lib/dkms/mt7601/3.0.0.4/build/os/linux/../../sta/sync.c:28:
  86. /var/lib/dkms/mt7601/3.0.0.4/build/include/rtmp.h:7892:9: note: expected 'IE_LISTS * {aka struct _IE_lists *}' but argument is of type 'BCN_IE_LIST ** {aka struct _bcn_ie_list **}'
  87. BOOLEAN StaAddMacTableEntry(
  88. ^
  89. CC [M] /var/lib/dkms/mt7601/3.0.0.4/build/os/linux/../../sta/sanity.o
  90. In file included from include/net/netprio_cgroup.h:16:0,
  91. from include/linux/netdevice.h:48,
  92. from /var/lib/dkms/mt7601/3.0.0.4/build/include/os/rt_linux.h:42,
  93. from /var/lib/dkms/mt7601/3.0.0.4/build/include/rtmp_os.h:44,
  94. from /var/lib/dkms/mt7601/3.0.0.4/build/include/rtmp_comm.h:75,
  95. from /var/lib/dkms/mt7601/3.0.0.4/build/include/rt_config.h:33,
  96. from /var/lib/dkms/mt7601/3.0.0.4/build/os/linux/../../sta/sanity.c:28:
  97. include/linux/cgroup.h:907:18: warning: 'struct cgroup_taskset' declared inside parameter list
  98. struct cgroup_taskset *tset)
  99. ^
  100. include/linux/cgroup.h:907:18: warning: its scope is only this definition or declaration, which is probably not what you want
  101. include/linux/cgroup.h:907:18: warning: 'struct cgroup' declared inside parameter list
  102. CC [M] /var/lib/dkms/mt7601/3.0.0.4/build/os/linux/../../sta/rtmp_data.o
  103. In file included from include/net/netprio_cgroup.h:16:0,
  104. from include/linux/netdevice.h:48,
  105. from /var/lib/dkms/mt7601/3.0.0.4/build/include/os/rt_linux.h:42,
  106. from /var/lib/dkms/mt7601/3.0.0.4/build/include/rtmp_os.h:44,
  107. from /var/lib/dkms/mt7601/3.0.0.4/build/include/rtmp_comm.h:75,
  108. from /var/lib/dkms/mt7601/3.0.0.4/build/include/rt_config.h:33,
  109. from /var/lib/dkms/mt7601/3.0.0.4/build/os/linux/../../sta/rtmp_data.c:28:
  110. include/linux/cgroup.h:907:18: warning: 'struct cgroup_taskset' declared inside parameter list
  111. struct cgroup_taskset *tset)
  112. ^
  113. include/linux/cgroup.h:907:18: warning: its scope is only this definition or declaration, which is probably not what you want
  114. include/linux/cgroup.h:907:18: warning: 'struct cgroup' declared inside parameter list
  115. /var/lib/dkms/mt7601/3.0.0.4/build/os/linux/../../sta/rtmp_data.c: In function 'STAHandleRxDataFrame':
  116. /var/lib/dkms/mt7601/3.0.0.4/build/os/linux/../../sta/rtmp_data.c:523:33: warning: passing argument 2 of 'MacTableLookup' from incompatible pointer type [-Wincompatible-pointer-types]
  117. pEntry = MacTableLookup(pAd, &pHeader->Addr2);
  118. ^
  119. In file included from /var/lib/dkms/mt7601/3.0.0.4/build/include/rt_config.h:59:0,
  120. from /var/lib/dkms/mt7601/3.0.0.4/build/os/linux/../../sta/rtmp_data.c:28:
  121. /var/lib/dkms/mt7601/3.0.0.4/build/include/rtmp.h:8429:18: note: expected 'UCHAR * {aka unsigned char *}' but argument is of type 'UCHAR (*)[6] {aka unsigned char (*)[6]}'
  122. MAC_TABLE_ENTRY *MacTableLookup(RTMP_ADAPTER *pAd, UCHAR *pAddr);
  123. ^
  124. CC [M] /var/lib/dkms/mt7601/3.0.0.4/build/os/linux/../../sta/connect.o
  125. In file included from include/net/netprio_cgroup.h:16:0,
  126. from include/linux/netdevice.h:48,
  127. from /var/lib/dkms/mt7601/3.0.0.4/build/include/os/rt_linux.h:42,
  128. from /var/lib/dkms/mt7601/3.0.0.4/build/include/rtmp_os.h:44,
  129. from /var/lib/dkms/mt7601/3.0.0.4/build/include/rtmp_comm.h:75,
  130. from /var/lib/dkms/mt7601/3.0.0.4/build/include/rt_config.h:33,
  131. from /var/lib/dkms/mt7601/3.0.0.4/build/os/linux/../../sta/connect.c:28:
  132. include/linux/cgroup.h:907:18: warning: 'struct cgroup_taskset' declared inside parameter list
  133. struct cgroup_taskset *tset)
  134. ^
  135. include/linux/cgroup.h:907:18: warning: its scope is only this definition or declaration, which is probably not what you want
  136. include/linux/cgroup.h:907:18: warning: 'struct cgroup' declared inside parameter list
  137. CC [M] /var/lib/dkms/mt7601/3.0.0.4/build/os/linux/../../sta/wpa.o
  138. In file included from include/net/netprio_cgroup.h:16:0,
  139. from include/linux/netdevice.h:48,
  140. from /var/lib/dkms/mt7601/3.0.0.4/build/include/os/rt_linux.h:42,
  141. from /var/lib/dkms/mt7601/3.0.0.4/build/include/rtmp_os.h:44,
  142. from /var/lib/dkms/mt7601/3.0.0.4/build/include/rtmp_comm.h:75,
  143. from /var/lib/dkms/mt7601/3.0.0.4/build/include/rt_config.h:33,
  144. from /var/lib/dkms/mt7601/3.0.0.4/build/os/linux/../../sta/wpa.c:28:
  145. include/linux/cgroup.h:907:18: warning: 'struct cgroup_taskset' declared inside parameter list
  146. struct cgroup_taskset *tset)
  147. ^
  148. include/linux/cgroup.h:907:18: warning: its scope is only this definition or declaration, which is probably not what you want
  149. include/linux/cgroup.h:907:18: warning: 'struct cgroup' declared inside parameter list
  150. CC [M] /var/lib/dkms/mt7601/3.0.0.4/build/os/linux/../../sta/sta_cfg.o
  151. In file included from include/net/netprio_cgroup.h:16:0,
  152. from include/linux/netdevice.h:48,
  153. from /var/lib/dkms/mt7601/3.0.0.4/build/include/os/rt_linux.h:42,
  154. from /var/lib/dkms/mt7601/3.0.0.4/build/include/rtmp_os.h:44,
  155. from /var/lib/dkms/mt7601/3.0.0.4/build/include/rtmp_comm.h:75,
  156. from /var/lib/dkms/mt7601/3.0.0.4/build/include/rt_config.h:33,
  157. from /var/lib/dkms/mt7601/3.0.0.4/build/os/linux/../../sta/sta_cfg.c:28:
  158. include/linux/cgroup.h:907:18: warning: 'struct cgroup_taskset' declared inside parameter list
  159. struct cgroup_taskset *tset)
  160. ^
  161. include/linux/cgroup.h:907:18: warning: its scope is only this definition or declaration, which is probably not what you want
  162. include/linux/cgroup.h:907:18: warning: 'struct cgroup' declared inside parameter list
  163. /var/lib/dkms/mt7601/3.0.0.4/build/os/linux/../../sta/sta_cfg.c: In function 'RtmpIoctl_rt_ioctl_siwgenie':
  164. /var/lib/dkms/mt7601/3.0.0.4/build/os/linux/../../sta/sta_cfg.c:7618:13: warning: assignment from incompatible pointer type [-Wincompatible-pointer-types]
  165. eid_ptr = pAd->StaCfg.pWpaAssocIe;
  166. ^
  167. CC [M] /var/lib/dkms/mt7601/3.0.0.4/build/os/linux/../../common/crypt_md5.o
  168. In file included from include/net/netprio_cgroup.h:16:0,
  169. from include/linux/netdevice.h:48,
  170. from /var/lib/dkms/mt7601/3.0.0.4/build/include/os/rt_linux.h:42,
  171. from /var/lib/dkms/mt7601/3.0.0.4/build/include/rtmp_os.h:44,
  172. from /var/lib/dkms/mt7601/3.0.0.4/build/include/rtmp_comm.h:75,
  173. from /var/lib/dkms/mt7601/3.0.0.4/build/include/rt_config.h:33,
  174. from /var/lib/dkms/mt7601/3.0.0.4/build/os/linux/../../common/crypt_md5.c:28:
  175. include/linux/cgroup.h:907:18: warning: 'struct cgroup_taskset' declared inside parameter list
  176. struct cgroup_taskset *tset)
  177. ^
  178. include/linux/cgroup.h:907:18: warning: its scope is only this definition or declaration, which is probably not what you want
  179. include/linux/cgroup.h:907:18: warning: 'struct cgroup' declared inside parameter list
  180. CC [M] /var/lib/dkms/mt7601/3.0.0.4/build/os/linux/../../common/crypt_sha2.o
  181. In file included from include/net/netprio_cgroup.h:16:0,
  182. from include/linux/netdevice.h:48,
  183. from /var/lib/dkms/mt7601/3.0.0.4/build/include/os/rt_linux.h:42,
  184. from /var/lib/dkms/mt7601/3.0.0.4/build/include/rtmp_os.h:44,
  185. from /var/lib/dkms/mt7601/3.0.0.4/build/include/rtmp_comm.h:75,
  186. from /var/lib/dkms/mt7601/3.0.0.4/build/include/rt_config.h:33,
  187. from /var/lib/dkms/mt7601/3.0.0.4/build/os/linux/../../common/crypt_sha2.c:28:
  188. include/linux/cgroup.h:907:18: warning: 'struct cgroup_taskset' declared inside parameter list
  189. struct cgroup_taskset *tset)
  190. ^
  191. include/linux/cgroup.h:907:18: warning: its scope is only this definition or declaration, which is probably not what you want
  192. include/linux/cgroup.h:907:18: warning: 'struct cgroup' declared inside parameter list
  193. CC [M] /var/lib/dkms/mt7601/3.0.0.4/build/os/linux/../../common/crypt_hmac.o
  194. In file included from include/net/netprio_cgroup.h:16:0,
  195. from include/linux/netdevice.h:48,
  196. from /var/lib/dkms/mt7601/3.0.0.4/build/include/os/rt_linux.h:42,
  197. from /var/lib/dkms/mt7601/3.0.0.4/build/include/rtmp_os.h:44,
  198. from /var/lib/dkms/mt7601/3.0.0.4/build/include/rtmp_comm.h:75,
  199. from /var/lib/dkms/mt7601/3.0.0.4/build/include/rt_config.h:33,
  200. from /var/lib/dkms/mt7601/3.0.0.4/build/include/crypt_hmac.h:31,
  201. from /var/lib/dkms/mt7601/3.0.0.4/build/os/linux/../../common/crypt_hmac.c:28:
  202. include/linux/cgroup.h:907:18: warning: 'struct cgroup_taskset' declared inside parameter list
  203. struct cgroup_taskset *tset)
  204. ^
  205. include/linux/cgroup.h:907:18: warning: its scope is only this definition or declaration, which is probably not what you want
  206. include/linux/cgroup.h:907:18: warning: 'struct cgroup' declared inside parameter list
  207. CC [M] /var/lib/dkms/mt7601/3.0.0.4/build/os/linux/../../common/crypt_aes.o
  208. In file included from include/net/netprio_cgroup.h:16:0,
  209. from include/linux/netdevice.h:48,
  210. from /var/lib/dkms/mt7601/3.0.0.4/build/include/os/rt_linux.h:42,
  211. from /var/lib/dkms/mt7601/3.0.0.4/build/include/rtmp_os.h:44,
  212. from /var/lib/dkms/mt7601/3.0.0.4/build/include/rtmp_comm.h:75,
  213. from /var/lib/dkms/mt7601/3.0.0.4/build/include/rt_config.h:33,
  214. from /var/lib/dkms/mt7601/3.0.0.4/build/include/crypt_aes.h:31,
  215. from /var/lib/dkms/mt7601/3.0.0.4/build/os/linux/../../common/crypt_aes.c:28:
  216. include/linux/cgroup.h:907:18: warning: 'struct cgroup_taskset' declared inside parameter list
  217. struct cgroup_taskset *tset)
  218. ^
  219. include/linux/cgroup.h:907:18: warning: its scope is only this definition or declaration, which is probably not what you want
  220. include/linux/cgroup.h:907:18: warning: 'struct cgroup' declared inside parameter list
  221. CC [M] /var/lib/dkms/mt7601/3.0.0.4/build/os/linux/../../common/crypt_arc4.o
  222. In file included from include/net/netprio_cgroup.h:16:0,
  223. from include/linux/netdevice.h:48,
  224. from /var/lib/dkms/mt7601/3.0.0.4/build/include/os/rt_linux.h:42,
  225. from /var/lib/dkms/mt7601/3.0.0.4/build/include/rtmp_os.h:44,
  226. from /var/lib/dkms/mt7601/3.0.0.4/build/include/rtmp_comm.h:75,
  227. from /var/lib/dkms/mt7601/3.0.0.4/build/include/rt_config.h:33,
  228. from /var/lib/dkms/mt7601/3.0.0.4/build/include/crypt_arc4.h:31,
  229. from /var/lib/dkms/mt7601/3.0.0.4/build/os/linux/../../common/crypt_arc4.c:28:
  230. include/linux/cgroup.h:907:18: warning: 'struct cgroup_taskset' declared inside parameter list
  231. struct cgroup_taskset *tset)
  232. ^
  233. include/linux/cgroup.h:907:18: warning: its scope is only this definition or declaration, which is probably not what you want
  234. include/linux/cgroup.h:907:18: warning: 'struct cgroup' declared inside parameter list
  235. CC [M] /var/lib/dkms/mt7601/3.0.0.4/build/os/linux/../../common/mlme.o
  236. In file included from include/net/netprio_cgroup.h:16:0,
  237. from include/linux/netdevice.h:48,
  238. from /var/lib/dkms/mt7601/3.0.0.4/build/include/os/rt_linux.h:42,
  239. from /var/lib/dkms/mt7601/3.0.0.4/build/include/rtmp_os.h:44,
  240. from /var/lib/dkms/mt7601/3.0.0.4/build/include/rtmp_comm.h:75,
  241. from /var/lib/dkms/mt7601/3.0.0.4/build/include/rt_config.h:33,
  242. from /var/lib/dkms/mt7601/3.0.0.4/build/os/linux/../../common/mlme.c:28:
  243. include/linux/cgroup.h:907:18: warning: 'struct cgroup_taskset' declared inside parameter list
  244. struct cgroup_taskset *tset)
  245. ^
  246. include/linux/cgroup.h:907:18: warning: its scope is only this definition or declaration, which is probably not what you want
  247. include/linux/cgroup.h:907:18: warning: 'struct cgroup' declared inside parameter list
  248. CC [M] /var/lib/dkms/mt7601/3.0.0.4/build/os/linux/../../common/cmm_wep.o
  249. In file included from include/net/netprio_cgroup.h:16:0,
  250. from include/linux/netdevice.h:48,
  251. from /var/lib/dkms/mt7601/3.0.0.4/build/include/os/rt_linux.h:42,
  252. from /var/lib/dkms/mt7601/3.0.0.4/build/include/rtmp_os.h:44,
  253. from /var/lib/dkms/mt7601/3.0.0.4/build/include/rtmp_comm.h:75,
  254. from /var/lib/dkms/mt7601/3.0.0.4/build/include/rt_config.h:33,
  255. from /var/lib/dkms/mt7601/3.0.0.4/build/os/linux/../../common/cmm_wep.c:28:
  256. include/linux/cgroup.h:907:18: warning: 'struct cgroup_taskset' declared inside parameter list
  257. struct cgroup_taskset *tset)
  258. ^
  259. include/linux/cgroup.h:907:18: warning: its scope is only this definition or declaration, which is probably not what you want
  260. include/linux/cgroup.h:907:18: warning: 'struct cgroup' declared inside parameter list
  261. CC [M] /var/lib/dkms/mt7601/3.0.0.4/build/os/linux/../../common/action.o
  262. In file included from include/net/netprio_cgroup.h:16:0,
  263. from include/linux/netdevice.h:48,
  264. from /var/lib/dkms/mt7601/3.0.0.4/build/include/os/rt_linux.h:42,
  265. from /var/lib/dkms/mt7601/3.0.0.4/build/include/rtmp_os.h:44,
  266. from /var/lib/dkms/mt7601/3.0.0.4/build/include/rtmp_comm.h:75,
  267. from /var/lib/dkms/mt7601/3.0.0.4/build/include/rt_config.h:33,
  268. from /var/lib/dkms/mt7601/3.0.0.4/build/os/linux/../../common/action.c:28:
  269. include/linux/cgroup.h:907:18: warning: 'struct cgroup_taskset' declared inside parameter list
  270. struct cgroup_taskset *tset)
  271. ^
  272. include/linux/cgroup.h:907:18: warning: its scope is only this definition or declaration, which is probably not what you want
  273. include/linux/cgroup.h:907:18: warning: 'struct cgroup' declared inside parameter list
  274. CC [M] /var/lib/dkms/mt7601/3.0.0.4/build/os/linux/../../common/cmm_data.o
  275. In file included from include/net/netprio_cgroup.h:16:0,
  276. from include/linux/netdevice.h:48,
  277. from /var/lib/dkms/mt7601/3.0.0.4/build/include/os/rt_linux.h:42,
  278. from /var/lib/dkms/mt7601/3.0.0.4/build/include/rtmp_os.h:44,
  279. from /var/lib/dkms/mt7601/3.0.0.4/build/include/rtmp_comm.h:75,
  280. from /var/lib/dkms/mt7601/3.0.0.4/build/include/rt_config.h:33,
  281. from /var/lib/dkms/mt7601/3.0.0.4/build/os/linux/../../common/cmm_data.c:28:
  282. include/linux/cgroup.h:907:18: warning: 'struct cgroup_taskset' declared inside parameter list
  283. struct cgroup_taskset *tset)
  284. ^
  285. include/linux/cgroup.h:907:18: warning: its scope is only this definition or declaration, which is probably not what you want
  286. include/linux/cgroup.h:907:18: warning: 'struct cgroup' declared inside parameter list
  287. CC [M] /var/lib/dkms/mt7601/3.0.0.4/build/os/linux/../../common/rtmp_init.o
  288. In file included from include/net/netprio_cgroup.h:16:0,
  289. from include/linux/netdevice.h:48,
  290. from /var/lib/dkms/mt7601/3.0.0.4/build/include/os/rt_linux.h:42,
  291. from /var/lib/dkms/mt7601/3.0.0.4/build/include/rtmp_os.h:44,
  292. from /var/lib/dkms/mt7601/3.0.0.4/build/include/rtmp_comm.h:75,
  293. from /var/lib/dkms/mt7601/3.0.0.4/build/include/rt_config.h:33,
  294. from /var/lib/dkms/mt7601/3.0.0.4/build/os/linux/../../common/rtmp_init.c:28:
  295. include/linux/cgroup.h:907:18: warning: 'struct cgroup_taskset' declared inside parameter list
  296. struct cgroup_taskset *tset)
  297. ^
  298. include/linux/cgroup.h:907:18: warning: its scope is only this definition or declaration, which is probably not what you want
  299. include/linux/cgroup.h:907:18: warning: 'struct cgroup' declared inside parameter list
  300. CC [M] /var/lib/dkms/mt7601/3.0.0.4/build/os/linux/../../common/rtmp_init_inf.o
  301. In file included from include/net/netprio_cgroup.h:16:0,
  302. from include/linux/netdevice.h:48,
  303. from /var/lib/dkms/mt7601/3.0.0.4/build/include/os/rt_linux.h:42,
  304. from /var/lib/dkms/mt7601/3.0.0.4/build/include/rtmp_os.h:44,
  305. from /var/lib/dkms/mt7601/3.0.0.4/build/include/rtmp_comm.h:75,
  306. from /var/lib/dkms/mt7601/3.0.0.4/build/include/rt_config.h:33,
  307. from /var/lib/dkms/mt7601/3.0.0.4/build/os/linux/../../common/rtmp_init_inf.c:28:
  308. include/linux/cgroup.h:907:18: warning: 'struct cgroup_taskset' declared inside parameter list
  309. struct cgroup_taskset *tset)
  310. ^
  311. include/linux/cgroup.h:907:18: warning: its scope is only this definition or declaration, which is probably not what you want
  312. include/linux/cgroup.h:907:18: warning: 'struct cgroup' declared inside parameter list
  313. CC [M] /var/lib/dkms/mt7601/3.0.0.4/build/os/linux/../../common/cmm_tkip.o
  314. In file included from include/net/netprio_cgroup.h:16:0,
  315. from include/linux/netdevice.h:48,
  316. from /var/lib/dkms/mt7601/3.0.0.4/build/include/os/rt_linux.h:42,
  317. from /var/lib/dkms/mt7601/3.0.0.4/build/include/rtmp_os.h:44,
  318. from /var/lib/dkms/mt7601/3.0.0.4/build/include/rtmp_comm.h:75,
  319. from /var/lib/dkms/mt7601/3.0.0.4/build/include/rt_config.h:33,
  320. from /var/lib/dkms/mt7601/3.0.0.4/build/os/linux/../../common/cmm_tkip.c:28:
  321. include/linux/cgroup.h:907:18: warning: 'struct cgroup_taskset' declared inside parameter list
  322. struct cgroup_taskset *tset)
  323. ^
  324. include/linux/cgroup.h:907:18: warning: its scope is only this definition or declaration, which is probably not what you want
  325. include/linux/cgroup.h:907:18: warning: 'struct cgroup' declared inside parameter list
  326. CC [M] /var/lib/dkms/mt7601/3.0.0.4/build/os/linux/../../common/cmm_aes.o
  327. In file included from include/net/netprio_cgroup.h:16:0,
  328. from include/linux/netdevice.h:48,
  329. from /var/lib/dkms/mt7601/3.0.0.4/build/include/os/rt_linux.h:42,
  330. from /var/lib/dkms/mt7601/3.0.0.4/build/include/rtmp_os.h:44,
  331. from /var/lib/dkms/mt7601/3.0.0.4/build/include/rtmp_comm.h:75,
  332. from /var/lib/dkms/mt7601/3.0.0.4/build/include/rt_config.h:33,
  333. from /var/lib/dkms/mt7601/3.0.0.4/build/os/linux/../../common/cmm_aes.c:28:
  334. include/linux/cgroup.h:907:18: warning: 'struct cgroup_taskset' declared inside parameter list
  335. struct cgroup_taskset *tset)
  336. ^
  337. include/linux/cgroup.h:907:18: warning: its scope is only this definition or declaration, which is probably not what you want
  338. include/linux/cgroup.h:907:18: warning: 'struct cgroup' declared inside parameter list
  339. CC [M] /var/lib/dkms/mt7601/3.0.0.4/build/os/linux/../../common/cmm_sync.o
  340. In file included from include/net/netprio_cgroup.h:16:0,
  341. from include/linux/netdevice.h:48,
  342. from /var/lib/dkms/mt7601/3.0.0.4/build/include/os/rt_linux.h:42,
  343. from /var/lib/dkms/mt7601/3.0.0.4/build/include/rtmp_os.h:44,
  344. from /var/lib/dkms/mt7601/3.0.0.4/build/include/rtmp_comm.h:75,
  345. from /var/lib/dkms/mt7601/3.0.0.4/build/include/rt_config.h:33,
  346. from /var/lib/dkms/mt7601/3.0.0.4/build/os/linux/../../common/cmm_sync.c:28:
  347. include/linux/cgroup.h:907:18: warning: 'struct cgroup_taskset' declared inside parameter list
  348. struct cgroup_taskset *tset)
  349. ^
  350. include/linux/cgroup.h:907:18: warning: its scope is only this definition or declaration, which is probably not what you want
  351. include/linux/cgroup.h:907:18: warning: 'struct cgroup' declared inside parameter list
  352. CC [M] /var/lib/dkms/mt7601/3.0.0.4/build/os/linux/../../common/eeprom.o
  353. In file included from include/net/netprio_cgroup.h:16:0,
  354. from include/linux/netdevice.h:48,
  355. from /var/lib/dkms/mt7601/3.0.0.4/build/include/os/rt_linux.h:42,
  356. from /var/lib/dkms/mt7601/3.0.0.4/build/include/rtmp_os.h:44,
  357. from /var/lib/dkms/mt7601/3.0.0.4/build/include/rtmp_comm.h:75,
  358. from /var/lib/dkms/mt7601/3.0.0.4/build/include/rt_config.h:33,
  359. from /var/lib/dkms/mt7601/3.0.0.4/build/os/linux/../../common/eeprom.c:28:
  360. include/linux/cgroup.h:907:18: warning: 'struct cgroup_taskset' declared inside parameter list
  361. struct cgroup_taskset *tset)
  362. ^
  363. include/linux/cgroup.h:907:18: warning: its scope is only this definition or declaration, which is probably not what you want
  364. include/linux/cgroup.h:907:18: warning: 'struct cgroup' declared inside parameter list
  365. CC [M] /var/lib/dkms/mt7601/3.0.0.4/build/os/linux/../../common/cmm_sanity.o
  366. In file included from include/net/netprio_cgroup.h:16:0,
  367. from include/linux/netdevice.h:48,
  368. from /var/lib/dkms/mt7601/3.0.0.4/build/include/os/rt_linux.h:42,
  369. from /var/lib/dkms/mt7601/3.0.0.4/build/include/rtmp_os.h:44,
  370. from /var/lib/dkms/mt7601/3.0.0.4/build/include/rtmp_comm.h:75,
  371. from /var/lib/dkms/mt7601/3.0.0.4/build/include/rt_config.h:33,
  372. from /var/lib/dkms/mt7601/3.0.0.4/build/os/linux/../../common/cmm_sanity.c:28:
  373. include/linux/cgroup.h:907:18: warning: 'struct cgroup_taskset' declared inside parameter list
  374. struct cgroup_taskset *tset)
  375. ^
  376. include/linux/cgroup.h:907:18: warning: its scope is only this definition or declaration, which is probably not what you want
  377. include/linux/cgroup.h:907:18: warning: 'struct cgroup' declared inside parameter list
  378. CC [M] /var/lib/dkms/mt7601/3.0.0.4/build/os/linux/../../common/cmm_info.o
  379. In file included from include/net/netprio_cgroup.h:16:0,
  380. from include/linux/netdevice.h:48,
  381. from /var/lib/dkms/mt7601/3.0.0.4/build/include/os/rt_linux.h:42,
  382. from /var/lib/dkms/mt7601/3.0.0.4/build/include/rtmp_os.h:44,
  383. from /var/lib/dkms/mt7601/3.0.0.4/build/include/rtmp_comm.h:75,
  384. from /var/lib/dkms/mt7601/3.0.0.4/build/include/rt_config.h:33,
  385. from /var/lib/dkms/mt7601/3.0.0.4/build/os/linux/../../common/cmm_info.c:28:
  386. include/linux/cgroup.h:907:18: warning: 'struct cgroup_taskset' declared inside parameter list
  387. struct cgroup_taskset *tset)
  388. ^
  389. include/linux/cgroup.h:907:18: warning: its scope is only this definition or declaration, which is probably not what you want
  390. include/linux/cgroup.h:907:18: warning: 'struct cgroup' declared inside parameter list
  391. /var/lib/dkms/mt7601/3.0.0.4/build/os/linux/../../common/cmm_info.c: In function 'set_rf':
  392. /var/lib/dkms/mt7601/3.0.0.4/build/os/linux/../../common/cmm_info.c:5730:20: warning: format '%x' expects argument of type 'unsigned int *', but argument 5 has type 'UCHAR * {aka unsigned char *}' [-Wformat=]
  393. rv = sscanf(arg, "%d-%d-%x", &(bank_id), &(rf_id), &(rf_val));
  394. ^
  395. CC [M] /var/lib/dkms/mt7601/3.0.0.4/build/os/linux/../../common/cmm_cfg.o
  396. In file included from include/net/netprio_cgroup.h:16:0,
  397. from include/linux/netdevice.h:48,
  398. from /var/lib/dkms/mt7601/3.0.0.4/build/include/os/rt_linux.h:42,
  399. from /var/lib/dkms/mt7601/3.0.0.4/build/include/rtmp_os.h:44,
  400. from /var/lib/dkms/mt7601/3.0.0.4/build/include/rtmp_comm.h:75,
  401. from /var/lib/dkms/mt7601/3.0.0.4/build/include/rt_config.h:33,
  402. from /var/lib/dkms/mt7601/3.0.0.4/build/os/linux/../../common/cmm_cfg.c:28:
  403. include/linux/cgroup.h:907:18: warning: 'struct cgroup_taskset' declared inside parameter list
  404. struct cgroup_taskset *tset)
  405. ^
  406. include/linux/cgroup.h:907:18: warning: its scope is only this definition or declaration, which is probably not what you want
  407. include/linux/cgroup.h:907:18: warning: 'struct cgroup' declared inside parameter list
  408. CC [M] /var/lib/dkms/mt7601/3.0.0.4/build/os/linux/../../common/cmm_wpa.o
  409. In file included from include/net/netprio_cgroup.h:16:0,
  410. from include/linux/netdevice.h:48,
  411. from /var/lib/dkms/mt7601/3.0.0.4/build/include/os/rt_linux.h:42,
  412. from /var/lib/dkms/mt7601/3.0.0.4/build/include/rtmp_os.h:44,
  413. from /var/lib/dkms/mt7601/3.0.0.4/build/include/rtmp_comm.h:75,
  414. from /var/lib/dkms/mt7601/3.0.0.4/build/include/rt_config.h:33,
  415. from /var/lib/dkms/mt7601/3.0.0.4/build/os/linux/../../common/cmm_wpa.c:28:
  416. include/linux/cgroup.h:907:18: warning: 'struct cgroup_taskset' declared inside parameter list
  417. struct cgroup_taskset *tset)
  418. ^
  419. include/linux/cgroup.h:907:18: warning: its scope is only this definition or declaration, which is probably not what you want
  420. include/linux/cgroup.h:907:18: warning: 'struct cgroup' declared inside parameter list
  421. CC [M] /var/lib/dkms/mt7601/3.0.0.4/build/os/linux/../../common/cmm_radar.o
  422. In file included from include/net/netprio_cgroup.h:16:0,
  423. from include/linux/netdevice.h:48,
  424. from /var/lib/dkms/mt7601/3.0.0.4/build/include/os/rt_linux.h:42,
  425. from /var/lib/dkms/mt7601/3.0.0.4/build/include/rtmp_os.h:44,
  426. from /var/lib/dkms/mt7601/3.0.0.4/build/include/rtmp_comm.h:75,
  427. from /var/lib/dkms/mt7601/3.0.0.4/build/include/rt_config.h:33,
  428. from /var/lib/dkms/mt7601/3.0.0.4/build/os/linux/../../common/cmm_radar.c:28:
  429. include/linux/cgroup.h:907:18: warning: 'struct cgroup_taskset' declared inside parameter list
  430. struct cgroup_taskset *tset)
  431. ^
  432. include/linux/cgroup.h:907:18: warning: its scope is only this definition or declaration, which is probably not what you want
  433. include/linux/cgroup.h:907:18: warning: 'struct cgroup' declared inside parameter list
  434. CC [M] /var/lib/dkms/mt7601/3.0.0.4/build/os/linux/../../common/spectrum.o
  435. In file included from include/net/netprio_cgroup.h:16:0,
  436. from include/linux/netdevice.h:48,
  437. from /var/lib/dkms/mt7601/3.0.0.4/build/include/os/rt_linux.h:42,
  438. from /var/lib/dkms/mt7601/3.0.0.4/build/include/rtmp_os.h:44,
  439. from /var/lib/dkms/mt7601/3.0.0.4/build/include/rtmp_comm.h:75,
  440. from /var/lib/dkms/mt7601/3.0.0.4/build/include/rt_config.h:33,
  441. from /var/lib/dkms/mt7601/3.0.0.4/build/os/linux/../../common/spectrum.c:28:
  442. include/linux/cgroup.h:907:18: warning: 'struct cgroup_taskset' declared inside parameter list
  443. struct cgroup_taskset *tset)
  444. ^
  445. include/linux/cgroup.h:907:18: warning: its scope is only this definition or declaration, which is probably not what you want
  446. include/linux/cgroup.h:907:18: warning: 'struct cgroup' declared inside parameter list
  447. CC [M] /var/lib/dkms/mt7601/3.0.0.4/build/os/linux/../../common/rtmp_timer.o
  448. In file included from include/net/netprio_cgroup.h:16:0,
  449. from include/linux/netdevice.h:48,
  450. from /var/lib/dkms/mt7601/3.0.0.4/build/include/os/rt_linux.h:42,
  451. from /var/lib/dkms/mt7601/3.0.0.4/build/include/rtmp_os.h:44,
  452. from /var/lib/dkms/mt7601/3.0.0.4/build/include/rtmp_comm.h:75,
  453. from /var/lib/dkms/mt7601/3.0.0.4/build/include/rt_config.h:33,
  454. from /var/lib/dkms/mt7601/3.0.0.4/build/os/linux/../../common/rtmp_timer.c:28:
  455. include/linux/cgroup.h:907:18: warning: 'struct cgroup_taskset' declared inside parameter list
  456. struct cgroup_taskset *tset)
  457. ^
  458. include/linux/cgroup.h:907:18: warning: its scope is only this definition or declaration, which is probably not what you want
  459. include/linux/cgroup.h:907:18: warning: 'struct cgroup' declared inside parameter list
  460. CC [M] /var/lib/dkms/mt7601/3.0.0.4/build/os/linux/../../common/rt_channel.o
  461. In file included from include/net/netprio_cgroup.h:16:0,
  462. from include/linux/netdevice.h:48,
  463. from /var/lib/dkms/mt7601/3.0.0.4/build/include/os/rt_linux.h:42,
  464. from /var/lib/dkms/mt7601/3.0.0.4/build/include/rtmp_os.h:44,
  465. from /var/lib/dkms/mt7601/3.0.0.4/build/include/rtmp_comm.h:75,
  466. from /var/lib/dkms/mt7601/3.0.0.4/build/include/rt_config.h:33,
  467. from /var/lib/dkms/mt7601/3.0.0.4/build/os/linux/../../common/rt_channel.c:28:
  468. include/linux/cgroup.h:907:18: warning: 'struct cgroup_taskset' declared inside parameter list
  469. struct cgroup_taskset *tset)
  470. ^
  471. include/linux/cgroup.h:907:18: warning: its scope is only this definition or declaration, which is probably not what you want
  472. include/linux/cgroup.h:907:18: warning: 'struct cgroup' declared inside parameter list
  473. CC [M] /var/lib/dkms/mt7601/3.0.0.4/build/os/linux/../../common/cmm_profile.o
  474. In file included from include/net/netprio_cgroup.h:16:0,
  475. from include/linux/netdevice.h:48,
  476. from /var/lib/dkms/mt7601/3.0.0.4/build/include/os/rt_linux.h:42,
  477. from /var/lib/dkms/mt7601/3.0.0.4/build/include/rtmp_os.h:44,
  478. from /var/lib/dkms/mt7601/3.0.0.4/build/include/rtmp_comm.h:75,
  479. from /var/lib/dkms/mt7601/3.0.0.4/build/include/rt_config.h:33,
  480. from /var/lib/dkms/mt7601/3.0.0.4/build/os/linux/../../common/cmm_profile.c:28:
  481. include/linux/cgroup.h:907:18: warning: 'struct cgroup_taskset' declared inside parameter list
  482. struct cgroup_taskset *tset)
  483. ^
  484. include/linux/cgroup.h:907:18: warning: its scope is only this definition or declaration, which is probably not what you want
  485. include/linux/cgroup.h:907:18: warning: 'struct cgroup' declared inside parameter list
  486. CC [M] /var/lib/dkms/mt7601/3.0.0.4/build/os/linux/../../common/cmm_asic.o
  487. In file included from include/net/netprio_cgroup.h:16:0,
  488. from include/linux/netdevice.h:48,
  489. from /var/lib/dkms/mt7601/3.0.0.4/build/include/os/rt_linux.h:42,
  490. from /var/lib/dkms/mt7601/3.0.0.4/build/include/rtmp_os.h:44,
  491. from /var/lib/dkms/mt7601/3.0.0.4/build/include/rtmp_comm.h:75,
  492. from /var/lib/dkms/mt7601/3.0.0.4/build/include/rt_config.h:33,
  493. from /var/lib/dkms/mt7601/3.0.0.4/build/os/linux/../../common/cmm_asic.c:28:
  494. include/linux/cgroup.h:907:18: warning: 'struct cgroup_taskset' declared inside parameter list
  495. struct cgroup_taskset *tset)
  496. ^
  497. include/linux/cgroup.h:907:18: warning: its scope is only this definition or declaration, which is probably not what you want
  498. include/linux/cgroup.h:907:18: warning: 'struct cgroup' declared inside parameter list
  499. CC [M] /var/lib/dkms/mt7601/3.0.0.4/build/os/linux/../../common/scan.o
  500. In file included from include/net/netprio_cgroup.h:16:0,
  501. from include/linux/netdevice.h:48,
  502. from /var/lib/dkms/mt7601/3.0.0.4/build/include/os/rt_linux.h:42,
  503. from /var/lib/dkms/mt7601/3.0.0.4/build/include/rtmp_os.h:44,
  504. from /var/lib/dkms/mt7601/3.0.0.4/build/include/rtmp_comm.h:75,
  505. from /var/lib/dkms/mt7601/3.0.0.4/build/include/rt_config.h:33,
  506. from /var/lib/dkms/mt7601/3.0.0.4/build/os/linux/../../common/scan.c:28:
  507. include/linux/cgroup.h:907:18: warning: 'struct cgroup_taskset' declared inside parameter list
  508. struct cgroup_taskset *tset)
  509. ^
  510. include/linux/cgroup.h:907:18: warning: its scope is only this definition or declaration, which is probably not what you want
  511. include/linux/cgroup.h:907:18: warning: 'struct cgroup' declared inside parameter list
  512. CC [M] /var/lib/dkms/mt7601/3.0.0.4/build/os/linux/../../common/cmm_cmd.o
  513. In file included from include/net/netprio_cgroup.h:16:0,
  514. from include/linux/netdevice.h:48,
  515. from /var/lib/dkms/mt7601/3.0.0.4/build/include/os/rt_linux.h:42,
  516. from /var/lib/dkms/mt7601/3.0.0.4/build/include/rtmp_os.h:44,
  517. from /var/lib/dkms/mt7601/3.0.0.4/build/include/rtmp_comm.h:75,
  518. from /var/lib/dkms/mt7601/3.0.0.4/build/include/rt_config.h:33,
  519. from /var/lib/dkms/mt7601/3.0.0.4/build/os/linux/../../common/cmm_cmd.c:28:
  520. include/linux/cgroup.h:907:18: warning: 'struct cgroup_taskset' declared inside parameter list
  521. struct cgroup_taskset *tset)
  522. ^
  523. include/linux/cgroup.h:907:18: warning: its scope is only this definition or declaration, which is probably not what you want
  524. include/linux/cgroup.h:907:18: warning: 'struct cgroup' declared inside parameter list
  525. CC [M] /var/lib/dkms/mt7601/3.0.0.4/build/os/linux/../../common/uapsd.o
  526. In file included from include/net/netprio_cgroup.h:16:0,
  527. from include/linux/netdevice.h:48,
  528. from /var/lib/dkms/mt7601/3.0.0.4/build/include/os/rt_linux.h:42,
  529. from /var/lib/dkms/mt7601/3.0.0.4/build/include/rtmp_os.h:44,
  530. from /var/lib/dkms/mt7601/3.0.0.4/build/include/rtmp_comm.h:75,
  531. from /var/lib/dkms/mt7601/3.0.0.4/build/include/rt_config.h:33,
  532. from /var/lib/dkms/mt7601/3.0.0.4/build/os/linux/../../common/uapsd.c:29:
  533. include/linux/cgroup.h:907:18: warning: 'struct cgroup_taskset' declared inside parameter list
  534. struct cgroup_taskset *tset)
  535. ^
  536. include/linux/cgroup.h:907:18: warning: its scope is only this definition or declaration, which is probably not what you want
  537. include/linux/cgroup.h:907:18: warning: 'struct cgroup' declared inside parameter list
  538. CC [M] /var/lib/dkms/mt7601/3.0.0.4/build/os/linux/../../common/ps.o
  539. In file included from include/net/netprio_cgroup.h:16:0,
  540. from include/linux/netdevice.h:48,
  541. from /var/lib/dkms/mt7601/3.0.0.4/build/include/os/rt_linux.h:42,
  542. from /var/lib/dkms/mt7601/3.0.0.4/build/include/rtmp_os.h:44,
  543. from /var/lib/dkms/mt7601/3.0.0.4/build/include/rtmp_comm.h:75,
  544. from /var/lib/dkms/mt7601/3.0.0.4/build/include/rt_config.h:33,
  545. from /var/lib/dkms/mt7601/3.0.0.4/build/os/linux/../../common/ps.c:28:
  546. include/linux/cgroup.h:907:18: warning: 'struct cgroup_taskset' declared inside parameter list
  547. struct cgroup_taskset *tset)
  548. ^
  549. include/linux/cgroup.h:907:18: warning: its scope is only this definition or declaration, which is probably not what you want
  550. include/linux/cgroup.h:907:18: warning: 'struct cgroup' declared inside parameter list
  551. CC [M] /var/lib/dkms/mt7601/3.0.0.4/build/os/linux/../../rate_ctrl/ra_ctrl.o
  552. In file included from include/net/netprio_cgroup.h:16:0,
  553. from include/linux/netdevice.h:48,
  554. from /var/lib/dkms/mt7601/3.0.0.4/build/include/os/rt_linux.h:42,
  555. from /var/lib/dkms/mt7601/3.0.0.4/build/include/rtmp_os.h:44,
  556. from /var/lib/dkms/mt7601/3.0.0.4/build/include/rtmp_comm.h:75,
  557. from /var/lib/dkms/mt7601/3.0.0.4/build/include/rt_config.h:33,
  558. from /var/lib/dkms/mt7601/3.0.0.4/build/os/linux/../../rate_ctrl/ra_ctrl.c:28:
  559. include/linux/cgroup.h:907:18: warning: 'struct cgroup_taskset' declared inside parameter list
  560. struct cgroup_taskset *tset)
  561. ^
  562. include/linux/cgroup.h:907:18: warning: its scope is only this definition or declaration, which is probably not what you want
  563. include/linux/cgroup.h:907:18: warning: 'struct cgroup' declared inside parameter list
  564. CC [M] /var/lib/dkms/mt7601/3.0.0.4/build/os/linux/../../rate_ctrl/alg_legacy.o
  565. In file included from include/net/netprio_cgroup.h:16:0,
  566. from include/linux/netdevice.h:48,
  567. from /var/lib/dkms/mt7601/3.0.0.4/build/include/os/rt_linux.h:42,
  568. from /var/lib/dkms/mt7601/3.0.0.4/build/include/rtmp_os.h:44,
  569. from /var/lib/dkms/mt7601/3.0.0.4/build/include/rtmp_comm.h:75,
  570. from /var/lib/dkms/mt7601/3.0.0.4/build/include/rt_config.h:33,
  571. from /var/lib/dkms/mt7601/3.0.0.4/build/os/linux/../../rate_ctrl/alg_legacy.c:28:
  572. include/linux/cgroup.h:907:18: warning: 'struct cgroup_taskset' declared inside parameter list
  573. struct cgroup_taskset *tset)
  574. ^
  575. include/linux/cgroup.h:907:18: warning: its scope is only this definition or declaration, which is probably not what you want
  576. include/linux/cgroup.h:907:18: warning: 'struct cgroup' declared inside parameter list
  577. CC [M] /var/lib/dkms/mt7601/3.0.0.4/build/os/linux/../../rate_ctrl/alg_ags.o
  578. CC [M] /var/lib/dkms/mt7601/3.0.0.4/build/os/linux/../../chips/rtmp_chip.o
  579. In file included from include/net/netprio_cgroup.h:16:0,
  580. from include/linux/netdevice.h:48,
  581. from /var/lib/dkms/mt7601/3.0.0.4/build/include/os/rt_linux.h:42,
  582. from /var/lib/dkms/mt7601/3.0.0.4/build/include/rtmp_os.h:44,
  583. from /var/lib/dkms/mt7601/3.0.0.4/build/include/rtmp_comm.h:75,
  584. from /var/lib/dkms/mt7601/3.0.0.4/build/include/rt_config.h:33,
  585. from /var/lib/dkms/mt7601/3.0.0.4/build/os/linux/../../chips/rtmp_chip.c:28:
  586. include/linux/cgroup.h:907:18: warning: 'struct cgroup_taskset' declared inside parameter list
  587. struct cgroup_taskset *tset)
  588. ^
  589. include/linux/cgroup.h:907:18: warning: its scope is only this definition or declaration, which is probably not what you want
  590. include/linux/cgroup.h:907:18: warning: 'struct cgroup' declared inside parameter list
  591. CC [M] /var/lib/dkms/mt7601/3.0.0.4/build/os/linux/../../common/txpower.o
  592. In file included from include/net/netprio_cgroup.h:16:0,
  593. from include/linux/netdevice.h:48,
  594. from /var/lib/dkms/mt7601/3.0.0.4/build/include/os/rt_linux.h:42,
  595. from /var/lib/dkms/mt7601/3.0.0.4/build/include/rtmp_os.h:44,
  596. from /var/lib/dkms/mt7601/3.0.0.4/build/include/rtmp_comm.h:75,
  597. from /var/lib/dkms/mt7601/3.0.0.4/build/include/rt_config.h:33,
  598. from /var/lib/dkms/mt7601/3.0.0.4/build/os/linux/../../common/txpower.c:28:
  599. include/linux/cgroup.h:907:18: warning: 'struct cgroup_taskset' declared inside parameter list
  600. struct cgroup_taskset *tset)
  601. ^
  602. include/linux/cgroup.h:907:18: warning: its scope is only this definition or declaration, which is probably not what you want
  603. include/linux/cgroup.h:907:18: warning: 'struct cgroup' declared inside parameter list
  604. CC [M] /var/lib/dkms/mt7601/3.0.0.4/build/os/linux/../../mac/rtmp_mac.o
  605. In file included from include/net/netprio_cgroup.h:16:0,
  606. from include/linux/netdevice.h:48,
  607. from /var/lib/dkms/mt7601/3.0.0.4/build/include/os/rt_linux.h:42,
  608. from /var/lib/dkms/mt7601/3.0.0.4/build/include/rtmp_os.h:44,
  609. from /var/lib/dkms/mt7601/3.0.0.4/build/include/rtmp_comm.h:75,
  610. from /var/lib/dkms/mt7601/3.0.0.4/build/include/rt_config.h:33,
  611. from /var/lib/dkms/mt7601/3.0.0.4/build/os/linux/../../mac/rtmp_mac.c:28:
  612. include/linux/cgroup.h:907:18: warning: 'struct cgroup_taskset' declared inside parameter list
  613. struct cgroup_taskset *tset)
  614. ^
  615. include/linux/cgroup.h:907:18: warning: its scope is only this definition or declaration, which is probably not what you want
  616. include/linux/cgroup.h:907:18: warning: 'struct cgroup' declared inside parameter list
  617. CC [M] /var/lib/dkms/mt7601/3.0.0.4/build/os/linux/../../mgmt/mgmt_hw.o
  618. In file included from include/net/netprio_cgroup.h:16:0,
  619. from include/linux/netdevice.h:48,
  620. from /var/lib/dkms/mt7601/3.0.0.4/build/include/os/rt_linux.h:42,
  621. from /var/lib/dkms/mt7601/3.0.0.4/build/include/rtmp_os.h:44,
  622. from /var/lib/dkms/mt7601/3.0.0.4/build/include/rtmp_comm.h:75,
  623. from /var/lib/dkms/mt7601/3.0.0.4/build/include/rt_config.h:33,
  624. from /var/lib/dkms/mt7601/3.0.0.4/build/os/linux/../../mgmt/mgmt_hw.c:28:
  625. include/linux/cgroup.h:907:18: warning: 'struct cgroup_taskset' declared inside parameter list
  626. struct cgroup_taskset *tset)
  627. ^
  628. include/linux/cgroup.h:907:18: warning: its scope is only this definition or declaration, which is probably not what you want
  629. include/linux/cgroup.h:907:18: warning: 'struct cgroup' declared inside parameter list
  630. CC [M] /var/lib/dkms/mt7601/3.0.0.4/build/os/linux/../../mgmt/mgmt_entrytb.o
  631. In file included from include/net/netprio_cgroup.h:16:0,
  632. from include/linux/netdevice.h:48,
  633. from /var/lib/dkms/mt7601/3.0.0.4/build/include/os/rt_linux.h:42,
  634. from /var/lib/dkms/mt7601/3.0.0.4/build/include/rtmp_os.h:44,
  635. from /var/lib/dkms/mt7601/3.0.0.4/build/include/rtmp_comm.h:75,
  636. from /var/lib/dkms/mt7601/3.0.0.4/build/include/rt_config.h:33,
  637. from /var/lib/dkms/mt7601/3.0.0.4/build/os/linux/../../mgmt/mgmt_entrytb.c:28:
  638. include/linux/cgroup.h:907:18: warning: 'struct cgroup_taskset' declared inside parameter list
  639. struct cgroup_taskset *tset)
  640. ^
  641. include/linux/cgroup.h:907:18: warning: its scope is only this definition or declaration, which is probably not what you want
  642. include/linux/cgroup.h:907:18: warning: 'struct cgroup' declared inside parameter list
  643. CC [M] /var/lib/dkms/mt7601/3.0.0.4/build/os/linux/../../phy/rtmp_phy.o
  644. In file included from include/net/netprio_cgroup.h:16:0,
  645. from include/linux/netdevice.h:48,
  646. from /var/lib/dkms/mt7601/3.0.0.4/build/include/os/rt_linux.h:42,
  647. from /var/lib/dkms/mt7601/3.0.0.4/build/include/rtmp_os.h:44,
  648. from /var/lib/dkms/mt7601/3.0.0.4/build/include/rtmp_comm.h:75,
  649. from /var/lib/dkms/mt7601/3.0.0.4/build/include/rt_config.h:33,
  650. from /var/lib/dkms/mt7601/3.0.0.4/build/os/linux/../../phy/rtmp_phy.c:28:
  651. include/linux/cgroup.h:907:18: warning: 'struct cgroup_taskset' declared inside parameter list
  652. struct cgroup_taskset *tset)
  653. ^
  654. include/linux/cgroup.h:907:18: warning: its scope is only this definition or declaration, which is probably not what you want
  655. include/linux/cgroup.h:907:18: warning: 'struct cgroup' declared inside parameter list
  656. CC [M] /var/lib/dkms/mt7601/3.0.0.4/build/os/linux/../../phy/rlt_phy.o
  657. In file included from include/net/netprio_cgroup.h:16:0,
  658. from include/linux/netdevice.h:48,
  659. from /var/lib/dkms/mt7601/3.0.0.4/build/include/os/rt_linux.h:42,
  660. from /var/lib/dkms/mt7601/3.0.0.4/build/include/rtmp_os.h:44,
  661. from /var/lib/dkms/mt7601/3.0.0.4/build/include/rtmp_comm.h:75,
  662. from /var/lib/dkms/mt7601/3.0.0.4/build/include/rt_config.h:33,
  663. from /var/lib/dkms/mt7601/3.0.0.4/build/os/linux/../../phy/rlt_phy.c:28:
  664. include/linux/cgroup.h:907:18: warning: 'struct cgroup_taskset' declared inside parameter list
  665. struct cgroup_taskset *tset)
  666. ^
  667. include/linux/cgroup.h:907:18: warning: its scope is only this definition or declaration, which is probably not what you want
  668. include/linux/cgroup.h:907:18: warning: 'struct cgroup' declared inside parameter list
  669. CC [M] /var/lib/dkms/mt7601/3.0.0.4/build/os/linux/../../phy/rlt_rf.o
  670. In file included from include/net/netprio_cgroup.h:16:0,
  671. from include/linux/netdevice.h:48,
  672. from /var/lib/dkms/mt7601/3.0.0.4/build/include/os/rt_linux.h:42,
  673. from /var/lib/dkms/mt7601/3.0.0.4/build/include/rtmp_os.h:44,
  674. from /var/lib/dkms/mt7601/3.0.0.4/build/include/rtmp_comm.h:75,
  675. from /var/lib/dkms/mt7601/3.0.0.4/build/include/rt_config.h:33,
  676. from /var/lib/dkms/mt7601/3.0.0.4/build/os/linux/../../phy/rlt_rf.c:30:
  677. include/linux/cgroup.h:907:18: warning: 'struct cgroup_taskset' declared inside parameter list
  678. struct cgroup_taskset *tset)
  679. ^
  680. include/linux/cgroup.h:907:18: warning: its scope is only this definition or declaration, which is probably not what you want
  681. include/linux/cgroup.h:907:18: warning: 'struct cgroup' declared inside parameter list
  682. CC [M] /var/lib/dkms/mt7601/3.0.0.4/build/os/linux/../../common/ba_action.o
  683. In file included from include/net/netprio_cgroup.h:16:0,
  684. from include/linux/netdevice.h:48,
  685. from /var/lib/dkms/mt7601/3.0.0.4/build/include/os/rt_linux.h:42,
  686. from /var/lib/dkms/mt7601/3.0.0.4/build/include/rtmp_os.h:44,
  687. from /var/lib/dkms/mt7601/3.0.0.4/build/include/rtmp_comm.h:75,
  688. from /var/lib/dkms/mt7601/3.0.0.4/build/include/rt_config.h:33,
  689. from /var/lib/dkms/mt7601/3.0.0.4/build/os/linux/../../common/ba_action.c:30:
  690. include/linux/cgroup.h:907:18: warning: 'struct cgroup_taskset' declared inside parameter list
  691. struct cgroup_taskset *tset)
  692. ^
  693. include/linux/cgroup.h:907:18: warning: its scope is only this definition or declaration, which is probably not what you want
  694. include/linux/cgroup.h:907:18: warning: 'struct cgroup' declared inside parameter list
  695. CC [M] /var/lib/dkms/mt7601/3.0.0.4/build/os/linux/../../mgmt/mgmt_ht.o
  696. In file included from include/net/netprio_cgroup.h:16:0,
  697. from include/linux/netdevice.h:48,
  698. from /var/lib/dkms/mt7601/3.0.0.4/build/include/os/rt_linux.h:42,
  699. from /var/lib/dkms/mt7601/3.0.0.4/build/include/rtmp_os.h:44,
  700. from /var/lib/dkms/mt7601/3.0.0.4/build/include/rtmp_comm.h:75,
  701. from /var/lib/dkms/mt7601/3.0.0.4/build/include/rt_config.h:33,
  702. from /var/lib/dkms/mt7601/3.0.0.4/build/os/linux/../../mgmt/mgmt_ht.c:28:
  703. include/linux/cgroup.h:907:18: warning: 'struct cgroup_taskset' declared inside parameter list
  704. struct cgroup_taskset *tset)
  705. ^
  706. include/linux/cgroup.h:907:18: warning: its scope is only this definition or declaration, which is probably not what you want
  707. include/linux/cgroup.h:907:18: warning: 'struct cgroup' declared inside parameter list
  708. CC [M] /var/lib/dkms/mt7601/3.0.0.4/build/os/linux/../../common/rt_os_util.o
  709. In file included from include/net/netprio_cgroup.h:16:0,
  710. from include/linux/netdevice.h:48,
  711. from /var/lib/dkms/mt7601/3.0.0.4/build/include/os/rt_linux.h:42,
  712. from /var/lib/dkms/mt7601/3.0.0.4/build/include/rtmp_os.h:44,
  713. from /var/lib/dkms/mt7601/3.0.0.4/build/include/rtmp_comm.h:75,
  714. from /var/lib/dkms/mt7601/3.0.0.4/build/os/linux/../../common/rt_os_util.c:33:
  715. include/linux/cgroup.h:907:18: warning: 'struct cgroup_taskset' declared inside parameter list
  716. struct cgroup_taskset *tset)
  717. ^
  718. include/linux/cgroup.h:907:18: warning: its scope is only this definition or declaration, which is probably not what you want
  719. include/linux/cgroup.h:907:18: warning: 'struct cgroup' declared inside parameter list
  720. CC [M] /var/lib/dkms/mt7601/3.0.0.4/build/os/linux/../../os/linux/sta_ioctl.o
  721. In file included from include/net/netprio_cgroup.h:16:0,
  722. from include/linux/netdevice.h:48,
  723. from /var/lib/dkms/mt7601/3.0.0.4/build/include/os/rt_linux.h:42,
  724. from /var/lib/dkms/mt7601/3.0.0.4/build/include/rtmp_os.h:44,
  725. from /var/lib/dkms/mt7601/3.0.0.4/build/include/rtmp_comm.h:75,
  726. from /var/lib/dkms/mt7601/3.0.0.4/build/os/linux/../../os/linux/sta_ioctl.c:30:
  727. include/linux/cgroup.h:907:18: warning: 'struct cgroup_taskset' declared inside parameter list
  728. struct cgroup_taskset *tset)
  729. ^
  730. include/linux/cgroup.h:907:18: warning: its scope is only this definition or declaration, which is probably not what you want
  731. include/linux/cgroup.h:907:18: warning: 'struct cgroup' declared inside parameter list
  732. /var/lib/dkms/mt7601/3.0.0.4/build/os/linux/../../os/linux/sta_ioctl.c:2380:2: error: unknown field 'private' specified in initializer
  733. .private = (iw_handler *) rt_priv_handlers,
  734. ^
  735. /var/lib/dkms/mt7601/3.0.0.4/build/os/linux/../../os/linux/sta_ioctl.c:2380:13: warning: initialization from incompatible pointer type [-Wincompatible-pointer-types]
  736. .private = (iw_handler *) rt_priv_handlers,
  737. ^
  738. /var/lib/dkms/mt7601/3.0.0.4/build/os/linux/../../os/linux/sta_ioctl.c:2380:13: note: (near initialization for 'rt28xx_iw_handler_def.get_wireless_stats')
  739. /var/lib/dkms/mt7601/3.0.0.4/build/os/linux/../../os/linux/sta_ioctl.c:2381:2: error: unknown field 'num_private' specified in initializer
  740. .num_private = N(rt_priv_handlers),
  741. ^
  742. /var/lib/dkms/mt7601/3.0.0.4/build/os/linux/../../os/linux/sta_ioctl.c:2377:14: warning: excess elements in struct initializer
  743. #define N(a) (sizeof (a) / sizeof (a[0]))
  744. ^
  745. /var/lib/dkms/mt7601/3.0.0.4/build/os/linux/../../os/linux/sta_ioctl.c:2381:18: note: in expansion of macro 'N'
  746. .num_private = N(rt_priv_handlers),
  747. ^
  748. /var/lib/dkms/mt7601/3.0.0.4/build/os/linux/../../os/linux/sta_ioctl.c:2377:14: note: (near initialization for 'rt28xx_iw_handler_def')
  749. #define N(a) (sizeof (a) / sizeof (a[0]))
  750. ^
  751. /var/lib/dkms/mt7601/3.0.0.4/build/os/linux/../../os/linux/sta_ioctl.c:2381:18: note: in expansion of macro 'N'
  752. .num_private = N(rt_priv_handlers),
  753. ^
  754. /var/lib/dkms/mt7601/3.0.0.4/build/os/linux/../../os/linux/sta_ioctl.c:2382:2: error: unknown field 'private_args' specified in initializer
  755. .private_args = (struct iw_priv_args *) privtab,
  756. ^
  757. /var/lib/dkms/mt7601/3.0.0.4/build/os/linux/../../os/linux/sta_ioctl.c:2382:18: warning: excess elements in struct initializer
  758. .private_args = (struct iw_priv_args *) privtab,
  759. ^
  760. /var/lib/dkms/mt7601/3.0.0.4/build/os/linux/../../os/linux/sta_ioctl.c:2382:18: note: (near initialization for 'rt28xx_iw_handler_def')
  761. /var/lib/dkms/mt7601/3.0.0.4/build/os/linux/../../os/linux/sta_ioctl.c:2383:2: error: unknown field 'num_private_args' specified in initializer
  762. .num_private_args = N(privtab),
  763. ^
  764. /var/lib/dkms/mt7601/3.0.0.4/build/os/linux/../../os/linux/sta_ioctl.c:2377:14: warning: excess elements in struct initializer
  765. #define N(a) (sizeof (a) / sizeof (a[0]))
  766. ^
  767. /var/lib/dkms/mt7601/3.0.0.4/build/os/linux/../../os/linux/sta_ioctl.c:2383:22: note: in expansion of macro 'N'
  768. .num_private_args = N(privtab),
  769. ^
  770. /var/lib/dkms/mt7601/3.0.0.4/build/os/linux/../../os/linux/sta_ioctl.c:2377:14: note: (near initialization for 'rt28xx_iw_handler_def')
  771. #define N(a) (sizeof (a) / sizeof (a[0]))
  772. ^
  773. /var/lib/dkms/mt7601/3.0.0.4/build/os/linux/../../os/linux/sta_ioctl.c:2383:22: note: in expansion of macro 'N'
  774. .num_private_args = N(privtab),
  775. ^
  776. scripts/Makefile.build:308: recipe for target '/var/lib/dkms/mt7601/3.0.0.4/build/os/linux/../../os/linux/sta_ioctl.o' failed
  777. make[2]: *** [/var/lib/dkms/mt7601/3.0.0.4/build/os/linux/../../os/linux/sta_ioctl.o] Error 1
  778. Makefile:1228: recipe for target '_module_/var/lib/dkms/mt7601/3.0.0.4/build/os/linux' failed
  779. make[1]: *** [_module_/var/lib/dkms/mt7601/3.0.0.4/build/os/linux] Error 2
  780. make[1]: Leaving directory '/home/ubuntu/Desktop/sources/linux-pine64'
  781. Makefile:394: recipe for target 'LINUX' failed
  782. make: *** [LINUX] Error 2
RAW Paste Data