SHARE
TWEET

Untitled

a guest Aug 12th, 2017 46 Never
Not a member of Pastebin yet? Sign Up, it unlocks many cool features!
  1. cd util && make && cd ..
  2. make[1]: Entering directory `/home/ngg/ch24/c2411/final/trunk/problems/Common/libporty/src/libporty/util'
  3. make[1]: Nothing to be done for `all'.
  4. make[1]: Leaving directory `/home/ngg/ch24/c2411/final/trunk/problems/Common/libporty/src/libporty/util'
  5. cd host && make && cd ..
  6. make[1]: Entering directory `/home/ngg/ch24/c2411/final/trunk/problems/Common/libporty/src/libporty/host'
  7. gcc -I../.. -Wall -g -ansi -pedantic -I../..   -c -o pointers.o pointers.c
  8. pointers.c:7:17: error: expected ‘=’, ‘,’, ‘;’, ‘asm’ or ‘__attribute__’ before ‘void’
  9. pointers.c: In function ‘P_ptr_print’:
  10. pointers.c:32:3: warning: implicit declaration of function ‘c2hex’
  11. pointers.c: At top level:
  12. pointers.c:54:17: error: expected ‘=’, ‘,’, ‘;’, ‘asm’ or ‘__attribute__’ before ‘int’
  13. pointers.c: In function ‘P_ptr_scan’:
  14. pointers.c:88:3: warning: implicit declaration of function ‘hex2c’
  15. pointers.c: At top level:
  16. pointers.c:5:20: warning: ‘hdigit’ defined but not used
  17. make[1]: *** [pointers.o] Error 1
  18. make[1]: Leaving directory `/home/ngg/ch24/c2411/final/trunk/problems/Common/libporty/src/libporty/host'
  19. make: *** [all] Error 2
RAW Paste Data
Top